ctakes-notifications mailing list archives

Site index · List index
Message view « Date » · « Thread »
Top « Date » · « Thread »
From Apache Jenkins Server <jenk...@builds.apache.org>
Subject Build failed in Jenkins: cTAKES-trunk-Java-1.8 #7
Date Mon, 02 Oct 2017 12:32:08 GMT
See <https://builds.apache.org/job/cTAKES-trunk-Java-1.8/7/display/redirect>

------------------------------------------
[...truncated 1.00 MB...]
log4j: Threshold ="null".
log4j: Retreiving an instance of org.apache.log4j.Logger.
log4j: Setting [ProgressAppender] additivity to [false].
log4j: Level value for ProgressAppender is  [INFO].
log4j: ProgressAppender level set to INFO
log4j: Class name: [org.apache.log4j.ConsoleAppender]
log4j: Parsing layout of class: "org.apache.log4j.PatternLayout"
log4j: Setting property [conversionPattern] to [%m].
log4j: Adding appender named [noEolAppender] to category [ProgressAppender].
log4j: Retreiving an instance of org.apache.log4j.Logger.
log4j: Setting [ProgressDone] additivity to [false].
log4j: Level value for ProgressDone is  [INFO].
log4j: ProgressDone level set to INFO
log4j: Class name: [org.apache.log4j.ConsoleAppender]
log4j: Parsing layout of class: "org.apache.log4j.PatternLayout"
log4j: Setting property [conversionPattern] to [%m%n].
log4j: Adding appender named [eolAppender] to category [ProgressDone].
log4j: Level value for root is  [INFO].
log4j: root level set to INFO
log4j: Class name: [org.apache.log4j.ConsoleAppender]
log4j: Parsing layout of class: "org.apache.log4j.PatternLayout"
log4j: Setting property [conversionPattern] to [%d{dd MMM yyyy HH:mm:ss} %5p %c{1} - %m%n].
log4j: Adding appender named [consoleAppender] to category [root].
02 Oct 2017 12:30:55  INFO RegressionPipelineTest - Creating directory: testdata/generatedoutput/RegressionPipelineCPETest
02 Oct 2017 12:30:55  INFO RegressionPipelineTest - Parsing CPE Descriptor:RegressionPipelineCPETest.xml
02 Oct 2017 12:30:56  INFO Chunker - Chunker model file: org/apache/ctakes/chunker/models/chunker-model.zip
02 Oct 2017 12:30:58  INFO ContextAnnotator - Using left , right scope sizes: 7 , 7
02 Oct 2017 12:30:58  INFO ContextAnnotator - Using scope order: LEFT,RIGHT
02 Oct 2017 12:30:58  INFO ContextAnnotator - SCOPE ORDER: [1, 3]
02 Oct 2017 12:30:58  INFO ContextAnnotator - Using context analyzer: org.apache.ctakes.necontexts.negation.NegationContextAnalyzer
02 Oct 2017 12:30:58  INFO NegationContextAnalyzer - initBoundaryData() called for ContextInitializer
02 Oct 2017 12:30:58  INFO ContextAnnotator - Using context consumer: org.apache.ctakes.necontexts.negation.NegationContextHitConsumer
02 Oct 2017 12:30:58  INFO ContextAnnotator - Using lookup window type: org.apache.ctakes.typesystem.type.textspan.Sentence
02 Oct 2017 12:30:58  INFO ContextAnnotator - Using focus type: org.apache.ctakes.typesystem.type.textsem.IdentifiedAnnotation
02 Oct 2017 12:30:58  INFO ContextAnnotator - Using context type: org.apache.ctakes.typesystem.type.syntax.BaseToken
02 Oct 2017 12:30:58  INFO SentenceDetector - Sentence detector model file: org/apache/ctakes/core/sentdetect/sd-med-model.zip
02 Oct 2017 12:30:58  INFO TokenizerAnnotatorPTB - Initializing org.apache.ctakes.core.ae.TokenizerAnnotatorPTB
02 Oct 2017 12:30:58  INFO POSTagger - POS tagger model file: org/apache/ctakes/postagger/models/mayo-pos.zip
02 Oct 2017 12:30:59  INFO ContextAnnotator - Using left , right scope sizes: 10 , 10
02 Oct 2017 12:30:59  INFO ContextAnnotator - Using scope order: LEFT,RIGHT
02 Oct 2017 12:30:59  INFO ContextAnnotator - SCOPE ORDER: [1, 3]
02 Oct 2017 12:30:59  INFO ContextAnnotator - Using context analyzer: org.apache.ctakes.necontexts.status.StatusContextAnalyzer
02 Oct 2017 12:30:59  INFO StatusContextAnalyzer - initBoundaryData() called for ContextInitializer
02 Oct 2017 12:30:59  INFO ContextAnnotator - Using context consumer: org.apache.ctakes.necontexts.status.StatusContextHitConsumer
02 Oct 2017 12:30:59  INFO ContextAnnotator - Using lookup window type: org.apache.ctakes.typesystem.type.textspan.Sentence
02 Oct 2017 12:30:59  INFO ContextAnnotator - Using focus type: org.apache.ctakes.typesystem.type.textsem.IdentifiedAnnotation
02 Oct 2017 12:30:59  INFO ContextAnnotator - Using context type: org.apache.ctakes.typesystem.type.syntax.BaseToken
02 Oct 2017 12:30:59  INFO ContextDependentTokenizerAnnotator - Finite state machines loaded.
02 Oct 2017 12:30:59  INFO AbstractJCasTermAnnotator - Using dictionary lookup window type:
org.apache.ctakes.typesystem.type.textspan.Sentence
02 Oct 2017 12:30:59  INFO AbstractJCasTermAnnotator - Exclusion tagset loaded: CC CD DT EX
IN LS MD PDT POS PP PP$ PRP PRP$ RP TO VB VBD VBG VBN VBP VBZ WDT WP WPS WRB 
02 Oct 2017 12:30:59  INFO AbstractJCasTermAnnotator - Using minimum term text span: 3
02 Oct 2017 12:30:59  INFO AbstractJCasTermAnnotator - Using Dictionary Descriptor: org/apache/ctakes/dictionary/lookup/fast/sno_rx_16ab.xml
02 Oct 2017 12:30:59  INFO DictionaryDescriptorParser - Parsing dictionary specifications:

02 Oct 2017 12:30:59 ERROR UmlsUserApprover -   User CHANGE_ME not allowed.  It is a placeholder
reminder.
02 Oct 2017 12:30:59 ERROR UmlsUserApprover -    Verify that you are setting command-line
option --user or ctakes property umlsUser or environment variable ctakes.umlsuser properly.
Tests run: 1, Failures: 0, Errors: 1, Skipped: 0, Time elapsed: 4.435 sec <<< FAILURE!

Results :

Tests in error: 
  testCPE(org.apache.ctakes.regression.test.RegressionPipelineTest): Initialization of CAS
Processor with name "RegressionPipelineAggregateTest" failed.  

Tests run: 1, Failures: 0, Errors: 1, Skipped: 0

[JENKINS] Recording test results
[JENKINS] Archiving disabled
[INFO] 
[INFO] ------------------------------------------------------------------------
[INFO] Building Apache cTAKES template filler 4.0.1-SNAPSHOT
[INFO] ------------------------------------------------------------------------
[INFO] 
[INFO] --- maven-clean-plugin:2.4.1:clean (default-clean) @ ctakes-template-filler ---
[INFO] 
[INFO] --- maven-remote-resources-plugin:1.4:process (default) @ ctakes-template-filler ---
[INFO] 
[INFO] --- maven-resources-plugin:2.5:resources (default-resources) @ ctakes-template-filler
---
[debug] execute contextualize
[INFO] Using 'UTF-8' encoding to copy filtered resources.
[INFO] Copying 0 resource
[INFO] Copying 3 resources
[INFO] 
[INFO] --- maven-compiler-plugin:2.4:compile (default-compile) @ ctakes-template-filler ---
[INFO] Compiling 1 source file to <https://builds.apache.org/job/cTAKES-trunk-Java-1.8/ws/ctakes-template-filler/target/classes>
[INFO] 
[INFO] --- maven-resources-plugin:2.5:testResources (default-testResources) @ ctakes-template-filler
---
[debug] execute contextualize
[INFO] Using 'UTF-8' encoding to copy filtered resources.
[INFO] Copying 0 resource
[INFO] Copying 3 resources
[INFO] 
[INFO] --- maven-compiler-plugin:2.4:testCompile (default-testCompile) @ ctakes-template-filler
---
[INFO] Nothing to compile - all classes are up to date
[INFO] 
[INFO] --- maven-surefire-plugin:2.12.1:test (default-test) @ ctakes-template-filler ---
[INFO] Surefire report directory: <https://builds.apache.org/job/cTAKES-trunk-Java-1.8/ws/ctakes-template-filler/target/surefire-reports>

-------------------------------------------------------
 T E S T S
-------------------------------------------------------

Results :

Tests run: 0, Failures: 0, Errors: 0, Skipped: 0

[JENKINS] Recording test results
[INFO] 
[INFO] --- maven-jar-plugin:2.4:jar (default-jar) @ ctakes-template-filler ---
[INFO] Building jar: <https://builds.apache.org/job/cTAKES-trunk-Java-1.8/ws/ctakes-template-filler/target/ctakes-template-filler-4.0.1-SNAPSHOT.jar>
[INFO] 
[INFO] --- maven-site-plugin:3.1:attach-descriptor (attach-descriptor) @ ctakes-template-filler
---
[INFO] 
[INFO] --- maven-install-plugin:2.3.1:install (default-install) @ ctakes-template-filler ---
[INFO] Installing <https://builds.apache.org/job/cTAKES-trunk-Java-1.8/ws/ctakes-template-filler/target/ctakes-template-filler-4.0.1-SNAPSHOT.jar>
to /home/jenkins/jenkins-slave/maven-repositories/1/org/apache/ctakes/ctakes-template-filler/4.0.1-SNAPSHOT/ctakes-template-filler-4.0.1-SNAPSHOT.jar
[INFO] Installing <https://builds.apache.org/job/cTAKES-trunk-Java-1.8/ws/ctakes-template-filler/pom.xml>
to /home/jenkins/jenkins-slave/maven-repositories/1/org/apache/ctakes/ctakes-template-filler/4.0.1-SNAPSHOT/ctakes-template-filler-4.0.1-SNAPSHOT.pom
[JENKINS] Archiving disabled
[JENKINS] Archiving disabled
[JENKINS] Archiving disabled
[JENKINS] Archiving disabled
[JENKINS] Archiving disabled
[JENKINS] Archiving disabled
[JENKINS] Archiving disabled
[JENKINS] Archiving disabled
[JENKINS] Archiving disabled
[JENKINS] Archiving disabled
[JENKINS] Archiving disabled
[JENKINS] Archiving disabled
[JENKINS] Archiving disabled
[JENKINS] Archiving disabled
[JENKINS] Archiving disabled
[JENKINS] Archiving disabled
[JENKINS] Archiving disabled
[JENKINS] Archiving disabled
[JENKINS] Archiving disabled
[JENKINS] Archiving disabled
[JENKINS] Archiving disabled
[JENKINS] Archiving disabled
[JENKINS] Archiving disabled
[JENKINS] Archiving disabled
[JENKINS] Archiving disabled
[JENKINS] Archiving disabled
[JENKINS] Archiving disabled
[JENKINS] Archiving disabled
[JENKINS] Archiving disabled
[JENKINS] Archiving disabled
[JENKINS] Archiving disabled
[JENKINS] Archiving disabled
[JENKINS] Archiving disabled
[JENKINS] Archiving disabled
[JENKINS] Archiving disabled
[JENKINS] Archiving disabled
[JENKINS] Archiving disabled
[JENKINS] Archiving disabled
[JENKINS] Archiving disabled
[JENKINS] Archiving disabled
[JENKINS] Archiving disabled
[JENKINS] Archiving disabled
[JENKINS] Archiving disabled
[JENKINS] Archiving disabled
[JENKINS] Archiving disabled
[JENKINS] Archiving disabled
[JENKINS] Archiving disabled
[JENKINS] Archiving disabled
[JENKINS] Archiving disabled
[JENKINS] Archiving disabled
[JENKINS] Archiving disabled
[JENKINS] Archiving disabled
[JENKINS] Archiving disabled
[INFO] ------------------------------------------------------------------------
[INFO] Reactor Summary:
[INFO] 
[INFO] Apache cTAKES ...................................... SUCCESS [  5.300 s]
[INFO] ctakes-gui-res ..................................... SUCCESS [  4.214 s]
[INFO] Apache cTAKES Resources core ....................... SUCCESS [  2.599 s]
[INFO] Apache cTAKES common type system ................... SUCCESS [  7.780 s]
[INFO] Apache cTAKES utils ................................ SUCCESS [  3.806 s]
[INFO] Apache cTAKES core ................................. SUCCESS [ 23.573 s]
[INFO] ctakes-gui ......................................... SUCCESS [  4.580 s]
[INFO] Apache cTAKES Resources pos-tagger ................. SUCCESS [  3.332 s]
[INFO] Apache cTAKES part-of-speech tagger ................ SUCCESS [  5.324 s]
[INFO] Apache cTAKES Resources ctakes-chunker-res ......... SUCCESS [  3.249 s]
[INFO] Apache cTAKES chunker .............................. SUCCESS [  3.465 s]
[INFO] Apache cTAKES document preprocessor ................ SUCCESS [  3.792 s]
[INFO] Apache cTAKES Resources dictionary-lookup .......... SUCCESS [ 10.251 s]
[INFO] Apache cTAKES dictionary lookup .................... SUCCESS [  4.869 s]
[INFO] Apache cTAKES context dependent tokenizer .......... SUCCESS [  4.922 s]
[INFO] Apache cTAKES Resources lvg ........................ SUCCESS [ 26.704 s]
[INFO] Apache cTAKES LVG lexical tools .................... SUCCESS [  4.670 s]
[INFO] Apache cTAKES Resources ne-contexts ................ SUCCESS [  3.433 s]
[INFO] Apache cTAKES named entity contexts ................ SUCCESS [  4.607 s]
[INFO] Apache cTAKES Resources constituency-parser ........ SUCCESS [  4.703 s]
[INFO] Apache cTAKES Constituency Parser .................. SUCCESS [  3.688 s]
[INFO] Apache cTAKES Resources coreference ................ SUCCESS [  6.929 s]
[INFO] Apache cTAKES Resources temporal ................... SUCCESS [  2.792 s]
[INFO] Apache cTAKES Resources relation-extractor ......... SUCCESS [  2.425 s]
[INFO] Apache cTAKES Resources dictionary-lookup-fast-res . SUCCESS [  3.099 s]
[INFO] Apache cTAKES dictionary lookup fast ............... SUCCESS [  3.390 s]
[INFO] Apache cTAKES Resources assertion .................. SUCCESS [  4.084 s]
[INFO] Apache cTAKES Resources dependency-parser .......... SUCCESS [ 24.169 s]
[INFO] Apache cTAKES Dependency Parser .................... SUCCESS [ 44.607 s]
[INFO] Apache cTAKES Assertion ............................ SUCCESS [  6.554 s]
[INFO] ctakes-clinical-pipeline-res ....................... SUCCESS [  2.326 s]
[INFO] Apache cTAKES ctakes-clinical-pipeline ............. SUCCESS [  6.674 s]
[INFO] Apache cTAKES Relation Extractor ................... SUCCESS [ 11.172 s]
[INFO] Apache cTAKES Temporal Information Extraction ...... SUCCESS [02:11 min]
[INFO] Apache cTAKES CoReference Resolver ................. SUCCESS [  8.664 s]
[INFO] Apache cTAKES Resources drug-ner ................... SUCCESS [  2.436 s]
[INFO] Apache cTAKES Drug NER ............................. SUCCESS [  7.070 s]
[INFO] Apache cTAKES Resources side-effect ................ SUCCESS [  2.568 s]
[INFO] Apache cTAKES Side Effects ......................... SUCCESS [  6.466 s]
[INFO] Apache cTAKES Resources smoking-status ............. SUCCESS [  2.505 s]
[INFO] Apache cTAKES Smoking Status ....................... SUCCESS [  6.531 s]
[INFO] Apache cTAKES Resources assertion-zoner ............ SUCCESS [  2.482 s]
[INFO] Apache cTAKES Assertion's zoner .................... SUCCESS [  2.967 s]
[INFO] ctakes-examples-res ................................ SUCCESS [  2.362 s]
[INFO] ctakes-examples .................................... SUCCESS [  8.810 s]
[INFO] Apache cTAKES Resources ctakes-ytex-res ............ SUCCESS [  2.414 s]
[INFO] Apache cTAKES YTEX ................................. FAILURE [01:10 min]
[INFO] Apache cTAKES YTEX UIMA ............................ SKIPPED
[INFO] Apache cTAKES YTEX Web ............................. SKIPPED
[INFO] Apache cTAKES Distribution ......................... SKIPPED
[INFO] Apache cTAKES Regression-test ...................... FAILURE [ 11.872 s]
[INFO] Apache cTAKES template filler ...................... SUCCESS [  7.551 s]
[INFO] ------------------------------------------------------------------------
[INFO] BUILD FAILURE
[INFO] ------------------------------------------------------------------------
[INFO] Total time: 10:32 min
[INFO] Finished at: 2017-10-02T12:31:45Z
[INFO] Final Memory: 126M/1528M
[INFO] ------------------------------------------------------------------------
[ERROR] Failed to execute goal org.apache.maven.plugins:maven-surefire-plugin:2.12.1:test
(surefire-it) on project ctakes-ytex: There are test failures.
[ERROR] 
[ERROR] Please refer to <https://builds.apache.org/job/cTAKES-trunk-Java-1.8/ws/ctakes-ytex/target/surefire-reports>
for the individual test results.
[ERROR] -> [Help 1]
[ERROR] Failed to execute goal org.apache.maven.plugins:maven-surefire-plugin:2.12.1:test
(default-test) on project ctakes-regression-test: There are test failures.
[ERROR] 
[ERROR] Please refer to <https://builds.apache.org/job/cTAKES-trunk-Java-1.8/ws/ctakes-regression-test/target/surefire-reports>
for the individual test results.
[ERROR] -> [Help 1]
[ERROR] 
[ERROR] To see the full stack trace of the errors, re-run Maven with the -e switch.
[ERROR] Re-run Maven using the -X switch to enable full debug logging.
[ERROR] 
[ERROR] For more information about the errors and possible solutions, please read the following
articles:
[ERROR] [Help 1] http://cwiki.apache.org/confluence/display/MAVEN/MojoFailureException
[ERROR] 
[ERROR] After correcting the problems, you can resume the build with the command
[ERROR]   mvn <goals> -rf :ctakes-ytex
Sending e-mails to: notifications@ctakes.apache.org
Sending e-mails to: notifications@ctakes.apache.org
channel stopped

Mime
View raw message