ctakes-notifications mailing list archives

Site index · List index
Message view « Date » · « Thread »
Top « Date » · « Thread »
From Apache Jenkins Server <jenk...@builds.apache.org>
Subject Build failed in Jenkins: ctakes-trunk-compiletest #1114
Date Wed, 25 Oct 2017 16:57:28 GMT
See <https://builds.apache.org/job/ctakes-trunk-compiletest/1114/display/redirect?page=changes>

Changes:

[seanfinan] Allow comma-separated semantic group codes in blacklist files.

[seanfinan] Change from deprecated FileLocator.locateFile(..) to getFile(..)
Remove use of deprecated getCasInitializer()

[seanfinan] CTAKES-470 : throw exception (and exit) if piper cannot be loaded.  Exceptions
saved to log file.

------------------------------------------
[...truncated 324.14 KB...]
A         ctakes-dictionary-lookup-fast-res/src/main/resources/org/apache
A         ctakes-dictionary-lookup-fast-res/src/main/resources/org/apache/ctakes
A         ctakes-dictionary-lookup-fast-res/src/main/resources/org/apache/ctakes/dictionary
A         ctakes-dictionary-lookup-fast-res/src/main/resources/org/apache/ctakes/dictionary/lookup
A         ctakes-dictionary-lookup-fast-res/src/main/resources/org/apache/ctakes/dictionary/lookup/fast
A         ctakes-dictionary-lookup-fast-res/src/main/resources/org/apache/ctakes/dictionary/lookup/fast/pipeline
A         ctakes-dictionary-lookup-fast-res/src/main/resources/org/apache/ctakes/dictionary/lookup/fast/pipeline/DictionarySubPipe.piper
A         ctakes-dictionary-lookup-fast-res/src/main/resources/org/apache/ctakes/dictionary/lookup/fast/example
A         ctakes-dictionary-lookup-fast-res/src/main/resources/org/apache/ctakes/dictionary/lookup/fast/example/bsv
A         ctakes-dictionary-lookup-fast-res/src/main/resources/org/apache/ctakes/dictionary/lookup/fast/example/bsv/custom_mixed_bsv.bsv
A         ctakes-dictionary-lookup-fast-res/src/main/resources/org/apache/ctakes/dictionary/lookup/fast/example/bsv/CustomCuiBsv.xml
A         ctakes-dictionary-lookup-fast-res/src/main/resources/org/apache/ctakes/dictionary/lookup/fast/example/bsv/CustomCuiTuiBsv.xml
A         ctakes-dictionary-lookup-fast-res/src/main/resources/org/apache/ctakes/dictionary/lookup/fast/example/bsv/CustomCuiTui2Bsv.xml
A         ctakes-dictionary-lookup-fast-res/src/main/resources/org/apache/ctakes/dictionary/lookup/fast/example/bsv/custom_cui_bsv.bsv
A         ctakes-dictionary-lookup-fast-res/src/main/resources/org/apache/ctakes/dictionary/lookup/fast/example/bsv/custom_cui_tui_bsv.bsv
A         ctakes-dictionary-lookup-fast-res/src/main/resources/org/apache/ctakes/dictionary/lookup/fast/example/bsv/custom_tui_bsv.bsv
A         ctakes-ne-contexts-res
A         ctakes-ne-contexts-res/src
A         ctakes-ne-contexts-res/src/test
A         ctakes-ne-contexts-res/src/main
A         ctakes-ne-contexts-res/src/main/resources
A         ctakes-ne-contexts-res/src/main/resources/org
A         ctakes-ne-contexts-res/src/main/resources/org/apache
A         ctakes-ne-contexts-res/src/main/resources/org/apache/ctakes
A         ctakes-ne-contexts-res/src/main/resources/org/apache/ctakes/necontexts
A         ctakes-ne-contexts-res/src/main/resources/org/apache/ctakes/necontexts/pipeline
A         ctakes-ne-contexts-res/src/main/resources/org/apache/ctakes/necontexts/pipeline/NeContextsSubPipe.piper
A         ctakes-ne-contexts-res/src/main/resources/org/apache/ctakes/necontexts/desc
A         ctakes-ne-contexts-res/src/main/resources/org/apache/ctakes/necontexts/desc/NegationAnnotator.xml
A         ctakes-ne-contexts-res/pom.xml
A         ctakes-ne-contexts-res/LICENSE
A         ctakes-dependency-parser-res
A         ctakes-dependency-parser-res/src
A         ctakes-dependency-parser-res/src/test
A         ctakes-dependency-parser-res/src/main
A         ctakes-dependency-parser-res/src/main/resources
A         ctakes-dependency-parser-res/src/main/resources/org
A         ctakes-dependency-parser-res/src/main/resources/org/apache
A         ctakes-dependency-parser-res/src/main/resources/org/apache/ctakes
A         ctakes-dependency-parser-res/src/main/resources/org/apache/ctakes/dependency
A         ctakes-dependency-parser-res/src/main/resources/org/apache/ctakes/dependency/parser
A         ctakes-dependency-parser-res/src/main/resources/org/apache/ctakes/dependency/parser/models
A         ctakes-dependency-parser-res/src/main/resources/org/apache/ctakes/dependency/parser/models/dependency
AU        ctakes-dependency-parser-res/src/main/resources/org/apache/ctakes/dependency/parser/models/dependency/mayo-en-dep-1.3.0.jar
A         ctakes-dependency-parser-res/src/main/resources/org/apache/ctakes/dependency/parser/models/dependency/README
A         ctakes-dependency-parser-res/src/main/resources/org/apache/ctakes/dependency/parser/models/srl
AU        ctakes-dependency-parser-res/src/main/resources/org/apache/ctakes/dependency/parser/models/srl/mayo-en-srl-1.3.0.jar
A         ctakes-dependency-parser-res/src/main/resources/org/apache/ctakes/dependency/parser/models/srl/README
AU        ctakes-dependency-parser-res/src/main/resources/org/apache/ctakes/dependency/parser/models/clearparser_models.jar
A         ctakes-dependency-parser-res/src/main/resources/org/apache/ctakes/dependency/parser/models/role
AU        ctakes-dependency-parser-res/src/main/resources/org/apache/ctakes/dependency/parser/models/role/mayo-en-role-1.3.0.jar
A         ctakes-dependency-parser-res/src/main/resources/org/apache/ctakes/dependency/parser/models/lemmatizer
A         ctakes-dependency-parser-res/src/main/resources/org/apache/ctakes/dependency/parser/models/lemmatizer/README
AU        ctakes-dependency-parser-res/src/main/resources/org/apache/ctakes/dependency/parser/models/lemmatizer/dictionary-1.3.1.jar
A         ctakes-dependency-parser-res/src/main/resources/org/apache/ctakes/dependency/parser/models/pred
AU        ctakes-dependency-parser-res/src/main/resources/org/apache/ctakes/dependency/parser/models/pred/mayo-en-pred-1.3.0.jar
A         ctakes-dependency-parser-res/pom.xml
A         ctakes-dependency-parser-res/LICENSE
A         ctakes-chunker
A         ctakes-chunker/data
A         ctakes-chunker/data/chunk
A         ctakes-chunker/data/chunk/genia
A         ctakes-chunker/data/chunk/genia/genia.opennlp.chunks
A         ctakes-chunker/data/chunk/genia/README
A         ctakes-chunker/data/chunk/combinations
A         ctakes-chunker/data/chunk/ptb
A         ctakes-chunker/data/chunk/ptb/README
A         ctakes-chunker/data/treebank
A         ctakes-chunker/data/treebank/genia
A         ctakes-chunker/data/treebank/genia/README
A         ctakes-chunker/data/treebank/genia/names-00.txt
A         ctakes-chunker/data/treebank/genia/00
A         ctakes-chunker/data/treebank/genia/names-01.txt
A         ctakes-chunker/data/treebank/genia/01
A         ctakes-chunker/pom.xml
A         ctakes-chunker/resources
A         ctakes-chunker/resources/launch
AU        ctakes-chunker/resources/launch/chunker.launch
AU        ctakes-chunker/resources/launch/UIMA_CPE_GUI--chunker.launch
AU        ctakes-chunker/resources/launch/ChunkAdjusterTests.launch
A         ctakes-chunker/README
A         ctakes-chunker/ExampleTrainChunker.bat
A         ctakes-chunker/desc
A         ctakes-chunker/desc/AdjustNounPhraseToIncludeFollowingNP.xml
A         ctakes-chunker/desc/AdjustNounPhraseToIncludeFollowingPPNP.xml
A         ctakes-chunker/desc/AdjustOPhraseToIncludeFollowingO.xml
A         ctakes-chunker/desc/ChunkerAggregate.xml
A         ctakes-chunker/desc/ChunkerCPE.xml
A         ctakes-chunker/desc/analysis_engine
A         ctakes-chunker/desc/ChunkAdjuster.xml
A         ctakes-chunker/desc/POSTagger.xml
A         ctakes-chunker/desc/AggregateAE.xml
A         ctakes-chunker/desc/collection_processing_engine
A         ctakes-chunker/desc/Chunker.xml
A         ctakes-chunker/desc/test
A         ctakes-chunker/desc/test/SimpleSegmentAnnotator.xml
A         ctakes-chunker/desc/test/AdjustNounPhraseToIncludeFollowingPPNP.xml
A         ctakes-chunker/desc/test/ChunkerAggregate.xml
A         ctakes-chunker/desc/test/ChunkerCPE.xml
A         ctakes-chunker/desc/test/POSTagger.xml
A         ctakes-chunker/desc/test/PhraseTypeChunkerAggregate.xml
A         ctakes-chunker/desc/test/Chunker.xml
A         ctakes-chunker/desc/test/TokenizerAnnotator.xml
A         ctakes-chunker/desc/test/ChunkAdjusterAggregate.xml
A         ctakes-chunker/desc/test/ChunkerCpeUsingPosTagDictionary.xml
A         ctakes-chunker/desc/SimpleSegmentAnnotator.xml
A         ctakes-chunker/LICENSE
A         ctakes-chunker/scripts
A         ctakes-chunker/scripts/java
A         ctakes-chunker/scripts/java/data
A         ctakes-chunker/scripts/java/data/chunk
A         ctakes-chunker/scripts/java/data/chunk/genia
A         ctakes-chunker/scripts/java/data/chunk/genia/Genia2PTB.java
A         ctakes-chunker/scripts/java/data/chunk/Chunklink2OpenNLP.java
A         ctakes-chunker/scripts/perl
A         ctakes-chunker/scripts/perl/README
A         ctakes-chunker/scripts/groovy
A         ctakes-chunker/scripts/groovy/data
A         ctakes-chunker/scripts/groovy/data/chunk
A         ctakes-chunker/scripts/groovy/data/chunk/TagReport.groovy
A         ctakes-chunker/src
A         ctakes-chunker/src/test
A         ctakes-chunker/src/test/resources
A         ctakes-chunker/src/test/resources/data
A         ctakes-chunker/src/test/resources/data/text-files
A         ctakes-chunker/src/test/resources/data/text-files/text1.txt
A         ctakes-chunker/src/test/resources/data/README
A         ctakes-chunker/src/test/resources/data/output
A         ctakes-chunker/src/test/resources/data/output/text1.txt.included.used.tag-dictionary.xml
A         ctakes-chunker/src/test/resources/data/output/NotesIIST_RTF.DTD
A         ctakes-chunker/src/test/resources/data/output/text1.txt.included.xml
A         ctakes-chunker/src/test/resources/data/unit-test.opennlp.chunks
A         ctakes-chunker/src/test/java
A         ctakes-chunker/src/test/java/org
A         ctakes-chunker/src/test/java/org/apache
A         ctakes-chunker/src/test/java/org/apache/ctakes
A         ctakes-chunker/src/test/java/org/apache/ctakes/chunker
A         ctakes-chunker/src/test/java/org/apache/ctakes/chunker/ChunkerTests.java
A         ctakes-chunker/src/test/java/org/apache/ctakes/chunker/ChunkAdjusterTests.java
A         ctakes-chunker/src/main
A         ctakes-chunker/src/main/java
A         ctakes-chunker/src/main/java/org
A         ctakes-chunker/src/main/java/org/apache
A         ctakes-chunker/src/main/java/org/apache/ctakes
A         ctakes-chunker/src/main/java/org/apache/ctakes/chunker
A         ctakes-chunker/src/main/java/org/apache/ctakes/chunker/ae
A         ctakes-chunker/src/main/java/org/apache/ctakes/chunker/ae/DefaultChunkCreator.java
A         ctakes-chunker/src/main/java/org/apache/ctakes/chunker/ae/PhraseTypeChunkCreator.java
A         ctakes-chunker/src/main/java/org/apache/ctakes/chunker/ae/Chunker.java
A         ctakes-chunker/src/main/java/org/apache/ctakes/chunker/ae/adjuster
A         ctakes-chunker/src/main/java/org/apache/ctakes/chunker/ae/adjuster/ChunkAdjuster.java
A         ctakes-chunker/src/main/java/org/apache/ctakes/chunker/ae/ChunkCreator.java
A         ctakes-pos-tagger-res
A         ctakes-pos-tagger-res/pom.xml
A         ctakes-pos-tagger-res/LICENSE
A         ctakes-pos-tagger-res/src
A         ctakes-pos-tagger-res/src/main
A         ctakes-pos-tagger-res/src/main/resources
A         ctakes-pos-tagger-res/src/main/resources/org
A         ctakes-pos-tagger-res/src/main/resources/org/apache
A         ctakes-pos-tagger-res/src/main/resources/org/apache/ctakes
A         ctakes-pos-tagger-res/src/main/resources/org/apache/ctakes/postagger
A         ctakes-pos-tagger-res/src/main/resources/org/apache/ctakes/postagger/models
AU        ctakes-pos-tagger-res/src/main/resources/org/apache/ctakes/postagger/models/mayo-pos.zip
A         ctakes-pos-tagger-res/src/main/resources/org/apache/ctakes/postagger/models/README
A         ctakes-pos-tagger-res/src/main/resources/org/apache/ctakes/postagger/models/clearnlp
AU        ctakes-pos-tagger-res/src/main/resources/org/apache/ctakes/postagger/models/clearnlp/mayo-en-pos-1.3.0.jar
A         ctakes-pos-tagger-res/src/test
AU        KEYS
 U        .
At revision 1813319

Parsing POMs
Modules changed, recalculating dependency graph
ERROR: Processing failed due to a bug in the code. Please report this to the issue tracker
(https://jenkins.io/redirect/report-an-issue).
hudson.remoting.RequestAbortedException: hudson.remoting.Channel$OrderlyShutdown: hudson.remoting.ProxyException:
java.util.concurrent.TimeoutException: Ping started at 1508950397103 hasn't completed by 1508950637134
	at hudson.remoting.Request.abort(Request.java:307)
	at hudson.remoting.Channel.terminate(Channel.java:905)
	at hudson.remoting.Channel$CloseCommand.execute(Channel.java:1138)
	at hudson.remoting.Channel$1.handle(Channel.java:535)
	at hudson.remoting.SynchronousCommandTransport$ReaderThread.run(SynchronousCommandTransport.java:83)
	at ......remote call to ubuntu-1(Native Method)
	at hudson.remoting.Channel.attachCallSiteStackTrace(Channel.java:1554)
	at hudson.remoting.Request.call(Request.java:172)
	at hudson.remoting.Channel.call(Channel.java:838)
	at hudson.FilePath.act(FilePath.java:987)
	at hudson.FilePath.act(FilePath.java:976)
	at hudson.FilePath.exists(FilePath.java:1441)
	at hudson.maven.MavenModuleSetBuild$MavenModuleSetBuildExecution.doRun(MavenModuleSetBuild.java:745)
	at hudson.model.AbstractBuild$AbstractBuildExecution.run(AbstractBuild.java:496)
	at hudson.model.Run.execute(Run.java:1737)
	at hudson.maven.MavenModuleSetBuild.run(MavenModuleSetBuild.java:543)
	at hudson.model.ResourceController.execute(ResourceController.java:97)
	at hudson.model.Executor.run(Executor.java:419)
Caused by: hudson.remoting.Channel$OrderlyShutdown: hudson.remoting.ProxyException: java.util.concurrent.TimeoutException:
Ping started at 1508950397103 hasn't completed by 1508950637134
	at hudson.remoting.Channel$CloseCommand.execute(Channel.java:1138)
	at hudson.remoting.Channel$1.handle(Channel.java:535)
	at hudson.remoting.SynchronousCommandTransport$ReaderThread.run(SynchronousCommandTransport.java:83)
Caused by: Command close created at
	at hudson.remoting.Command.<init>(Command.java:60)
	at hudson.remoting.Channel$CloseCommand.<init>(Channel.java:1132)
	at hudson.remoting.Channel$CloseCommand.<init>(Channel.java:1130)
	at hudson.remoting.Channel.close(Channel.java:1290)
	at hudson.slaves.ChannelPinger$1.onDead(ChannelPinger.java:180)
	at hudson.remoting.PingThread.ping(PingThread.java:130)
	at hudson.remoting.PingThread.run(PingThread.java:86)
Caused by: hudson.remoting.ProxyException: java.util.concurrent.TimeoutException: Ping started
at 1508950397103 hasn't completed by 1508950637134
	... 2 more
project=hudson.maven.MavenModuleSet@1f22e949[ctakes-trunk-compiletest]
project.getModules()=[hudson.maven.MavenModule@5102d47c[ctakes-trunk-compiletest/org.apache.ctakes:ctakes][ctakes-trunk-compiletest/org.apache.ctakes:ctakes][relativePath:],
hudson.maven.MavenModule@12f62c94[ctakes-trunk-compiletest/org.apache.ctakes:ctakes-assertion][ctakes-trunk-compiletest/org.apache.ctakes:ctakes-assertion][relativePath:ctakes-assertion],
hudson.maven.MavenModule@3f57f1a0[ctakes-trunk-compiletest/org.apache.ctakes:ctakes-assertion-res][ctakes-trunk-compiletest/org.apache.ctakes:ctakes-assertion-res][relativePath:ctakes-assertion-res],
hudson.maven.MavenModule@7094ade0[ctakes-trunk-compiletest/org.apache.ctakes:ctakes-assertion-zoner][ctakes-trunk-compiletest/org.apache.ctakes:ctakes-assertion-zoner][relativePath:ctakes-assertion-zoner],
hudson.maven.MavenModule@5768cbe7[ctakes-trunk-compiletest/org.apache.ctakes:ctakes-assertion-zoner-res][ctakes-trunk-compiletest/org.apache.ctakes:ctakes-assertion-zoner-res][relativePath:ctakes-assertion-zoner-res],
hudson.maven.MavenModule@844b590[ctakes-trunk-compiletest/org.apache.ctakes:ctakes-chunker][ctakes-trunk-compiletest/org.apache.ctakes:ctakes-chunker][relativePath:ctakes-chunker],
hudson.maven.MavenModule@7b5af825[ctakes-trunk-compiletest/org.apache.ctakes:ctakes-chunker-res][ctakes-trunk-compiletest/org.apache.ctakes:ctakes-chunker-res][relativePath:ctakes-chunker-res],
hudson.maven.MavenModule@2c31245a[ctakes-trunk-compiletest/org.apache.ctakes:ctakes-clinical-pipeline][ctakes-trunk-compiletest/org.apache.ctakes:ctakes-clinical-pipeline][relativePath:ctakes-clinical-pipeline],
hudson.maven.MavenModule@60e30d51[ctakes-trunk-compiletest/org.apache.ctakes:ctakes-clinical-pipeline-res][ctakes-trunk-compiletest/org.apache.ctakes:ctakes-clinical-pipeline-res][relativePath:ctakes-clinical-pipeline-res],
hudson.maven.MavenModule@39c443a6[ctakes-trunk-compiletest/org.apache.ctakes:ctakes-constituency-parser][ctakes-trunk-compiletest/org.apache.ctakes:ctakes-constituency-parser][relativePath:ctakes-constituency-parser],
hudson.maven.MavenModule@3f47934d[ctakes-trunk-compiletest/org.apache.ctakes:ctakes-constituency-parser-res][ctakes-trunk-compiletest/org.apache.ctakes:ctakes-constituency-parser-res][relativePath:ctakes-constituency-parser-res],
hudson.maven.MavenModule@9293931[ctakes-trunk-compiletest/org.apache.ctakes:ctakes-context-tokenizer][ctakes-trunk-compiletest/org.apache.ctakes:ctakes-context-tokenizer][relativePath:ctakes-context-tokenizer],
hudson.maven.MavenModule@54e37dd8[ctakes-trunk-compiletest/org.apache.ctakes:ctakes-core][ctakes-trunk-compiletest/org.apache.ctakes:ctakes-core][relativePath:ctakes-core],
hudson.maven.MavenModule@41e97a61[ctakes-trunk-compiletest/org.apache.ctakes:ctakes-core-res][ctakes-trunk-compiletest/org.apache.ctakes:ctakes-core-res][relativePath:ctakes-core-res],
hudson.maven.MavenModule@2b63a6ef[ctakes-trunk-compiletest/org.apache.ctakes:ctakes-coreference][ctakes-trunk-compiletest/org.apache.ctakes:ctakes-coreference][relativePath:ctakes-coreference],
hudson.maven.MavenModule@29b3d733[ctakes-trunk-compiletest/org.apache.ctakes:ctakes-coreference-res][ctakes-trunk-compiletest/org.apache.ctakes:ctakes-coreference-res][relativePath:ctakes-coreference-res],
hudson.maven.MavenModule@5a44851a[ctakes-trunk-compiletest/org.apache.ctakes:ctakes-dependency-parser][ctakes-trunk-compiletest/org.apache.ctakes:ctakes-dependency-parser][relativePath:ctakes-dependency-parser],
hudson.maven.MavenModule@3d9a9e5a[ctakes-trunk-compiletest/org.apache.ctakes:ctakes-dependency-parser-res][ctakes-trunk-compiletest/org.apache.ctakes:ctakes-dependency-parser-res][relativePath:ctakes-dependency-parser-res],
hudson.maven.MavenModule@7380ffd2[ctakes-trunk-compiletest/org.apache.ctakes:ctakes-dictionary-gui][ctakes-trunk-compiletest/org.apache.ctakes:ctakes-dictionary-gui][relativePath:ctakes-dictionary-gui],
hudson.maven.MavenModule@37881a1c[ctakes-trunk-compiletest/org.apache.ctakes:ctakes-dictionary-lookup][ctakes-trunk-compiletest/org.apache.ctakes:ctakes-dictionary-lookup][relativePath:ctakes-dictionary-lookup],
hudson.maven.MavenModule@4b2c7ec8[ctakes-trunk-compiletest/org.apache.ctakes:ctakes-dictionary-lookup-fast][ctakes-trunk-compiletest/org.apache.ctakes:ctakes-dictionary-lookup-fast][relativePath:ctakes-dictionary-lookup-fast],
hudson.maven.MavenModule@87fcf0b[ctakes-trunk-compiletest/org.apache.ctakes:ctakes-dictionary-lookup-fast-res][ctakes-trunk-compiletest/org.apache.ctakes:ctakes-dictionary-lookup-fast-res][relativePath:ctakes-dictionary-lookup-fast-res],
hudson.maven.MavenModule@44ec51b[ctakes-trunk-compiletest/org.apache.ctakes:ctakes-dictionary-lookup-res][ctakes-trunk-compiletest/org.apache.ctakes:ctakes-dictionary-lookup-res][relativePath:ctakes-dictionary-lookup-res],
hudson.maven.MavenModule@2ff75d2a[ctakes-trunk-compiletest/org.apache.ctakes:ctakes-dictionary-lookup2][ctakes-trunk-compiletest/org.apache.ctakes:ctakes-dictionary-lookup2][relativePath:ctakes-dictionary-lookup2],
hudson.maven.MavenModule@7f2bcc17[ctakes-trunk-compiletest/org.apache.ctakes:ctakes-dictionary-lookup2-res][ctakes-trunk-compiletest/org.apache.ctakes:ctakes-dictionary-lookup2-res][relativePath:ctakes-dictionary-lookup2-res],
hudson.maven.MavenModule@33655734[ctakes-trunk-compiletest/org.apache.ctakes:ctakes-distribution][ctakes-trunk-compiletest/org.apache.ctakes:ctakes-distribution][relativePath:ctakes-distribution],
hudson.maven.MavenModule@dc51c7e[ctakes-trunk-compiletest/org.apache.ctakes:ctakes-drug-ner][ctakes-trunk-compiletest/org.apache.ctakes:ctakes-drug-ner][relativePath:ctakes-drug-ner],
hudson.maven.MavenModule@63c4d63c[ctakes-trunk-compiletest/org.apache.ctakes:ctakes-drug-ner-res][ctakes-trunk-compiletest/org.apache.ctakes:ctakes-drug-ner-res][relativePath:ctakes-drug-ner-res],
hudson.maven.MavenModule@339526b[ctakes-trunk-compiletest/org.apache.ctakes:ctakes-examples][ctakes-trunk-compiletest/org.apache.ctakes:ctakes-examples][relativePath:ctakes-examples],
hudson.maven.MavenModule@4fb7162a[ctakes-trunk-compiletest/org.apache.ctakes:ctakes-examples-res][ctakes-trunk-compiletest/org.apache.ctakes:ctakes-examples-res][relativePath:ctakes-examples-res],
hudson.maven.MavenModule@7afa80a9[ctakes-trunk-compiletest/org.apache.ctakes:ctakes-gui][ctakes-trunk-compiletest/org.apache.ctakes:ctakes-gui][relativePath:ctakes-gui],
hudson.maven.MavenModule@19c2aa9e[ctakes-trunk-compiletest/org.apache.ctakes:ctakes-gui-res][ctakes-trunk-compiletest/org.apache.ctakes:ctakes-gui-res][relativePath:ctakes-gui-res],
hudson.maven.MavenModule@4bf7b43a[ctakes-trunk-compiletest/org.apache.ctakes:ctakes-lvg][ctakes-trunk-compiletest/org.apache.ctakes:ctakes-lvg][relativePath:ctakes-lvg],
hudson.maven.MavenModule@57450d8d[ctakes-trunk-compiletest/org.apache.ctakes:ctakes-lvg-res][ctakes-trunk-compiletest/org.apache.ctakes:ctakes-lvg-res][relativePath:ctakes-lvg-res],
hudson.maven.MavenModule@5d87e279[ctakes-trunk-compiletest/org.apache.ctakes:ctakes-ne-contexts][ctakes-trunk-compiletest/org.apache.ctakes:ctakes-ne-contexts][relativePath:ctakes-ne-contexts],
hudson.maven.MavenModule@7c8a2c23[ctakes-trunk-compiletest/org.apache.ctakes:ctakes-ne-contexts-res][ctakes-trunk-compiletest/org.apache.ctakes:ctakes-ne-contexts-res][relativePath:ctakes-ne-contexts-res],
hudson.maven.MavenModule@b811cbe[ctakes-trunk-compiletest/org.apache.ctakes:ctakes-pos-tagger][ctakes-trunk-compiletest/org.apache.ctakes:ctakes-pos-tagger][relativePath:ctakes-pos-tagger],
hudson.maven.MavenModule@68b772b5[ctakes-trunk-compiletest/org.apache.ctakes:ctakes-pos-tagger-res][ctakes-trunk-compiletest/org.apache.ctakes:ctakes-pos-tagger-res][relativePath:ctakes-pos-tagger-res],
hudson.maven.MavenModule@1a38a130[ctakes-trunk-compiletest/org.apache.ctakes:ctakes-preprocessor][ctakes-trunk-compiletest/org.apache.ctakes:ctakes-preprocessor][relativePath:ctakes-preprocessor],
hudson.maven.MavenModule@204b5c90[ctakes-trunk-compiletest/org.apache.ctakes:ctakes-regression-test][ctakes-trunk-compiletest/org.apache.ctakes:ctakes-regression-test][relativePath:ctakes-regression-test],
hudson.maven.MavenModule@183c18b9[ctakes-trunk-compiletest/org.apache.ctakes:ctakes-relation-extractor][ctakes-trunk-compiletest/org.apache.ctakes:ctakes-relation-extractor][relativePath:ctakes-relation-extractor],
hudson.maven.MavenModule@17daf7cf[ctakes-trunk-compiletest/org.apache.ctakes:ctakes-relation-extractor-res][ctakes-trunk-compiletest/org.apache.ctakes:ctakes-relation-extractor-res][relativePath:ctakes-relation-extractor-res],
hudson.maven.MavenModule@4aff4058[ctakes-trunk-compiletest/org.apache.ctakes:ctakes-side-effect][ctakes-trunk-compiletest/org.apache.ctakes:ctakes-side-effect][relativePath:ctakes-side-effect],
hudson.maven.MavenModule@53200abc[ctakes-trunk-compiletest/org.apache.ctakes:ctakes-side-effect-res][ctakes-trunk-compiletest/org.apache.ctakes:ctakes-side-effect-res][relativePath:ctakes-side-effect-res],
hudson.maven.MavenModule@1e0da563[ctakes-trunk-compiletest/org.apache.ctakes:ctakes-smoking-status][ctakes-trunk-compiletest/org.apache.ctakes:ctakes-smoking-status][relativePath:ctakes-smoking-status],
hudson.maven.MavenModule@4ee6e554[ctakes-trunk-compiletest/org.apache.ctakes:ctakes-smoking-status-res][ctakes-trunk-compiletest/org.apache.ctakes:ctakes-smoking-status-res][relativePath:ctakes-smoking-status-res],
hudson.maven.MavenModule@4ac3715e[ctakes-trunk-compiletest/org.apache.ctakes:ctakes-template-filler][ctakes-trunk-compiletest/org.apache.ctakes:ctakes-template-filler][relativePath:ctakes-template-filler],
hudson.maven.MavenModule@6fb5c471[ctakes-trunk-compiletest/org.apache.ctakes:ctakes-temporal][ctakes-trunk-compiletest/org.apache.ctakes:ctakes-temporal][relativePath:ctakes-temporal],
hudson.maven.MavenModule@443e5cf5[ctakes-trunk-compiletest/org.apache.ctakes:ctakes-temporal-res][ctakes-trunk-compiletest/org.apache.ctakes:ctakes-temporal-res][relativePath:ctakes-temporal-res],
hudson.maven.MavenModule@6cc9237d[ctakes-trunk-compiletest/org.apache.ctakes:ctakes-type-system][ctakes-trunk-compiletest/org.apache.ctakes:ctakes-type-system][relativePath:ctakes-type-system],
hudson.maven.MavenModule@325042d8[ctakes-trunk-compiletest/org.apache.ctakes:ctakes-utils][ctakes-trunk-compiletest/org.apache.ctakes:ctakes-utils][relativePath:ctakes-utils],
hudson.maven.MavenModule@27968bcf[ctakes-trunk-compiletest/org.apache.ctakes:ctakes-ytex][ctakes-trunk-compiletest/org.apache.ctakes:ctakes-ytex][relativePath:ctakes-ytex],
hudson.maven.MavenModule@17bfa21b[ctakes-trunk-compiletest/org.apache.ctakes:ctakes-ytex-res][ctakes-trunk-compiletest/org.apache.ctakes:ctakes-ytex-res][relativePath:ctakes-ytex-res],
hudson.maven.MavenModule@4c745771[ctakes-trunk-compiletest/org.apache.ctakes:ctakes-ytex-uima][ctakes-trunk-compiletest/org.apache.ctakes:ctakes-ytex-uima][relativePath:ctakes-ytex-uima],
hudson.maven.MavenModule@2211a7fa[ctakes-trunk-compiletest/org.apache.ctakes:ctakes-ytex-web][ctakes-trunk-compiletest/org.apache.ctakes:ctakes-ytex-web][relativePath:ctakes-ytex-web]]
project.getRootModule()=hudson.maven.MavenModule@5102d47c[ctakes-trunk-compiletest/org.apache.ctakes:ctakes][ctakes-trunk-compiletest/org.apache.ctakes:ctakes][relativePath:]
FATAL: hudson.remoting.Channel$OrderlyShutdown: hudson.remoting.ProxyException: java.util.concurrent.TimeoutException:
Ping started at 1508950397103 hasn't completed by 1508950637134
hudson.remoting.ProxyException: java.util.concurrent.TimeoutException: Ping started at 1508950397103
hasn't completed by 1508950637134
Caused: Command close created at
	at hudson.remoting.Command.<init>(Command.java:60)
	at hudson.remoting.Channel$CloseCommand.<init>(Channel.java:1132)
	at hudson.remoting.Channel$CloseCommand.<init>(Channel.java:1130)
	at hudson.remoting.Channel.close(Channel.java:1290)
	at hudson.slaves.ChannelPinger$1.onDead(ChannelPinger.java:180)
	at hudson.remoting.PingThread.ping(PingThread.java:130)
	at hudson.remoting.PingThread.run(PingThread.java:86)
Caused: hudson.remoting.Channel$OrderlyShutdown: hudson.remoting.ProxyException: java.util.concurrent.TimeoutException:
Ping started at 1508950397103 hasn't completed by 1508950637134
	at hudson.remoting.Channel$CloseCommand.execute(Channel.java:1138)
	at hudson.remoting.Channel$1.handle(Channel.java:535)
	at hudson.remoting.SynchronousCommandTransport$ReaderThread.run(SynchronousCommandTransport.java:83)
Caused: hudson.remoting.RequestAbortedException
	at hudson.remoting.Request.abort(Request.java:307)
	at hudson.remoting.Channel.terminate(Channel.java:905)
	at hudson.remoting.Channel$CloseCommand.execute(Channel.java:1138)
	at hudson.remoting.Channel$1.handle(Channel.java:535)
	at hudson.remoting.SynchronousCommandTransport$ReaderThread.run(SynchronousCommandTransport.java:83)
	at ......remote call to ubuntu-1(Native Method)
	at hudson.remoting.Channel.attachCallSiteStackTrace(Channel.java:1554)
	at hudson.remoting.Request.call(Request.java:172)
	at hudson.remoting.Channel.call(Channel.java:838)
	at hudson.FilePath.act(FilePath.java:987)
	at hudson.FilePath.act(FilePath.java:976)
	at hudson.FilePath.exists(FilePath.java:1441)
	at hudson.maven.MavenModuleSetBuild$MavenModuleSetBuildExecution.doRun(MavenModuleSetBuild.java:745)
	at hudson.model.AbstractBuild$AbstractBuildExecution.run(AbstractBuild.java:496)
	at hudson.model.Run.execute(Run.java:1737)
	at hudson.maven.MavenModuleSetBuild.run(MavenModuleSetBuild.java:543)
	at hudson.model.ResourceController.execute(ResourceController.java:97)
	at hudson.model.Executor.run(Executor.java:419)
ERROR: ubuntu-1 is offline; cannot locate JDK 1.8 (latest)
ERROR: ubuntu-1 is offline; cannot locate Maven 3.0.5
ERROR: ubuntu-1 is offline; cannot locate JDK 1.8 (latest)
ERROR: ubuntu-1 is offline; cannot locate Maven 3.0.5


Mime
View raw message