ctakes-notifications mailing list archives

Site index · List index
Message view « Date » · « Thread »
Top « Date » · « Thread »
From Apache Jenkins Server <jenk...@builds.apache.org>
Subject Build failed in Jenkins: cTAKES-trunk #2
Date Thu, 28 Sep 2017 22:05:07 GMT
See <https://builds.apache.org/job/cTAKES-trunk/2/display/redirect>

------------------------------------------
[...truncated 460.05 KB...]
[debug] execute contextualize
[INFO] Using 'UTF-8' encoding to copy filtered resources.
[INFO] Copying 58 resources
[INFO] Copying 3 resources
[INFO] 
[INFO] --- maven-compiler-plugin:2.4:compile (default-compile) @ ctakes-examples-res ---
[INFO] No sources to compile
[INFO] 
[INFO] --- maven-resources-plugin:2.5:testResources (default-testResources) @ ctakes-examples-res
---
[debug] execute contextualize
[INFO] Using 'UTF-8' encoding to copy filtered resources.
[INFO] skip non existing resourceDirectory <https://builds.apache.org/job/cTAKES-trunk/ws/ctakes-examples-res/src/test/resources>
[INFO] Copying 3 resources
[INFO] 
[INFO] --- maven-compiler-plugin:2.4:testCompile (default-testCompile) @ ctakes-examples-res
---
[INFO] No sources to compile
[INFO] 
[INFO] --- maven-surefire-plugin:2.12.1:test (default-test) @ ctakes-examples-res ---
[INFO] Surefire report directory: <https://builds.apache.org/job/cTAKES-trunk/ws/ctakes-examples-res/target/surefire-reports>

-------------------------------------------------------
 T E S T S
-------------------------------------------------------

Results :

Tests run: 0, Failures: 0, Errors: 0, Skipped: 0

[JENKINS] Recording test results
[INFO] 
[INFO] --- maven-jar-plugin:2.4:jar (default-jar) @ ctakes-examples-res ---
[INFO] Building jar: <https://builds.apache.org/job/cTAKES-trunk/ws/ctakes-examples-res/target/ctakes-examples-res-4.0.1-SNAPSHOT.jar>
[INFO] 
[INFO] --- maven-site-plugin:3.1:attach-descriptor (attach-descriptor) @ ctakes-examples-res
---
[INFO] 
[INFO] --- maven-install-plugin:2.3.1:install (default-install) @ ctakes-examples-res ---
[INFO] Installing <https://builds.apache.org/job/cTAKES-trunk/ws/ctakes-examples-res/target/ctakes-examples-res-4.0.1-SNAPSHOT.jar>
to /home/jenkins/jenkins-slave/maven-repositories/1/org/apache/ctakes/ctakes-examples-res/4.0.1-SNAPSHOT/ctakes-examples-res-4.0.1-SNAPSHOT.jar
[INFO] Installing <https://builds.apache.org/job/cTAKES-trunk/ws/ctakes-examples-res/pom.xml>
to /home/jenkins/jenkins-slave/maven-repositories/1/org/apache/ctakes/ctakes-examples-res/4.0.1-SNAPSHOT/ctakes-examples-res-4.0.1-SNAPSHOT.pom
[JENKINS] Archiving disabled
[INFO] 
[INFO] ------------------------------------------------------------------------
[INFO] Skipping ctakes-examples
[INFO] This project has been banned from the build due to previous failures.
[INFO] ------------------------------------------------------------------------
[INFO] 
[INFO] ------------------------------------------------------------------------
[INFO] Building Apache cTAKES Resources ctakes-ytex-res 4.0.1-SNAPSHOT
[INFO] ------------------------------------------------------------------------
[INFO] 
[INFO] --- maven-clean-plugin:2.4.1:clean (default-clean) @ ctakes-ytex-res ---
[INFO] 
[INFO] --- maven-remote-resources-plugin:1.4:process (default) @ ctakes-ytex-res ---
[INFO] 
[INFO] --- maven-resources-plugin:2.5:resources (default-resources) @ ctakes-ytex-res ---
[debug] execute contextualize
[INFO] Using 'UTF-8' encoding to copy filtered resources.
[INFO] Copying 48 resources
[INFO] Copying 3 resources
[INFO] 
[INFO] --- maven-compiler-plugin:2.4:compile (default-compile) @ ctakes-ytex-res ---
[INFO] No sources to compile
[INFO] 
[INFO] --- maven-resources-plugin:2.5:testResources (default-testResources) @ ctakes-ytex-res
---
[debug] execute contextualize
[INFO] Using 'UTF-8' encoding to copy filtered resources.
[INFO] Copying 0 resource
[INFO] Copying 3 resources
[INFO] 
[INFO] --- maven-compiler-plugin:2.4:testCompile (default-testCompile) @ ctakes-ytex-res ---
[INFO] No sources to compile
[INFO] 
[INFO] --- maven-surefire-plugin:2.12.1:test (default-test) @ ctakes-ytex-res ---
[INFO] Surefire report directory: <https://builds.apache.org/job/cTAKES-trunk/ws/ctakes-ytex-res/target/surefire-reports>

-------------------------------------------------------
 T E S T S
-------------------------------------------------------

Results :

Tests run: 0, Failures: 0, Errors: 0, Skipped: 0

[JENKINS] Recording test results
[INFO] 
[INFO] --- maven-jar-plugin:2.4:jar (default-jar) @ ctakes-ytex-res ---
[INFO] Building jar: <https://builds.apache.org/job/cTAKES-trunk/ws/ctakes-ytex-res/target/ctakes-ytex-res-4.0.1-SNAPSHOT.jar>
[INFO] 
[INFO] --- maven-site-plugin:3.1:attach-descriptor (attach-descriptor) @ ctakes-ytex-res ---
[INFO] 
[INFO] --- maven-install-plugin:2.3.1:install (default-install) @ ctakes-ytex-res ---
[INFO] Installing <https://builds.apache.org/job/cTAKES-trunk/ws/ctakes-ytex-res/target/ctakes-ytex-res-4.0.1-SNAPSHOT.jar>
to /home/jenkins/jenkins-slave/maven-repositories/1/org/apache/ctakes/ctakes-ytex-res/4.0.1-SNAPSHOT/ctakes-ytex-res-4.0.1-SNAPSHOT.jar
[INFO] Installing <https://builds.apache.org/job/cTAKES-trunk/ws/ctakes-ytex-res/pom.xml>
to /home/jenkins/jenkins-slave/maven-repositories/1/org/apache/ctakes/ctakes-ytex-res/4.0.1-SNAPSHOT/ctakes-ytex-res-4.0.1-SNAPSHOT.pom
[JENKINS] Archiving disabled
[INFO] 
[INFO] ------------------------------------------------------------------------
[INFO] Skipping Apache cTAKES YTEX
[INFO] This project has been banned from the build due to previous failures.
[INFO] ------------------------------------------------------------------------
[INFO] 
[INFO] ------------------------------------------------------------------------
[INFO] Skipping Apache cTAKES YTEX UIMA
[INFO] This project has been banned from the build due to previous failures.
[INFO] ------------------------------------------------------------------------
[INFO] 
[INFO] ------------------------------------------------------------------------
[INFO] Skipping Apache cTAKES YTEX Web
[INFO] This project has been banned from the build due to previous failures.
[INFO] ------------------------------------------------------------------------
[INFO] 
[INFO] ------------------------------------------------------------------------
[INFO] Skipping Apache cTAKES Distribution
[INFO] This project has been banned from the build due to previous failures.
[INFO] ------------------------------------------------------------------------
[INFO] 
[INFO] ------------------------------------------------------------------------
[INFO] Skipping Apache cTAKES Regression-test
[INFO] This project has been banned from the build due to previous failures.
[INFO] ------------------------------------------------------------------------
[INFO] 
[INFO] ------------------------------------------------------------------------
[INFO] Skipping Apache cTAKES template filler
[INFO] This project has been banned from the build due to previous failures.
[INFO] ------------------------------------------------------------------------
[JENKINS] Archiving disabled
[JENKINS] Archiving disabled
[JENKINS] Archiving disabled
[JENKINS] Archiving disabled
[JENKINS] Archiving disabled
[JENKINS] Archiving disabled
[JENKINS] Archiving disabled
[JENKINS] Archiving disabled
[JENKINS] Archiving disabled
[JENKINS] Archiving disabled
[JENKINS] Archiving disabled
[JENKINS] Archiving disabled
[JENKINS] Archiving disabled
[JENKINS] Archiving disabled
[JENKINS] Archiving disabled
[JENKINS] Archiving disabled
[JENKINS] Archiving disabled
[JENKINS] Archiving disabled
[JENKINS] Archiving disabled
[JENKINS] Archiving disabled
[JENKINS] Archiving disabled
[JENKINS] Archiving disabled
[JENKINS] Archiving disabled
[JENKINS] Archiving disabled
[JENKINS] Archiving disabled
[JENKINS] Archiving disabled
[JENKINS] Archiving disabled
[JENKINS] Archiving disabled
[JENKINS] Archiving disabled
[JENKINS] Archiving disabled
[JENKINS] Archiving disabled
[JENKINS] Archiving disabled
[JENKINS] Archiving disabled
[JENKINS] Archiving disabled
[JENKINS] Archiving disabled
[JENKINS] Archiving disabled
[JENKINS] Archiving disabled
[JENKINS] Archiving disabled
[JENKINS] Archiving disabled
[JENKINS] Archiving disabled
[JENKINS] Archiving disabled
[JENKINS] Archiving disabled
[JENKINS] Archiving disabled
[JENKINS] Archiving disabled
[JENKINS] Archiving disabled
[JENKINS] Archiving disabled
[JENKINS] Archiving disabled
[JENKINS] Archiving disabled
[JENKINS] Archiving disabled
[JENKINS] Archiving disabled
[JENKINS] Archiving disabled
[JENKINS] Archiving disabled
[INFO] ------------------------------------------------------------------------
[INFO] Reactor Summary:
[INFO] 
[INFO] Apache cTAKES ...................................... SUCCESS [  7.476 s]
[INFO] ctakes-gui-res ..................................... SUCCESS [  5.230 s]
[INFO] Apache cTAKES Resources core ....................... SUCCESS [  2.498 s]
[INFO] Apache cTAKES common type system ................... FAILURE [  4.381 s]
[INFO] Apache cTAKES utils ................................ SKIPPED
[INFO] Apache cTAKES core ................................. SKIPPED
[INFO] ctakes-gui ......................................... SKIPPED
[INFO] Apache cTAKES Resources pos-tagger ................. SUCCESS [  3.322 s]
[INFO] Apache cTAKES part-of-speech tagger ................ SKIPPED
[INFO] Apache cTAKES Resources ctakes-chunker-res ......... SUCCESS [  3.211 s]
[INFO] Apache cTAKES chunker .............................. SKIPPED
[INFO] Apache cTAKES document preprocessor ................ SKIPPED
[INFO] Apache cTAKES Resources dictionary-lookup .......... SUCCESS [ 21.705 s]
[INFO] Apache cTAKES dictionary lookup .................... SKIPPED
[INFO] Apache cTAKES context dependent tokenizer .......... SKIPPED
[INFO] Apache cTAKES Resources lvg ........................ SUCCESS [ 43.883 s]
[INFO] Apache cTAKES LVG lexical tools .................... SKIPPED
[INFO] Apache cTAKES Resources ne-contexts ................ SUCCESS [  2.413 s]
[INFO] Apache cTAKES named entity contexts ................ SKIPPED
[INFO] Apache cTAKES Resources constituency-parser ........ SKIPPED
[INFO] Apache cTAKES Constituency Parser .................. SKIPPED
[INFO] Apache cTAKES Resources coreference ................ SUCCESS [  6.575 s]
[INFO] Apache cTAKES Resources temporal ................... SUCCESS [  3.172 s]
[INFO] Apache cTAKES Resources relation-extractor ......... SUCCESS [  2.514 s]
[INFO] Apache cTAKES Resources dictionary-lookup-fast-res . SUCCESS [  3.948 s]
[INFO] Apache cTAKES dictionary lookup fast ............... SKIPPED
[INFO] Apache cTAKES Resources assertion .................. SKIPPED
[INFO] Apache cTAKES Resources dependency-parser .......... SUCCESS [ 20.740 s]
[INFO] Apache cTAKES Dependency Parser .................... SKIPPED
[INFO] Apache cTAKES Assertion ............................ SKIPPED
[INFO] ctakes-clinical-pipeline-res ....................... SUCCESS [  2.406 s]
[INFO] Apache cTAKES ctakes-clinical-pipeline ............. SKIPPED
[INFO] Apache cTAKES Relation Extractor ................... SKIPPED
[INFO] Apache cTAKES Temporal Information Extraction ...... SKIPPED
[INFO] Apache cTAKES CoReference Resolver ................. SKIPPED
[INFO] Apache cTAKES Resources drug-ner ................... SKIPPED
[INFO] Apache cTAKES Drug NER ............................. SKIPPED
[INFO] Apache cTAKES Resources side-effect ................ SKIPPED
[INFO] Apache cTAKES Side Effects ......................... SKIPPED
[INFO] Apache cTAKES Resources smoking-status ............. SKIPPED
[INFO] Apache cTAKES Smoking Status ....................... SKIPPED
[INFO] Apache cTAKES Resources assertion-zoner ............ SKIPPED
[INFO] Apache cTAKES Assertion's zoner .................... SKIPPED
[INFO] ctakes-examples-res ................................ SUCCESS [  2.826 s]
[INFO] ctakes-examples .................................... SKIPPED
[INFO] Apache cTAKES Resources ctakes-ytex-res ............ SUCCESS [  2.557 s]
[INFO] Apache cTAKES YTEX ................................. SKIPPED
[INFO] Apache cTAKES YTEX UIMA ............................ SKIPPED
[INFO] Apache cTAKES YTEX Web ............................. SKIPPED
[INFO] Apache cTAKES Distribution ......................... SKIPPED
[INFO] Apache cTAKES Regression-test ...................... SKIPPED
[INFO] Apache cTAKES template filler ...................... SKIPPED
[INFO] ------------------------------------------------------------------------
[INFO] BUILD FAILURE
[INFO] ------------------------------------------------------------------------
[INFO] Total time: 03:21 min
[INFO] Finished at: 2017-09-28T22:04:54Z
[INFO] Final Memory: 51M/972M
[INFO] ------------------------------------------------------------------------
[ERROR] Failed to execute goal org.apache.maven.plugins:maven-compiler-plugin:2.4:compile
(default-compile) on project ctakes-type-system: Fatal error compiling: tools.jar not found:
/usr/lib/jvm/java-8-openjdk-amd64/jre/../lib/tools.jar -> [Help 1]
[ERROR] 
[ERROR] To see the full stack trace of the errors, re-run Maven with the -e switch.
[ERROR] Re-run Maven using the -X switch to enable full debug logging.
[ERROR] 
[ERROR] For more information about the errors and possible solutions, please read the following
articles:
[ERROR] [Help 1] http://cwiki.apache.org/confluence/display/MAVEN/MojoExecutionException
[ERROR] 
[ERROR] After correcting the problems, you can resume the build with the command
[ERROR]   mvn <goals> -rf :ctakes-type-system
Sending e-mails to: notifications@ctakes.apache.org
channel stopped

Mime
View raw message