ctakes-notifications mailing list archives

Site index · List index
Message view « Date » · « Thread »
Top « Date » · « Thread »
From Apache Jenkins Server <jenk...@builds.apache.org>
Subject Build failed in Jenkins: ctakes-trunk-Java-1.9 » Apache cTAKES Temporal Information Extraction #2
Date Fri, 29 Sep 2017 18:17:45 GMT
See <https://builds.apache.org/job/ctakes-trunk-Java-1.9/org.apache.ctakes$ctakes-temporal/2/display/redirect>

------------------------------------------
[...truncated 23.93 KB...]
[WARNING] <https://builds.apache.org/job/ctakes-trunk-Java-1.9/org.apache.ctakes$ctakes-temporal/ws/src/main/java/org/apache/ctakes/temporal/ae/EventEventRelationSeedBasedAnnotator.java>:[149,27]
[unchecked] unchecked generic array creation for varargs parameter of type RelationFeaturesExtractor<IdentifiedAnnotation,IdentifiedAnnotation>[]
[WARNING] <https://builds.apache.org/job/ctakes-trunk-Java-1.9/org.apache.ctakes$ctakes-temporal/ws/src/main/java/org/apache/ctakes/temporal/ae/ContextualModalityAnnotator.java>:[100,8]
[unchecked] unchecked call to TypePathExtractor(Class<T>,String) as a member of the
raw type TypePathExtractor
[WARNING]   where T is a type-variable:
    T extends Annotation declared in class TypePathExtractor
<https://builds.apache.org/job/ctakes-trunk-Java-1.9/org.apache.ctakes$ctakes-temporal/ws/src/main/java/org/apache/ctakes/temporal/ae/ContextualModalityAnnotator.java>:[98,39]
[unchecked] unchecked call to CombinedExtractor1(FeatureExtractor1<T>,FeatureExtractor1<T>)
as a member of the raw type CombinedExtractor1
[WARNING]   where T is a type-variable:
    T extends Annotation declared in class CombinedExtractor1
<https://builds.apache.org/job/ctakes-trunk-Java-1.9/org.apache.ctakes$ctakes-temporal/ws/src/main/java/org/apache/ctakes/temporal/ae/ContextualModalityAnnotator.java>:[102,28]
[unchecked] unchecked call to CleartkExtractor(Class<SEARCH_T>,FeatureExtractor1<SEARCH_T>,Context...)
as a member of the raw type CleartkExtractor
[WARNING]   where SEARCH_T is a type-variable:
    SEARCH_T extends Annotation declared in class CleartkExtractor
<https://builds.apache.org/job/ctakes-trunk-Java-1.9/org.apache.ctakes$ctakes-temporal/ws/src/main/java/org/apache/ctakes/temporal/ae/ContextualModalityAnnotator.java>:[115,62]
[unchecked] unchecked call to extract(JCas,FOCUS_T) as a member of the raw type CleartkExtractor
[WARNING]   where FOCUS_T is a type-variable:
    FOCUS_T extends Annotation declared in class CleartkExtractor
<https://builds.apache.org/job/ctakes-trunk-Java-1.9/org.apache.ctakes$ctakes-temporal/ws/src/main/java/org/apache/ctakes/temporal/ae/ContextualModalityAnnotator.java>:[115,62]
[unchecked] unchecked conversion
[WARNING]   required: List<Feature>
  found:    List
<https://builds.apache.org/job/ctakes-trunk-Java-1.9/org.apache.ctakes$ctakes-temporal/ws/src/main/java/org/apache/ctakes/temporal/ae/EventEventI2B2RelationAnnotator.java>:[136,27]
[unchecked] unchecked generic array creation for varargs parameter of type RelationFeaturesExtractor<IdentifiedAnnotation,IdentifiedAnnotation>[]
[WARNING] <https://builds.apache.org/job/ctakes-trunk-Java-1.9/org.apache.ctakes$ctakes-temporal/ws/src/main/java/org/apache/ctakes/temporal/eval/EvaluationOfSelfEventTimeRelations.java>:[357,49]
[deprecation] createAnnotatorDescription(File) in EventTimeRelationAnnotator has been deprecated
[WARNING] <https://builds.apache.org/job/ctakes-trunk-Java-1.9/org.apache.ctakes$ctakes-temporal/ws/src/main/java/org/apache/ctakes/temporal/eval/EvaluationOfSelfEventTimeRelations.java>:[476,53]
[deprecation] createEngineDescription(File) in EventTimeSelfRelationAnnotator has been deprecated
[WARNING] <https://builds.apache.org/job/ctakes-trunk-Java-1.9/org.apache.ctakes$ctakes-temporal/ws/src/main/java/org/apache/ctakes/temporal/ae/TimexAdmissionTimeAnnotator.java>:[78,30]
[deprecation] createPrimitiveDescription(Class<? extends AnalysisComponent>,Object...)
in AnalysisEngineFactory has been deprecated
[WARNING] <https://builds.apache.org/job/ctakes-trunk-Java-1.9/org.apache.ctakes$ctakes-temporal/ws/src/main/java/org/apache/ctakes/temporal/ae/TimexAdmissionTimeAnnotator.java>:[90,30]
[deprecation] createPrimitiveDescription(Class<? extends AnalysisComponent>,Object...)
in AnalysisEngineFactory has been deprecated
[WARNING] <https://builds.apache.org/job/ctakes-trunk-Java-1.9/org.apache.ctakes$ctakes-temporal/ws/src/main/java/org/apache/ctakes/temporal/ae/TimexAdmissionTimeAnnotator.java>:[131,4]
[unchecked] unchecked call to TypePathExtractor(Class<T>,String) as a member of the
raw type TypePathExtractor
[WARNING]   where T is a type-variable:
    T extends Annotation declared in class TypePathExtractor
<https://builds.apache.org/job/ctakes-trunk-Java-1.9/org.apache.ctakes$ctakes-temporal/ws/src/main/java/org/apache/ctakes/temporal/ae/TimexAdmissionTimeAnnotator.java>:[129,37]
[unchecked] unchecked call to CombinedExtractor1(FeatureExtractor1<T>,FeatureExtractor1<T>)
as a member of the raw type CombinedExtractor1
[WARNING]   where T is a type-variable:
    T extends Annotation declared in class CombinedExtractor1
<https://builds.apache.org/job/ctakes-trunk-Java-1.9/org.apache.ctakes$ctakes-temporal/ws/src/main/java/org/apache/ctakes/temporal/ae/TimexAdmissionTimeAnnotator.java>:[132,26]
[unchecked] unchecked call to CleartkExtractor(Class<SEARCH_T>,FeatureExtractor1<SEARCH_T>,Context...)
as a member of the raw type CleartkExtractor
[WARNING]   where SEARCH_T is a type-variable:
    SEARCH_T extends Annotation declared in class CleartkExtractor
<https://builds.apache.org/job/ctakes-trunk-Java-1.9/org.apache.ctakes$ctakes-temporal/ws/src/main/java/org/apache/ctakes/temporal/ae/TimexAdmissionTimeAnnotator.java>:[198,58]
[unchecked] unchecked call to extract(JCas,FOCUS_T) as a member of the raw type CleartkExtractor
[WARNING]   where FOCUS_T is a type-variable:
    FOCUS_T extends Annotation declared in class CleartkExtractor
<https://builds.apache.org/job/ctakes-trunk-Java-1.9/org.apache.ctakes$ctakes-temporal/ws/src/main/java/org/apache/ctakes/temporal/ae/TimexAdmissionTimeAnnotator.java>:[198,58]
[unchecked] unchecked conversion
[WARNING]   required: List<Feature>
  found:    List
<https://builds.apache.org/job/ctakes-trunk-Java-1.9/org.apache.ctakes$ctakes-temporal/ws/src/main/java/org/apache/ctakes/temporal/eval/EvaluationOfEventEventCRFRelations.java>:[325,53]
[deprecation] createAnnotatorDescription(File) in EventEventCRFRelationAnnotator has been
deprecated
[WARNING] <https://builds.apache.org/job/ctakes-trunk-Java-1.9/org.apache.ctakes$ctakes-temporal/ws/src/main/java/org/apache/ctakes/temporal/ae/EventEventRelationGoldContainerAnnotator.java>:[148,27]
[unchecked] unchecked generic array creation for varargs parameter of type RelationFeaturesExtractor<IdentifiedAnnotation,IdentifiedAnnotation>[]
[WARNING] <https://builds.apache.org/job/ctakes-trunk-Java-1.9/org.apache.ctakes$ctakes-temporal/ws/src/main/java/org/apache/ctakes/temporal/ae/CRFTimeAnnotator.java>:[153,8]
[unchecked] unchecked call to TypePathExtractor(Class<T>,String) as a member of the
raw type TypePathExtractor
[WARNING]   where T is a type-variable:
    T extends Annotation declared in class TypePathExtractor
<https://builds.apache.org/job/ctakes-trunk-Java-1.9/org.apache.ctakes$ctakes-temporal/ws/src/main/java/org/apache/ctakes/temporal/ae/CRFTimeAnnotator.java>:[149,39]
[unchecked] unchecked call to CombinedExtractor1(FeatureExtractor1<T>,FeatureExtractor1<T>,FeatureExtractor1<T>)
as a member of the raw type CombinedExtractor1
[WARNING]   where T is a type-variable:
    T extends Annotation declared in class CombinedExtractor1
<https://builds.apache.org/job/ctakes-trunk-Java-1.9/org.apache.ctakes$ctakes-temporal/ws/src/main/java/org/apache/ctakes/temporal/ae/CRFTimeAnnotator.java>:[163,38]
[unchecked] unchecked call to CleartkExtractor(Class<SEARCH_T>,FeatureExtractor1<SEARCH_T>,Context...)
as a member of the raw type CleartkExtractor
[WARNING]   where SEARCH_T is a type-variable:
    SEARCH_T extends Annotation declared in class CleartkExtractor
<https://builds.apache.org/job/ctakes-trunk-Java-1.9/org.apache.ctakes$ctakes-temporal/ws/src/main/java/org/apache/ctakes/temporal/ae/CRFTimeAnnotator.java>:[200,43]
[unchecked] unchecked call to extract(JCas,T) as a member of the raw type FeatureExtractor1
[WARNING]   where T is a type-variable:
    T extends Annotation declared in interface FeatureExtractor1
<https://builds.apache.org/job/ctakes-trunk-Java-1.9/org.apache.ctakes$ctakes-temporal/ws/src/main/java/org/apache/ctakes/temporal/ae/CRFTimeAnnotator.java>:[200,25]
[unchecked] unchecked method invocation: method addAll in interface List is applied to given
types
[WARNING]   required: Collection<? extends E>
  found: List
  where E is a type-variable:
    E extends Object declared in interface List
<https://builds.apache.org/job/ctakes-trunk-Java-1.9/org.apache.ctakes$ctakes-temporal/ws/src/main/java/org/apache/ctakes/temporal/ae/CRFTimeAnnotator.java>:[200,43]
[unchecked] unchecked conversion
[WARNING]   required: Collection<? extends E>
  found:    List
  where E is a type-variable:
    E extends Object declared in interface List
<https://builds.apache.org/job/ctakes-trunk-Java-1.9/org.apache.ctakes$ctakes-temporal/ws/src/main/java/org/apache/ctakes/temporal/ae/CRFTimeAnnotator.java>:[204,49]
[unchecked] unchecked call to extractWithin(JCas,FOCUS_T,Annotation) as a member of the raw
type CleartkExtractor
[WARNING]   where FOCUS_T is a type-variable:
    FOCUS_T extends Annotation declared in class CleartkExtractor
<https://builds.apache.org/job/ctakes-trunk-Java-1.9/org.apache.ctakes$ctakes-temporal/ws/src/main/java/org/apache/ctakes/temporal/ae/CRFTimeAnnotator.java>:[204,25]
[unchecked] unchecked method invocation: method addAll in interface List is applied to given
types
[WARNING]   required: Collection<? extends E>
  found: List
  where E is a type-variable:
    E extends Object declared in interface List
<https://builds.apache.org/job/ctakes-trunk-Java-1.9/org.apache.ctakes$ctakes-temporal/ws/src/main/java/org/apache/ctakes/temporal/ae/CRFTimeAnnotator.java>:[204,49]
[unchecked] unchecked conversion
[WARNING]   required: Collection<? extends E>
  found:    List
  where E is a type-variable:
    E extends Object declared in interface List
<https://builds.apache.org/job/ctakes-trunk-Java-1.9/org.apache.ctakes$ctakes-temporal/ws/src/main/java/org/apache/ctakes/temporal/ae/feature/MultiTokenFeaturesExtractor.java>:[68,42]
[unchecked] unchecked call to CleartkExtractor(Class<SEARCH_T>,FeatureExtractor1<SEARCH_T>,Context...)
as a member of the raw type CleartkExtractor
[WARNING]   where SEARCH_T is a type-variable:
    SEARCH_T extends Annotation declared in class CleartkExtractor
<https://builds.apache.org/job/ctakes-trunk-Java-1.9/org.apache.ctakes$ctakes-temporal/ws/src/main/java/org/apache/ctakes/temporal/ae/feature/MultiTokenFeaturesExtractor.java>:[82,3]
[unchecked] unchecked call to CombinedExtractor1(FeatureExtractor1<T>,FeatureExtractor1<T>)
as a member of the raw type CombinedExtractor1
[WARNING]   where T is a type-variable:
    T extends Annotation declared in class CombinedExtractor1
<https://builds.apache.org/job/ctakes-trunk-Java-1.9/org.apache.ctakes$ctakes-temporal/ws/src/main/java/org/apache/ctakes/temporal/ae/feature/MultiTokenFeaturesExtractor.java>:[80,55]
[unchecked] unchecked call to NamingExtractor1(String,FeatureExtractor1<T>) as a member
of the raw type NamingExtractor1
[WARNING]   where T is a type-variable:
    T extends Annotation declared in class NamingExtractor1
<https://builds.apache.org/job/ctakes-trunk-Java-1.9/org.apache.ctakes$ctakes-temporal/ws/src/main/java/org/apache/ctakes/temporal/ae/feature/MultiTokenFeaturesExtractor.java>:[89,3]
[unchecked] unchecked call to CombinedExtractor1(FeatureExtractor1<T>,FeatureExtractor1<T>)
as a member of the raw type CombinedExtractor1
[WARNING]   where T is a type-variable:
    T extends Annotation declared in class CombinedExtractor1
<https://builds.apache.org/job/ctakes-trunk-Java-1.9/org.apache.ctakes$ctakes-temporal/ws/src/main/java/org/apache/ctakes/temporal/ae/feature/MultiTokenFeaturesExtractor.java>:[87,55]
[unchecked] unchecked call to NamingExtractor1(String,FeatureExtractor1<T>) as a member
of the raw type NamingExtractor1
[WARNING]   where T is a type-variable:
    T extends Annotation declared in class NamingExtractor1
<https://builds.apache.org/job/ctakes-trunk-Java-1.9/org.apache.ctakes$ctakes-temporal/ws/src/main/java/org/apache/ctakes/temporal/ae/feature/MultiTokenFeaturesExtractor.java>:[96,3]
[unchecked] unchecked call to NamingExtractor1(String,FeatureExtractor1<T>) as a member
of the raw type NamingExtractor1
[WARNING]   where T is a type-variable:
    T extends Annotation declared in class NamingExtractor1
<https://builds.apache.org/job/ctakes-trunk-Java-1.9/org.apache.ctakes$ctakes-temporal/ws/src/main/java/org/apache/ctakes/temporal/ae/feature/MultiTokenFeaturesExtractor.java>:[94,42]
[unchecked] unchecked call to CleartkExtractor(Class<SEARCH_T>,FeatureExtractor1<SEARCH_T>,Context...)
as a member of the raw type CleartkExtractor
[WARNING]   where SEARCH_T is a type-variable:
    SEARCH_T extends Annotation declared in class CleartkExtractor
<https://builds.apache.org/job/ctakes-trunk-Java-1.9/org.apache.ctakes$ctakes-temporal/ws/src/main/java/org/apache/ctakes/temporal/ae/feature/MultiTokenFeaturesExtractor.java>:[107,44]
[unchecked] unchecked call to DistanceExtractor(String,Class<? extends Annotation>)
as a member of the raw type DistanceExtractor
[WARNING] <https://builds.apache.org/job/ctakes-trunk-Java-1.9/org.apache.ctakes$ctakes-temporal/ws/src/main/java/org/apache/ctakes/temporal/ae/feature/MultiTokenFeaturesExtractor.java>:[154,57]
[unchecked] unchecked call to extract(JCas,T) as a member of the raw type FeatureExtractor1
[WARNING]   where T is a type-variable:
    T extends Annotation declared in interface FeatureExtractor1
<https://builds.apache.org/job/ctakes-trunk-Java-1.9/org.apache.ctakes$ctakes-temporal/ws/src/main/java/org/apache/ctakes/temporal/ae/feature/MultiTokenFeaturesExtractor.java>:[154,18]
[unchecked] unchecked method invocation: method addAll in interface List is applied to given
types
[WARNING]   required: Collection<? extends E>
  found: List
  where E is a type-variable:
    E extends Object declared in interface List
<https://builds.apache.org/job/ctakes-trunk-Java-1.9/org.apache.ctakes$ctakes-temporal/ws/src/main/java/org/apache/ctakes/temporal/ae/feature/MultiTokenFeaturesExtractor.java>:[154,57]
[unchecked] unchecked conversion
[WARNING]   required: Collection<? extends E>
  found:    List
  where E is a type-variable:
    E extends Object declared in interface List
<https://builds.apache.org/job/ctakes-trunk-Java-1.9/org.apache.ctakes$ctakes-temporal/ws/src/main/java/org/apache/ctakes/temporal/ae/feature/MultiTokenFeaturesExtractor.java>:[156,53]
[unchecked] unchecked call to extractBetween(JCas,FOCUS_T,FOCUS_T) as a member of the raw
type CleartkExtractor
[WARNING]   where FOCUS_T is a type-variable:
    FOCUS_T extends Annotation declared in class CleartkExtractor
<https://builds.apache.org/job/ctakes-trunk-Java-1.9/org.apache.ctakes$ctakes-temporal/ws/src/main/java/org/apache/ctakes/temporal/ae/feature/MultiTokenFeaturesExtractor.java>:[156,19]
[unchecked] unchecked method invocation: method addAll in interface List is applied to given
types
[WARNING]   required: Collection<? extends E>
  found: List
  where E is a type-variable:
    E extends Object declared in interface List
<https://builds.apache.org/job/ctakes-trunk-Java-1.9/org.apache.ctakes$ctakes-temporal/ws/src/main/java/org/apache/ctakes/temporal/ae/feature/MultiTokenFeaturesExtractor.java>:[156,53]
[unchecked] unchecked conversion
[WARNING]   required: Collection<? extends E>
  found:    List
  where E is a type-variable:
    E extends Object declared in interface List
<https://builds.apache.org/job/ctakes-trunk-Java-1.9/org.apache.ctakes$ctakes-temporal/ws/src/main/java/org/apache/ctakes/temporal/ae/feature/MultiTokenFeaturesExtractor.java>:[157,19]
[unchecked] unchecked method invocation: method addAll in interface List is applied to given
types
[WARNING]   required: Collection<? extends E>
  found: List
  where E is a type-variable:
    E extends Object declared in interface List
<https://builds.apache.org/job/ctakes-trunk-Java-1.9/org.apache.ctakes$ctakes-temporal/ws/src/main/java/org/apache/ctakes/temporal/ae/feature/MultiTokenFeaturesExtractor.java>:[157,47]
[unchecked] unchecked conversion
[WARNING]   required: Collection<? extends E>
  found:    List
  where E is a type-variable:
    E extends Object declared in interface List
<https://builds.apache.org/job/ctakes-trunk-Java-1.9/org.apache.ctakes$ctakes-temporal/ws/src/main/java/org/apache/ctakes/temporal/ae/feature/MultiTokenFeaturesExtractor.java>:[161,57]
[unchecked] unchecked call to extract(JCas,T) as a member of the raw type FeatureExtractor1
[WARNING]   where T is a type-variable:
    T extends Annotation declared in interface FeatureExtractor1
<https://builds.apache.org/job/ctakes-trunk-Java-1.9/org.apache.ctakes$ctakes-temporal/ws/src/main/java/org/apache/ctakes/temporal/ae/feature/MultiTokenFeaturesExtractor.java>:[161,18]
[unchecked] unchecked method invocation: method addAll in interface List is applied to given
types
[WARNING]   required: Collection<? extends E>
  found: List
  where E is a type-variable:
    E extends Object declared in interface List
<https://builds.apache.org/job/ctakes-trunk-Java-1.9/org.apache.ctakes$ctakes-temporal/ws/src/main/java/org/apache/ctakes/temporal/ae/feature/MultiTokenFeaturesExtractor.java>:[161,57]
[unchecked] unchecked conversion
[WARNING]   required: Collection<? extends E>
  found:    List
  where E is a type-variable:
    E extends Object declared in interface List
<https://builds.apache.org/job/ctakes-trunk-Java-1.9/org.apache.ctakes$ctakes-temporal/ws/src/main/java/org/apache/ctakes/temporal/ae/feature/UnexpandedTokenFeaturesExtractor.java>:[34,42]
[unchecked] unchecked call to CleartkExtractor(Class<SEARCH_T>,FeatureExtractor1<SEARCH_T>,Context...)
as a member of the raw type CleartkExtractor
[WARNING]   where SEARCH_T is a type-variable:
    SEARCH_T extends Annotation declared in class CleartkExtractor
<https://builds.apache.org/job/ctakes-trunk-Java-1.9/org.apache.ctakes$ctakes-temporal/ws/src/main/java/org/apache/ctakes/temporal/ae/feature/UnexpandedTokenFeaturesExtractor.java>:[48,3]
[unchecked] unchecked call to CombinedExtractor1(FeatureExtractor1<T>,FeatureExtractor1<T>)
as a member of the raw type CombinedExtractor1
[WARNING]   where T is a type-variable:
    T extends Annotation declared in class CombinedExtractor1
<https://builds.apache.org/job/ctakes-trunk-Java-1.9/org.apache.ctakes$ctakes-temporal/ws/src/main/java/org/apache/ctakes/temporal/ae/feature/UnexpandedTokenFeaturesExtractor.java>:[46,55]
[unchecked] unchecked call to NamingExtractor1(String,FeatureExtractor1<T>) as a member
of the raw type NamingExtractor1
[WARNING]   where T is a type-variable:
    T extends Annotation declared in class NamingExtractor1
<https://builds.apache.org/job/ctakes-trunk-Java-1.9/org.apache.ctakes$ctakes-temporal/ws/src/main/java/org/apache/ctakes/temporal/ae/feature/UnexpandedTokenFeaturesExtractor.java>:[55,3]
[unchecked] unchecked call to CombinedExtractor1(FeatureExtractor1<T>,FeatureExtractor1<T>)
as a member of the raw type CombinedExtractor1
[WARNING]   where T is a type-variable:
    T extends Annotation declared in class CombinedExtractor1
<https://builds.apache.org/job/ctakes-trunk-Java-1.9/org.apache.ctakes$ctakes-temporal/ws/src/main/java/org/apache/ctakes/temporal/ae/feature/UnexpandedTokenFeaturesExtractor.java>:[53,55]
[unchecked] unchecked call to NamingExtractor1(String,FeatureExtractor1<T>) as a member
of the raw type NamingExtractor1
[WARNING]   where T is a type-variable:
    T extends Annotation declared in class NamingExtractor1
<https://builds.apache.org/job/ctakes-trunk-Java-1.9/org.apache.ctakes$ctakes-temporal/ws/src/main/java/org/apache/ctakes/temporal/ae/feature/UnexpandedTokenFeaturesExtractor.java>:[62,3]
[unchecked] unchecked call to NamingExtractor1(String,FeatureExtractor1<T>) as a member
of the raw type NamingExtractor1
[WARNING]   where T is a type-variable:
    T extends Annotation declared in class NamingExtractor1
<https://builds.apache.org/job/ctakes-trunk-Java-1.9/org.apache.ctakes$ctakes-temporal/ws/src/main/java/org/apache/ctakes/temporal/ae/feature/UnexpandedTokenFeaturesExtractor.java>:[60,42]
[unchecked] unchecked call to CleartkExtractor(Class<SEARCH_T>,FeatureExtractor1<SEARCH_T>,Context...)
as a member of the raw type CleartkExtractor
[WARNING]   where SEARCH_T is a type-variable:
    SEARCH_T extends Annotation declared in class CleartkExtractor
<https://builds.apache.org/job/ctakes-trunk-Java-1.9/org.apache.ctakes$ctakes-temporal/ws/src/main/java/org/apache/ctakes/temporal/ae/feature/UnexpandedTokenFeaturesExtractor.java>:[70,44]
[unchecked] unchecked call to DistanceExtractor(String,Class<? extends Annotation>)
as a member of the raw type DistanceExtractor
[WARNING] <https://builds.apache.org/job/ctakes-trunk-Java-1.9/org.apache.ctakes$ctakes-temporal/ws/src/main/java/org/apache/ctakes/temporal/ae/feature/UnexpandedTokenFeaturesExtractor.java>:[81,56]
[unchecked] unchecked call to extract(JCas,T) as a member of the raw type FeatureExtractor1
[WARNING]   where T is a type-variable:
    T extends Annotation declared in interface FeatureExtractor1
<https://builds.apache.org/job/ctakes-trunk-Java-1.9/org.apache.ctakes$ctakes-temporal/ws/src/main/java/org/apache/ctakes/temporal/ae/feature/UnexpandedTokenFeaturesExtractor.java>:[81,17]
[unchecked] unchecked method invocation: method addAll in interface List is applied to given
types
[INFO] 
[INFO] --- maven-resources-plugin:2.5:testResources (default-testResources) @ ctakes-temporal
---
[debug] execute contextualize
[INFO] Using 'UTF-8' encoding to copy filtered resources.
[INFO] skip non existing resourceDirectory <https://builds.apache.org/job/ctakes-trunk-Java-1.9/org.apache.ctakes$ctakes-temporal/ws/src/test/resources>
[INFO] Copying 3 resources
[INFO] 
[INFO] --- maven-compiler-plugin:2.4:testCompile (default-testCompile) @ ctakes-temporal ---
[INFO] Compiling 7 source files to <https://builds.apache.org/job/ctakes-trunk-Java-1.9/org.apache.ctakes$ctakes-temporal/ws/target/test-classes>
[INFO] 
[INFO] --- maven-surefire-plugin:2.12.1:test (default-test) @ ctakes-temporal ---
[INFO] Surefire report directory: <https://builds.apache.org/job/ctakes-trunk-Java-1.9/org.apache.ctakes$ctakes-temporal/ws/target/surefire-reports>

-------------------------------------------------------
 T E S T S
-------------------------------------------------------
Running org.apache.ctakes.temporal.ae.BackwardsTimeAnnotatorTest
log4j: reset attribute= "false".
log4j: Threshold ="null".
log4j: Retreiving an instance of org.apache.log4j.Logger.
log4j: Setting [ProgressAppender] additivity to [false].
log4j: Level value for ProgressAppender is  [INFO].
log4j: ProgressAppender level set to INFO
log4j: Class name: [org.apache.log4j.ConsoleAppender]
log4j: Parsing layout of class: "org.apache.log4j.PatternLayout"
log4j: Setting property [conversionPattern] to [%m].
log4j: Adding appender named [noEolAppender] to category [ProgressAppender].
log4j: Retreiving an instance of org.apache.log4j.Logger.
log4j: Setting [ProgressDone] additivity to [false].
log4j: Level value for ProgressDone is  [INFO].
log4j: ProgressDone level set to INFO
log4j: Class name: [org.apache.log4j.ConsoleAppender]
log4j: Parsing layout of class: "org.apache.log4j.PatternLayout"
log4j: Setting property [conversionPattern] to [%m%n].
log4j: Adding appender named [eolAppender] to category [ProgressDone].
log4j: Level value for root is  [INFO].
log4j: root level set to INFO
log4j: Class name: [org.apache.log4j.ConsoleAppender]
log4j: Parsing layout of class: "org.apache.log4j.PatternLayout"
log4j: Setting property [conversionPattern] to [%d{dd MMM yyyy HH:mm:ss} %5p %c{1} - %m%n].
log4j: Adding appender named [consoleAppender] to category [root].
29 Sep 2017 18:16:00  INFO LvgAnnotator - URL for lvg.properties =file:/home/jenkins/jenkins-slave/maven-repositories/1/net/sourceforge/ctakesresources/ctakes-resources-lvg2008/4.0.0/ctakes-resources-lvg2008-4.0.0.jar!/org/apache/ctakes/lvg/data/config/lvg.properties
29 Sep 2017 18:16:02  INFO SentenceDetector - Sentence detector model file: org/apache/ctakes/core/sentdetect/sd-med-model.zip
29 Sep 2017 18:16:03  INFO TokenizerAnnotatorPTB - Initializing org.apache.ctakes.core.ae.TokenizerAnnotatorPTB
Tests run: 1, Failures: 0, Errors: 1, Skipped: 0, Time elapsed: 4.852 sec <<< FAILURE!
Running org.apache.ctakes.temporal.ae.EventTimeRelationAnnotatorTest
29 Sep 2017 18:16:03  INFO LvgAnnotator - URL for lvg.properties =file:/home/jenkins/jenkins-slave/maven-repositories/1/net/sourceforge/ctakesresources/ctakes-resources-lvg2008/4.0.0/ctakes-resources-lvg2008-4.0.0.jar!/org/apache/ctakes/lvg/data/config/lvg.properties
29 Sep 2017 18:16:05  INFO SentenceDetector - Sentence detector model file: org/apache/ctakes/core/sentdetect/sd-med-model.zip
29 Sep 2017 18:16:05  INFO TokenizerAnnotatorPTB - Initializing org.apache.ctakes.core.ae.TokenizerAnnotatorPTB
Tests run: 1, Failures: 0, Errors: 1, Skipped: 0, Time elapsed: 2.35 sec <<< FAILURE!
Running org.apache.ctakes.temporal.ae.EventEventRelationAnnotatorTest
29 Sep 2017 18:16:06  INFO LvgAnnotator - URL for lvg.properties =file:/home/jenkins/jenkins-slave/maven-repositories/1/net/sourceforge/ctakesresources/ctakes-resources-lvg2008/4.0.0/ctakes-resources-lvg2008-4.0.0.jar!/org/apache/ctakes/lvg/data/config/lvg.properties
29 Sep 2017 18:16:07  INFO SentenceDetector - Sentence detector model file: org/apache/ctakes/core/sentdetect/sd-med-model.zip
29 Sep 2017 18:16:07  INFO TokenizerAnnotatorPTB - Initializing org.apache.ctakes.core.ae.TokenizerAnnotatorPTB
Tests run: 1, Failures: 0, Errors: 1, Skipped: 0, Time elapsed: 2.088 sec <<< FAILURE!
Running org.apache.ctakes.temporal.ae.EventAnnotatorTest
29 Sep 2017 18:16:08  INFO LvgAnnotator - URL for lvg.properties =file:/home/jenkins/jenkins-slave/maven-repositories/1/net/sourceforge/ctakesresources/ctakes-resources-lvg2008/4.0.0/ctakes-resources-lvg2008-4.0.0.jar!/org/apache/ctakes/lvg/data/config/lvg.properties
29 Sep 2017 18:16:08  INFO SentenceDetector - Sentence detector model file: org/apache/ctakes/core/sentdetect/sd-med-model.zip
29 Sep 2017 18:16:09  INFO TokenizerAnnotatorPTB - Initializing org.apache.ctakes.core.ae.TokenizerAnnotatorPTB
Tests run: 1, Failures: 0, Errors: 1, Skipped: 0, Time elapsed: 1.502 sec <<< FAILURE!
Running org.apache.ctakes.temporal.ae.ContextualModalityAnnotatorTest
29 Sep 2017 18:16:09  INFO LvgAnnotator - URL for lvg.properties =file:/home/jenkins/jenkins-slave/maven-repositories/1/net/sourceforge/ctakesresources/ctakes-resources-lvg2008/4.0.0/ctakes-resources-lvg2008-4.0.0.jar!/org/apache/ctakes/lvg/data/config/lvg.properties
29 Sep 2017 18:16:10  INFO SentenceDetector - Sentence detector model file: org/apache/ctakes/core/sentdetect/sd-med-model.zip
29 Sep 2017 18:16:10  INFO TokenizerAnnotatorPTB - Initializing org.apache.ctakes.core.ae.TokenizerAnnotatorPTB
Tests run: 1, Failures: 0, Errors: 1, Skipped: 0, Time elapsed: 1.825 sec <<< FAILURE!

Results :

Tests in error: 
  testPipeline(org.apache.ctakes.temporal.ae.BackwardsTimeAnnotatorTest): URI is not hierarchical
  testPipeline(org.apache.ctakes.temporal.ae.EventTimeRelationAnnotatorTest): URI is not hierarchical
  testPipeline(org.apache.ctakes.temporal.ae.EventEventRelationAnnotatorTest): URI is not
hierarchical
  testPipeline(org.apache.ctakes.temporal.ae.EventAnnotatorTest): URI is not hierarchical
  testPipeline(org.apache.ctakes.temporal.ae.ContextualModalityAnnotatorTest): URI is not
hierarchical

Tests run: 5, Failures: 0, Errors: 5, Skipped: 0

[JENKINS] Recording test results
[JENKINS] Archiving disabled

Mime
View raw message