ctakes-notifications mailing list archives

Site index · List index
Message view « Date » · « Thread »
Top « Date » · « Thread »
From Apache Jenkins Server <jenk...@builds.apache.org>
Subject Build failed in Jenkins: cTAKES-trunk #3
Date Thu, 28 Sep 2017 23:01:23 GMT
See <https://builds.apache.org/job/cTAKES-trunk/3/display/redirect>

------------------------------------------
[...truncated 984.19 KB...]
log4j: Parsing layout of class: "org.apache.log4j.PatternLayout"
log4j: Setting property [conversionPattern] to [%m].
log4j: Adding appender named [noEolAppender] to category [ProgressAppender].
log4j: Retreiving an instance of org.apache.log4j.Logger.
log4j: Setting [ProgressDone] additivity to [false].
log4j: Level value for ProgressDone is  [INFO].
log4j: ProgressDone level set to INFO
log4j: Class name: [org.apache.log4j.ConsoleAppender]
log4j: Parsing layout of class: "org.apache.log4j.PatternLayout"
log4j: Setting property [conversionPattern] to [%m%n].
log4j: Adding appender named [eolAppender] to category [ProgressDone].
log4j: Level value for root is  [INFO].
log4j: root level set to INFO
log4j: Class name: [org.apache.log4j.ConsoleAppender]
log4j: Parsing layout of class: "org.apache.log4j.PatternLayout"
log4j: Setting property [conversionPattern] to [%d{dd MMM yyyy HH:mm:ss} %5p %c{1} - %m%n].
log4j: Adding appender named [consoleAppender] to category [root].
28 Sep 2017 23:00:51  INFO RegressionPipelineTest - Creating directory: testdata/generatedoutput/RegressionPipelineCPETest
28 Sep 2017 23:00:51  INFO RegressionPipelineTest - Parsing CPE Descriptor:RegressionPipelineCPETest.xml
28 Sep 2017 23:00:53  INFO Chunker - Chunker model file: org/apache/ctakes/chunker/models/chunker-model.zip
28 Sep 2017 23:00:56  INFO ContextAnnotator - Using left , right scope sizes: 7 , 7
28 Sep 2017 23:00:56  INFO ContextAnnotator - Using scope order: LEFT,RIGHT
28 Sep 2017 23:00:56  INFO ContextAnnotator - SCOPE ORDER: [1, 3]
28 Sep 2017 23:00:56  INFO ContextAnnotator - Using context analyzer: org.apache.ctakes.necontexts.negation.NegationContextAnalyzer
28 Sep 2017 23:00:56  INFO NegationContextAnalyzer - initBoundaryData() called for ContextInitializer
28 Sep 2017 23:00:56  INFO ContextAnnotator - Using context consumer: org.apache.ctakes.necontexts.negation.NegationContextHitConsumer
28 Sep 2017 23:00:56  INFO ContextAnnotator - Using lookup window type: org.apache.ctakes.typesystem.type.textspan.Sentence
28 Sep 2017 23:00:56  INFO ContextAnnotator - Using focus type: org.apache.ctakes.typesystem.type.textsem.IdentifiedAnnotation
28 Sep 2017 23:00:56  INFO ContextAnnotator - Using context type: org.apache.ctakes.typesystem.type.syntax.BaseToken
28 Sep 2017 23:00:56  INFO SentenceDetector - Sentence detector model file: org/apache/ctakes/core/sentdetect/sd-med-model.zip
28 Sep 2017 23:00:56  INFO TokenizerAnnotatorPTB - Initializing org.apache.ctakes.core.ae.TokenizerAnnotatorPTB
28 Sep 2017 23:00:56  INFO POSTagger - POS tagger model file: org/apache/ctakes/postagger/models/mayo-pos.zip
28 Sep 2017 23:00:57  INFO ContextAnnotator - Using left , right scope sizes: 10 , 10
28 Sep 2017 23:00:57  INFO ContextAnnotator - Using scope order: LEFT,RIGHT
28 Sep 2017 23:00:57  INFO ContextAnnotator - SCOPE ORDER: [1, 3]
28 Sep 2017 23:00:57  INFO ContextAnnotator - Using context analyzer: org.apache.ctakes.necontexts.status.StatusContextAnalyzer
28 Sep 2017 23:00:57  INFO StatusContextAnalyzer - initBoundaryData() called for ContextInitializer
28 Sep 2017 23:00:57  INFO ContextAnnotator - Using context consumer: org.apache.ctakes.necontexts.status.StatusContextHitConsumer
28 Sep 2017 23:00:57  INFO ContextAnnotator - Using lookup window type: org.apache.ctakes.typesystem.type.textspan.Sentence
28 Sep 2017 23:00:57  INFO ContextAnnotator - Using focus type: org.apache.ctakes.typesystem.type.textsem.IdentifiedAnnotation
28 Sep 2017 23:00:57  INFO ContextAnnotator - Using context type: org.apache.ctakes.typesystem.type.syntax.BaseToken
28 Sep 2017 23:00:57  INFO ContextDependentTokenizerAnnotator - Finite state machines loaded.
28 Sep 2017 23:00:57  INFO AbstractJCasTermAnnotator - Using dictionary lookup window type:
org.apache.ctakes.typesystem.type.textspan.Sentence
28 Sep 2017 23:00:57  INFO AbstractJCasTermAnnotator - Exclusion tagset loaded: CC CD DT EX
IN LS MD PDT POS PP PP$ PRP PRP$ RP TO VB VBD VBG VBN VBP VBZ WDT WP WPS WRB 
28 Sep 2017 23:00:57  INFO AbstractJCasTermAnnotator - Using minimum term text span: 3
28 Sep 2017 23:00:57  INFO AbstractJCasTermAnnotator - Using Dictionary Descriptor: org/apache/ctakes/dictionary/lookup/fast/sno_rx_16ab.xml
28 Sep 2017 23:00:57  INFO DictionaryDescriptorParser - Parsing dictionary specifications:

28 Sep 2017 23:00:57 ERROR UmlsUserApprover -   User CHANGE_ME not allowed.  It is a placeholder
reminder.
28 Sep 2017 23:00:57 ERROR UmlsUserApprover -    Verify that you are setting command-line
option --user or ctakes property umlsUser or environment variable ctakes.umlsuser properly.
Tests run: 1, Failures: 0, Errors: 1, Skipped: 0, Time elapsed: 7.168 sec <<< FAILURE!

Results :

Tests in error: 
  testCPE(org.apache.ctakes.regression.test.RegressionPipelineTest): Initialization of CAS
Processor with name "RegressionPipelineAggregateTest" failed.  

Tests run: 1, Failures: 0, Errors: 1, Skipped: 0

[JENKINS] Recording test results
[JENKINS] Archiving disabled
[INFO] 
[INFO] ------------------------------------------------------------------------
[INFO] Building Apache cTAKES template filler 4.0.1-SNAPSHOT
[INFO] ------------------------------------------------------------------------
[INFO] 
[INFO] --- maven-clean-plugin:2.4.1:clean (default-clean) @ ctakes-template-filler ---
[INFO] 
[INFO] --- maven-remote-resources-plugin:1.4:process (default) @ ctakes-template-filler ---
[INFO] 
[INFO] --- maven-resources-plugin:2.5:resources (default-resources) @ ctakes-template-filler
---
[debug] execute contextualize
[INFO] Using 'UTF-8' encoding to copy filtered resources.
[INFO] Copying 0 resource
[INFO] Copying 3 resources
[INFO] 
[INFO] --- maven-compiler-plugin:2.4:compile (default-compile) @ ctakes-template-filler ---
[INFO] Compiling 1 source file to <https://builds.apache.org/job/cTAKES-trunk/ws/ctakes-template-filler/target/classes>
[INFO] 
[INFO] --- maven-resources-plugin:2.5:testResources (default-testResources) @ ctakes-template-filler
---
[debug] execute contextualize
[INFO] Using 'UTF-8' encoding to copy filtered resources.
[INFO] Copying 0 resource
[INFO] Copying 3 resources
[INFO] 
[INFO] --- maven-compiler-plugin:2.4:testCompile (default-testCompile) @ ctakes-template-filler
---
[INFO] Nothing to compile - all classes are up to date
[INFO] 
[INFO] --- maven-surefire-plugin:2.12.1:test (default-test) @ ctakes-template-filler ---
[INFO] Surefire report directory: <https://builds.apache.org/job/cTAKES-trunk/ws/ctakes-template-filler/target/surefire-reports>

-------------------------------------------------------
 T E S T S
-------------------------------------------------------

Results :

Tests run: 0, Failures: 0, Errors: 0, Skipped: 0

[JENKINS] Recording test results
[INFO] 
[INFO] --- maven-jar-plugin:2.4:jar (default-jar) @ ctakes-template-filler ---
[INFO] Building jar: <https://builds.apache.org/job/cTAKES-trunk/ws/ctakes-template-filler/target/ctakes-template-filler-4.0.1-SNAPSHOT.jar>
[INFO] 
[INFO] --- maven-site-plugin:3.1:attach-descriptor (attach-descriptor) @ ctakes-template-filler
---
[INFO] 
[INFO] --- maven-install-plugin:2.3.1:install (default-install) @ ctakes-template-filler ---
[INFO] Installing <https://builds.apache.org/job/cTAKES-trunk/ws/ctakes-template-filler/target/ctakes-template-filler-4.0.1-SNAPSHOT.jar>
to /home/jenkins/jenkins-slave/maven-repositories/0/org/apache/ctakes/ctakes-template-filler/4.0.1-SNAPSHOT/ctakes-template-filler-4.0.1-SNAPSHOT.jar
[INFO] Installing <https://builds.apache.org/job/cTAKES-trunk/ws/ctakes-template-filler/pom.xml>
to /home/jenkins/jenkins-slave/maven-repositories/0/org/apache/ctakes/ctakes-template-filler/4.0.1-SNAPSHOT/ctakes-template-filler-4.0.1-SNAPSHOT.pom
[JENKINS] Archiving disabled
[JENKINS] Archiving disabled
[JENKINS] Archiving disabled
[JENKINS] Archiving disabled
[JENKINS] Archiving disabled
[JENKINS] Archiving disabled
[JENKINS] Archiving disabled
[JENKINS] Archiving disabled
[JENKINS] Archiving disabled
[JENKINS] Archiving disabled
[JENKINS] Archiving disabled
[JENKINS] Archiving disabled
[JENKINS] Archiving disabled
[JENKINS] Archiving disabled
[JENKINS] Archiving disabled
[JENKINS] Archiving disabled
[JENKINS] Archiving disabled
[JENKINS] Archiving disabled
[JENKINS] Archiving disabled
[JENKINS] Archiving disabled
[JENKINS] Archiving disabled
[JENKINS] Archiving disabled
[JENKINS] Archiving disabled
[JENKINS] Archiving disabled
[JENKINS] Archiving disabled
[JENKINS] Archiving disabled
[JENKINS] Archiving disabled
[JENKINS] Archiving disabled
[JENKINS] Archiving disabled
[JENKINS] Archiving disabled
[JENKINS] Archiving disabled
[JENKINS] Archiving disabled
[JENKINS] Archiving disabled
[JENKINS] Archiving disabled
[JENKINS] Archiving disabled
[JENKINS] Archiving disabled
[JENKINS] Archiving disabled
[JENKINS] Archiving disabled
[JENKINS] Archiving disabled
[JENKINS] Archiving disabled
[JENKINS] Archiving disabled
[JENKINS] Archiving disabled
[JENKINS] Archiving disabled
[JENKINS] Archiving disabled
[JENKINS] Archiving disabled
[JENKINS] Archiving disabled
[JENKINS] Archiving disabled
[JENKINS] Archiving disabled
[JENKINS] Archiving disabled
[JENKINS] Archiving disabled
[JENKINS] Archiving disabled
[JENKINS] Archiving disabled
[JENKINS] Archiving disabled[INFO] ------------------------------------------------------------------------
[INFO] Reactor Summary:
[INFO] 
[INFO] Apache cTAKES ...................................... SUCCESS [  3.295 s]
[INFO] ctakes-gui-res ..................................... SUCCESS [  3.925 s]
[INFO] Apache cTAKES Resources core ....................... SUCCESS [  1.608 s]
[INFO] Apache cTAKES common type system ................... SUCCESS [ 10.387 s]
[INFO] Apache cTAKES utils ................................ SUCCESS [  3.240 s]
[INFO] Apache cTAKES core ................................. SUCCESS [ 18.416 s]
[INFO] ctakes-gui ......................................... SUCCESS [  4.540 s]
[INFO] Apache cTAKES Resources pos-tagger ................. SUCCESS [  2.469 s]
[INFO] Apache cTAKES part-of-speech tagger ................ SUCCESS [  5.350 s]
[INFO] Apache cTAKES Resources ctakes-chunker-res ......... SUCCESS [  2.554 s]
[INFO] Apache cTAKES chunker .............................. SUCCESS [  2.861 s]
[INFO] Apache cTAKES document preprocessor ................ SUCCESS [  3.319 s]
[INFO] Apache cTAKES Resources dictionary-lookup .......... SUCCESS [ 16.356 s]
[INFO] Apache cTAKES dictionary lookup .................... SUCCESS [  4.143 s]
[INFO] Apache cTAKES context dependent tokenizer .......... SUCCESS [  5.093 s]
[INFO] Apache cTAKES Resources lvg ........................ SUCCESS [ 32.258 s]
[INFO] Apache cTAKES LVG lexical tools .................... SUCCESS [  5.068 s]
[INFO] Apache cTAKES Resources ne-contexts ................ SUCCESS [  1.198 s]
[INFO] Apache cTAKES named entity contexts ................ SUCCESS [  4.419 s]
[INFO] Apache cTAKES Resources constituency-parser ........ SUCCESS [  5.199 s]
[INFO] Apache cTAKES Constituency Parser .................. SUCCESS [  2.544 s]
[INFO] Apache cTAKES Resources coreference ................ SUCCESS [  8.228 s]
[INFO] Apache cTAKES Resources temporal ................... SUCCESS [  2.017 s]
[INFO] Apache cTAKES Resources relation-extractor ......... SUCCESS [  1.318 s]
[INFO] Apache cTAKES Resources dictionary-lookup-fast-res . SUCCESS [  2.337 s]
[INFO] Apache cTAKES dictionary lookup fast ............... SUCCESS [  2.778 s]
[INFO] Apache cTAKES Resources assertion .................. SUCCESS [  4.017 s]
[INFO] Apache cTAKES Resources dependency-parser .......... SUCCESS [ 29.601 s]
[INFO] Apache cTAKES Dependency Parser .................... SUCCESS [01:03 min]
[INFO] Apache cTAKES Assertion ............................ SUCCESS [  6.660 s]
[INFO] ctakes-clinical-pipeline-res ....................... SUCCESS [  1.133 s]
[INFO] Apache cTAKES ctakes-clinical-pipeline ............. SUCCESS [  6.727 s]
[INFO] Apache cTAKES Relation Extractor ................... SUCCESS [ 12.741 s]
[INFO] Apache cTAKES Temporal Information Extraction ...... FAILURE [ 35.860 s]
[INFO] Apache cTAKES CoReference Resolver ................. SKIPPED
[INFO] Apache cTAKES Resources drug-ner ................... SUCCESS [  1.434 s]
[INFO] Apache cTAKES Drug NER ............................. SUCCESS [  7.025 s]
[INFO] Apache cTAKES Resources side-effect ................ SUCCESS [  1.391 s]
[INFO] Apache cTAKES Side Effects ......................... SUCCESS [  6.075 s]
[INFO] Apache cTAKES Resources smoking-status ............. SUCCESS [  1.501 s]
[INFO] Apache cTAKES Smoking Status ....................... SUCCESS [  6.153 s]
[INFO] Apache cTAKES Resources assertion-zoner ............ SUCCESS [  1.456 s]
[INFO] Apache cTAKES Assertion's zoner .................... SUCCESS [  2.051 s]
[INFO] ctakes-examples-res ................................ SUCCESS [  1.328 s]
[INFO] ctakes-examples .................................... SKIPPED
[INFO] Apache cTAKES Resources ctakes-ytex-res ............ SUCCESS [  1.299 s]
[INFO] Apache cTAKES YTEX ................................. FAILURE [01:54 min]
[INFO] Apache cTAKES YTEX UIMA ............................ SKIPPED
[INFO] Apache cTAKES YTEX Web ............................. SKIPPED
[INFO] Apache cTAKES Distribution ......................... SKIPPED
[INFO] Apache cTAKES Regression-test ...................... FAILURE [ 15.179 s]
[INFO] Apache cTAKES template filler ...................... SUCCESS [  7.832 s]
[INFO] ------------------------------------------------------------------------
[INFO] BUILD FAILURE
[INFO] ------------------------------------------------------------------------
[INFO] Total time: 08:35 min
[INFO] Finished at: 2017-09-28T23:01:18Z

[INFO] Final Memory: 125M/1550M
[INFO] ------------------------------------------------------------------------
[ERROR] Failed to execute goal org.apache.maven.plugins:maven-surefire-plugin:2.12.1:test
(default-test) on project ctakes-temporal: There are test failures.
[ERROR] 
[ERROR] Please refer to <https://builds.apache.org/job/cTAKES-trunk/ws/ctakes-temporal/target/surefire-reports>
for the individual test results.
[ERROR] -> [Help 1]
[ERROR] Failed to execute goal org.apache.maven.plugins:maven-surefire-plugin:2.12.1:test
(surefire-it) on project ctakes-ytex: There are test failures.
[ERROR] 
[ERROR] Please refer to <https://builds.apache.org/job/cTAKES-trunk/ws/ctakes-ytex/target/surefire-reports>
for the individual test results.
[ERROR] -> [Help 1]
[ERROR] Failed to execute goal org.apache.maven.plugins:maven-surefire-plugin:2.12.1:test
(default-test) on project ctakes-regression-test: There are test failures.
[ERROR] 
[ERROR] Please refer to <https://builds.apache.org/job/cTAKES-trunk/ws/ctakes-regression-test/target/surefire-reports>
for the individual test results.
[ERROR] -> [Help 1]
[ERROR] 
[ERROR] To see the full stack trace of the errors, re-run Maven with the -e switch.
[ERROR] Re-run Maven using the -X switch to enable full debug logging.
[ERROR] 
[ERROR] For more information about the errors and possible solutions, please read the following
articles:
[ERROR] [Help 1] http://cwiki.apache.org/confluence/display/MAVEN/MojoFailureException
[ERROR] 
[ERROR] After correcting the problems, you can resume the build with the command
[ERROR]   mvn <goals> -rf :ctakes-temporal
Sending e-mails to: notifications@ctakes.apache.org
Sending e-mails to: notifications@ctakes.apache.org
Sending e-mails to: notifications@ctakes.apache.org
Sending e-mails to: notifications@ctakes.apache.org
channel stopped

Mime
View raw message