ctakes-notifications mailing list archives

Site index · List index
Message view « Date » · « Thread »
Top « Date » · « Thread »
From Apache Jenkins Server <jenk...@builds.apache.org>
Subject Build failed in Jenkins: cTAKES-trunk » Apache cTAKES Temporal Information Extraction #3
Date Thu, 28 Sep 2017 23:01:22 GMT
See <https://builds.apache.org/job/cTAKES-trunk/org.apache.ctakes$ctakes-temporal/3/display/redirect>

------------------------------------------
[...truncated 24.27 KB...]
<https://builds.apache.org/job/cTAKES-trunk/org.apache.ctakes$ctakes-temporal/ws/src/main/java/org/apache/ctakes/temporal/ae/TimeAnnotator.java>:[192,37]
[unchecked] unchecked call to CombinedExtractor1(FeatureExtractor1<T>,FeatureExtractor1<T>,FeatureExtractor1<T>,FeatureExtractor1<T>,FeatureExtractor1<T>)
as a member of the raw type CombinedExtractor1
[WARNING]   where T is a type-variable:
    T extends Annotation declared in class CombinedExtractor1
<https://builds.apache.org/job/cTAKES-trunk/org.apache.ctakes$ctakes-temporal/ws/src/main/java/org/apache/ctakes/temporal/ae/TimeAnnotator.java>:[206,36]
[unchecked] unchecked call to CleartkExtractor(Class<SEARCH_T>,FeatureExtractor1<SEARCH_T>,Context...)
as a member of the raw type CleartkExtractor
[WARNING]   where SEARCH_T is a type-variable:
    SEARCH_T extends Annotation declared in class CleartkExtractor
<https://builds.apache.org/job/cTAKES-trunk/org.apache.ctakes$ctakes-temporal/ws/src/main/java/org/apache/ctakes/temporal/ae/TimeAnnotator.java>:[259,38]
[unchecked] unchecked call to extract(JCas,T) as a member of the raw type FeatureExtractor1
[WARNING]   where T is a type-variable:
    T extends Annotation declared in interface FeatureExtractor1
<https://builds.apache.org/job/cTAKES-trunk/org.apache.ctakes$ctakes-temporal/ws/src/main/java/org/apache/ctakes/temporal/ae/TimeAnnotator.java>:[259,20]
[unchecked] unchecked method invocation: method addAll in interface List is applied to given
types
[WARNING]   required: Collection<? extends E>
  found: List
  where E is a type-variable:
    E extends Object declared in interface List
<https://builds.apache.org/job/cTAKES-trunk/org.apache.ctakes$ctakes-temporal/ws/src/main/java/org/apache/ctakes/temporal/ae/TimeAnnotator.java>:[259,38]
[unchecked] unchecked conversion
[WARNING]   required: Collection<? extends E>
  found:    List
  where E is a type-variable:
    E extends Object declared in interface List
<https://builds.apache.org/job/cTAKES-trunk/org.apache.ctakes$ctakes-temporal/ws/src/main/java/org/apache/ctakes/temporal/ae/TimeAnnotator.java>:[263,44]
[unchecked] unchecked call to extractWithin(JCas,FOCUS_T,Annotation) as a member of the raw
type CleartkExtractor
[WARNING]   where FOCUS_T is a type-variable:
    FOCUS_T extends Annotation declared in class CleartkExtractor
<https://builds.apache.org/job/cTAKES-trunk/org.apache.ctakes$ctakes-temporal/ws/src/main/java/org/apache/ctakes/temporal/ae/TimeAnnotator.java>:[263,20]
[unchecked] unchecked method invocation: method addAll in interface List is applied to given
types
[WARNING]   required: Collection<? extends E>
  found: List
  where E is a type-variable:
    E extends Object declared in interface List
<https://builds.apache.org/job/cTAKES-trunk/org.apache.ctakes$ctakes-temporal/ws/src/main/java/org/apache/ctakes/temporal/ae/TimeAnnotator.java>:[263,44]
[unchecked] unchecked conversion
[WARNING]   required: Collection<? extends E>
  found:    List
  where E is a type-variable:
    E extends Object declared in interface List
<https://builds.apache.org/job/cTAKES-trunk/org.apache.ctakes$ctakes-temporal/ws/src/main/java/org/apache/ctakes/temporal/eval/EvaluationOfEventEventCRFRelations.java>:[325,53]
[deprecation] createAnnotatorDescription(File) in EventEventCRFRelationAnnotator has been
deprecated
[WARNING] <https://builds.apache.org/job/cTAKES-trunk/org.apache.ctakes$ctakes-temporal/ws/src/main/java/org/apache/ctakes/temporal/ae/EventEventRelationGoldContainerAnnotator.java>:[148,27]
[unchecked] unchecked generic array creation for varargs parameter of type RelationFeaturesExtractor<IdentifiedAnnotation,IdentifiedAnnotation>[]
[WARNING] <https://builds.apache.org/job/cTAKES-trunk/org.apache.ctakes$ctakes-temporal/ws/src/main/java/org/apache/ctakes/temporal/ae/feature/MultiTokenFeaturesExtractor.java>:[68,42]
[unchecked] unchecked call to CleartkExtractor(Class<SEARCH_T>,FeatureExtractor1<SEARCH_T>,Context...)
as a member of the raw type CleartkExtractor
[WARNING]   where SEARCH_T is a type-variable:
    SEARCH_T extends Annotation declared in class CleartkExtractor
<https://builds.apache.org/job/cTAKES-trunk/org.apache.ctakes$ctakes-temporal/ws/src/main/java/org/apache/ctakes/temporal/ae/feature/MultiTokenFeaturesExtractor.java>:[82,3]
[unchecked] unchecked call to CombinedExtractor1(FeatureExtractor1<T>,FeatureExtractor1<T>)
as a member of the raw type CombinedExtractor1
[WARNING]   where T is a type-variable:
    T extends Annotation declared in class CombinedExtractor1
<https://builds.apache.org/job/cTAKES-trunk/org.apache.ctakes$ctakes-temporal/ws/src/main/java/org/apache/ctakes/temporal/ae/feature/MultiTokenFeaturesExtractor.java>:[80,55]
[unchecked] unchecked call to NamingExtractor1(String,FeatureExtractor1<T>) as a member
of the raw type NamingExtractor1
[WARNING]   where T is a type-variable:
    T extends Annotation declared in class NamingExtractor1
<https://builds.apache.org/job/cTAKES-trunk/org.apache.ctakes$ctakes-temporal/ws/src/main/java/org/apache/ctakes/temporal/ae/feature/MultiTokenFeaturesExtractor.java>:[89,3]
[unchecked] unchecked call to CombinedExtractor1(FeatureExtractor1<T>,FeatureExtractor1<T>)
as a member of the raw type CombinedExtractor1
[WARNING]   where T is a type-variable:
    T extends Annotation declared in class CombinedExtractor1
<https://builds.apache.org/job/cTAKES-trunk/org.apache.ctakes$ctakes-temporal/ws/src/main/java/org/apache/ctakes/temporal/ae/feature/MultiTokenFeaturesExtractor.java>:[87,55]
[unchecked] unchecked call to NamingExtractor1(String,FeatureExtractor1<T>) as a member
of the raw type NamingExtractor1
[WARNING]   where T is a type-variable:
    T extends Annotation declared in class NamingExtractor1
<https://builds.apache.org/job/cTAKES-trunk/org.apache.ctakes$ctakes-temporal/ws/src/main/java/org/apache/ctakes/temporal/ae/feature/MultiTokenFeaturesExtractor.java>:[96,3]
[unchecked] unchecked call to NamingExtractor1(String,FeatureExtractor1<T>) as a member
of the raw type NamingExtractor1
[WARNING]   where T is a type-variable:
    T extends Annotation declared in class NamingExtractor1
<https://builds.apache.org/job/cTAKES-trunk/org.apache.ctakes$ctakes-temporal/ws/src/main/java/org/apache/ctakes/temporal/ae/feature/MultiTokenFeaturesExtractor.java>:[94,42]
[unchecked] unchecked call to CleartkExtractor(Class<SEARCH_T>,FeatureExtractor1<SEARCH_T>,Context...)
as a member of the raw type CleartkExtractor
[WARNING]   where SEARCH_T is a type-variable:
    SEARCH_T extends Annotation declared in class CleartkExtractor
<https://builds.apache.org/job/cTAKES-trunk/org.apache.ctakes$ctakes-temporal/ws/src/main/java/org/apache/ctakes/temporal/ae/feature/MultiTokenFeaturesExtractor.java>:[107,44]
[unchecked] unchecked call to DistanceExtractor(String,Class<? extends Annotation>)
as a member of the raw type DistanceExtractor
[WARNING] <https://builds.apache.org/job/cTAKES-trunk/org.apache.ctakes$ctakes-temporal/ws/src/main/java/org/apache/ctakes/temporal/ae/feature/MultiTokenFeaturesExtractor.java>:[154,57]
[unchecked] unchecked call to extract(JCas,T) as a member of the raw type FeatureExtractor1
[WARNING]   where T is a type-variable:
    T extends Annotation declared in interface FeatureExtractor1
<https://builds.apache.org/job/cTAKES-trunk/org.apache.ctakes$ctakes-temporal/ws/src/main/java/org/apache/ctakes/temporal/ae/feature/MultiTokenFeaturesExtractor.java>:[154,18]
[unchecked] unchecked method invocation: method addAll in interface List is applied to given
types
[WARNING]   required: Collection<? extends E>
  found: List
  where E is a type-variable:
    E extends Object declared in interface List
<https://builds.apache.org/job/cTAKES-trunk/org.apache.ctakes$ctakes-temporal/ws/src/main/java/org/apache/ctakes/temporal/ae/feature/MultiTokenFeaturesExtractor.java>:[154,57]
[unchecked] unchecked conversion
[WARNING]   required: Collection<? extends E>
  found:    List
  where E is a type-variable:
    E extends Object declared in interface List
<https://builds.apache.org/job/cTAKES-trunk/org.apache.ctakes$ctakes-temporal/ws/src/main/java/org/apache/ctakes/temporal/ae/feature/MultiTokenFeaturesExtractor.java>:[156,53]
[unchecked] unchecked call to extractBetween(JCas,FOCUS_T,FOCUS_T) as a member of the raw
type CleartkExtractor
[WARNING]   where FOCUS_T is a type-variable:
    FOCUS_T extends Annotation declared in class CleartkExtractor
<https://builds.apache.org/job/cTAKES-trunk/org.apache.ctakes$ctakes-temporal/ws/src/main/java/org/apache/ctakes/temporal/ae/feature/MultiTokenFeaturesExtractor.java>:[156,19]
[unchecked] unchecked method invocation: method addAll in interface List is applied to given
types
[WARNING]   required: Collection<? extends E>
  found: List
  where E is a type-variable:
    E extends Object declared in interface List
<https://builds.apache.org/job/cTAKES-trunk/org.apache.ctakes$ctakes-temporal/ws/src/main/java/org/apache/ctakes/temporal/ae/feature/MultiTokenFeaturesExtractor.java>:[156,53]
[unchecked] unchecked conversion
[WARNING]   required: Collection<? extends E>
  found:    List
  where E is a type-variable:
    E extends Object declared in interface List
<https://builds.apache.org/job/cTAKES-trunk/org.apache.ctakes$ctakes-temporal/ws/src/main/java/org/apache/ctakes/temporal/ae/feature/MultiTokenFeaturesExtractor.java>:[157,19]
[unchecked] unchecked method invocation: method addAll in interface List is applied to given
types
[WARNING]   required: Collection<? extends E>
  found: List
  where E is a type-variable:
    E extends Object declared in interface List
<https://builds.apache.org/job/cTAKES-trunk/org.apache.ctakes$ctakes-temporal/ws/src/main/java/org/apache/ctakes/temporal/ae/feature/MultiTokenFeaturesExtractor.java>:[157,47]
[unchecked] unchecked conversion
[WARNING]   required: Collection<? extends E>
  found:    List
  where E is a type-variable:
    E extends Object declared in interface List
<https://builds.apache.org/job/cTAKES-trunk/org.apache.ctakes$ctakes-temporal/ws/src/main/java/org/apache/ctakes/temporal/ae/feature/MultiTokenFeaturesExtractor.java>:[161,57]
[unchecked] unchecked call to extract(JCas,T) as a member of the raw type FeatureExtractor1
[WARNING]   where T is a type-variable:
    T extends Annotation declared in interface FeatureExtractor1
<https://builds.apache.org/job/cTAKES-trunk/org.apache.ctakes$ctakes-temporal/ws/src/main/java/org/apache/ctakes/temporal/ae/feature/MultiTokenFeaturesExtractor.java>:[161,18]
[unchecked] unchecked method invocation: method addAll in interface List is applied to given
types
[WARNING]   required: Collection<? extends E>
  found: List
  where E is a type-variable:
    E extends Object declared in interface List
<https://builds.apache.org/job/cTAKES-trunk/org.apache.ctakes$ctakes-temporal/ws/src/main/java/org/apache/ctakes/temporal/ae/feature/MultiTokenFeaturesExtractor.java>:[161,57]
[unchecked] unchecked conversion
[WARNING]   required: Collection<? extends E>
  found:    List
  where E is a type-variable:
    E extends Object declared in interface List
<https://builds.apache.org/job/cTAKES-trunk/org.apache.ctakes$ctakes-temporal/ws/src/main/java/org/apache/ctakes/temporal/eval/EvaluationOfSelfEventTimeRelations.java>:[357,49]
[deprecation] createAnnotatorDescription(File) in EventTimeRelationAnnotator has been deprecated
[WARNING] <https://builds.apache.org/job/cTAKES-trunk/org.apache.ctakes$ctakes-temporal/ws/src/main/java/org/apache/ctakes/temporal/eval/EvaluationOfSelfEventTimeRelations.java>:[476,53]
[deprecation] createEngineDescription(File) in EventTimeSelfRelationAnnotator has been deprecated
[WARNING] <https://builds.apache.org/job/cTAKES-trunk/org.apache.ctakes$ctakes-temporal/ws/src/main/java/org/apache/ctakes/temporal/ae/CRFTimeAnnotator.java>:[153,8]
[unchecked] unchecked call to TypePathExtractor(Class<T>,String) as a member of the
raw type TypePathExtractor
[WARNING]   where T is a type-variable:
    T extends Annotation declared in class TypePathExtractor
<https://builds.apache.org/job/cTAKES-trunk/org.apache.ctakes$ctakes-temporal/ws/src/main/java/org/apache/ctakes/temporal/ae/CRFTimeAnnotator.java>:[149,39]
[unchecked] unchecked call to CombinedExtractor1(FeatureExtractor1<T>,FeatureExtractor1<T>,FeatureExtractor1<T>)
as a member of the raw type CombinedExtractor1
[WARNING]   where T is a type-variable:
    T extends Annotation declared in class CombinedExtractor1
<https://builds.apache.org/job/cTAKES-trunk/org.apache.ctakes$ctakes-temporal/ws/src/main/java/org/apache/ctakes/temporal/ae/CRFTimeAnnotator.java>:[163,38]
[unchecked] unchecked call to CleartkExtractor(Class<SEARCH_T>,FeatureExtractor1<SEARCH_T>,Context...)
as a member of the raw type CleartkExtractor
[WARNING]   where SEARCH_T is a type-variable:
    SEARCH_T extends Annotation declared in class CleartkExtractor
<https://builds.apache.org/job/cTAKES-trunk/org.apache.ctakes$ctakes-temporal/ws/src/main/java/org/apache/ctakes/temporal/ae/CRFTimeAnnotator.java>:[200,43]
[unchecked] unchecked call to extract(JCas,T) as a member of the raw type FeatureExtractor1
[WARNING]   where T is a type-variable:
    T extends Annotation declared in interface FeatureExtractor1
<https://builds.apache.org/job/cTAKES-trunk/org.apache.ctakes$ctakes-temporal/ws/src/main/java/org/apache/ctakes/temporal/ae/CRFTimeAnnotator.java>:[200,25]
[unchecked] unchecked method invocation: method addAll in interface List is applied to given
types
[WARNING]   required: Collection<? extends E>
  found: List
  where E is a type-variable:
    E extends Object declared in interface List
<https://builds.apache.org/job/cTAKES-trunk/org.apache.ctakes$ctakes-temporal/ws/src/main/java/org/apache/ctakes/temporal/ae/CRFTimeAnnotator.java>:[200,43]
[unchecked] unchecked conversion
[WARNING]   required: Collection<? extends E>
  found:    List
  where E is a type-variable:
    E extends Object declared in interface List
<https://builds.apache.org/job/cTAKES-trunk/org.apache.ctakes$ctakes-temporal/ws/src/main/java/org/apache/ctakes/temporal/ae/CRFTimeAnnotator.java>:[204,49]
[unchecked] unchecked call to extractWithin(JCas,FOCUS_T,Annotation) as a member of the raw
type CleartkExtractor
[WARNING]   where FOCUS_T is a type-variable:
    FOCUS_T extends Annotation declared in class CleartkExtractor
<https://builds.apache.org/job/cTAKES-trunk/org.apache.ctakes$ctakes-temporal/ws/src/main/java/org/apache/ctakes/temporal/ae/CRFTimeAnnotator.java>:[204,25]
[unchecked] unchecked method invocation: method addAll in interface List is applied to given
types
[WARNING]   required: Collection<? extends E>
  found: List
  where E is a type-variable:
    E extends Object declared in interface List
<https://builds.apache.org/job/cTAKES-trunk/org.apache.ctakes$ctakes-temporal/ws/src/main/java/org/apache/ctakes/temporal/ae/CRFTimeAnnotator.java>:[204,49]
[unchecked] unchecked conversion
[WARNING]   required: Collection<? extends E>
  found:    List
  where E is a type-variable:
    E extends Object declared in interface List
<https://builds.apache.org/job/cTAKES-trunk/org.apache.ctakes$ctakes-temporal/ws/src/main/java/org/apache/ctakes/temporal/eval/EvaluationOfNEPredicateEventSpans.java>:[77,37]
[deprecation] createAnnotatorDescription(File) in NEPredicateEventAnnotator has been deprecated
[WARNING] <https://builds.apache.org/job/cTAKES-trunk/org.apache.ctakes$ctakes-temporal/ws/src/main/java/org/apache/ctakes/temporal/eval/EvaluationOfEventEventDeepPheRelations.java>:[294,50]
[deprecation] createAnnotatorDescription(File) in EventEventRelationAnnotator has been deprecated
[WARNING] <https://builds.apache.org/job/cTAKES-trunk/org.apache.ctakes$ctakes-temporal/ws/src/main/java/org/apache/ctakes/temporal/eval/EvaluationOfEventTimeDeepPheRelations.java>:[294,33]
[deprecation] createEngineDescription(File) in EventTimeSelfRelationAnnotator has been deprecated
[WARNING] <https://builds.apache.org/job/cTAKES-trunk/org.apache.ctakes$ctakes-temporal/ws/src/main/java/org/apache/ctakes/temporal/ae/ConsecutiveSentencesEventTimeRelationAnnotator.java>:[50,30]
[deprecation] createPrimitiveDescription(Class<? extends AnalysisComponent>,Object...)
in AnalysisEngineFactory has been deprecated
[WARNING] <https://builds.apache.org/job/cTAKES-trunk/org.apache.ctakes$ctakes-temporal/ws/src/main/java/org/apache/ctakes/temporal/ae/ConsecutiveSentencesEventTimeRelationAnnotator.java>:[65,30]
[deprecation] createPrimitiveDescription(Class<? extends AnalysisComponent>,Object...)
in AnalysisEngineFactory has been deprecated
[WARNING] <https://builds.apache.org/job/cTAKES-trunk/org.apache.ctakes$ctakes-temporal/ws/src/main/java/org/apache/ctakes/temporal/ae/ConsecutiveSentencesEventTimeRelationAnnotator.java>:[75,27]
[unchecked] unchecked generic array creation for varargs parameter of type RelationFeaturesExtractor<IdentifiedAnnotation,IdentifiedAnnotation>[]
[WARNING] <https://builds.apache.org/job/cTAKES-trunk/org.apache.ctakes$ctakes-temporal/ws/src/main/java/org/apache/ctakes/temporal/ae/EventTimeI2B2RelationAnnotator.java>:[130,27]
[unchecked] unchecked generic array creation for varargs parameter of type RelationFeaturesExtractor<IdentifiedAnnotation,IdentifiedAnnotation>[]
[WARNING] <https://builds.apache.org/job/cTAKES-trunk/org.apache.ctakes$ctakes-temporal/ws/src/main/java/org/apache/ctakes/temporal/eval/EvaluationOfTimeSpans.java>:[290,23]
[deprecation] createAnnotatorDescription(File) in TimeAnnotator has been deprecated
[WARNING] <https://builds.apache.org/job/cTAKES-trunk/org.apache.ctakes$ctakes-temporal/ws/src/main/java/org/apache/ctakes/temporal/ae/ConsecutiveSentencesEventEventRelationAnnotator.java>:[50,30]
[deprecation] createPrimitiveDescription(Class<? extends AnalysisComponent>,Object...)
in AnalysisEngineFactory has been deprecated
[WARNING] <https://builds.apache.org/job/cTAKES-trunk/org.apache.ctakes$ctakes-temporal/ws/src/main/java/org/apache/ctakes/temporal/ae/ConsecutiveSentencesEventEventRelationAnnotator.java>:[65,30]
[deprecation] createPrimitiveDescription(Class<? extends AnalysisComponent>,Object...)
in AnalysisEngineFactory has been deprecated
[WARNING] <https://builds.apache.org/job/cTAKES-trunk/org.apache.ctakes$ctakes-temporal/ws/src/main/java/org/apache/ctakes/temporal/ae/ConsecutiveSentencesEventEventRelationAnnotator.java>:[75,27]
[unchecked] unchecked generic array creation for varargs parameter of type RelationFeaturesExtractor<IdentifiedAnnotation,IdentifiedAnnotation>[]
[WARNING] <https://builds.apache.org/job/cTAKES-trunk/org.apache.ctakes$ctakes-temporal/ws/src/main/java/org/apache/ctakes/temporal/ae/EventTimeRelationAnnotator.java>:[130,27]
[unchecked] unchecked generic array creation for varargs parameter of type RelationFeaturesExtractor<IdentifiedAnnotation,IdentifiedAnnotation>[]
[WARNING] <https://builds.apache.org/job/cTAKES-trunk/org.apache.ctakes$ctakes-temporal/ws/src/main/java/org/apache/ctakes/temporal/ae/ContextualModalityAnnotator.java>:[100,8]
[unchecked] unchecked call to TypePathExtractor(Class<T>,String) as a member of the
raw type TypePathExtractor
[WARNING]   where T is a type-variable:
    T extends Annotation declared in class TypePathExtractor
<https://builds.apache.org/job/cTAKES-trunk/org.apache.ctakes$ctakes-temporal/ws/src/main/java/org/apache/ctakes/temporal/ae/ContextualModalityAnnotator.java>:[98,39]
[unchecked] unchecked call to CombinedExtractor1(FeatureExtractor1<T>,FeatureExtractor1<T>)
as a member of the raw type CombinedExtractor1
[WARNING]   where T is a type-variable:
    T extends Annotation declared in class CombinedExtractor1
<https://builds.apache.org/job/cTAKES-trunk/org.apache.ctakes$ctakes-temporal/ws/src/main/java/org/apache/ctakes/temporal/ae/ContextualModalityAnnotator.java>:[102,28]
[unchecked] unchecked call to CleartkExtractor(Class<SEARCH_T>,FeatureExtractor1<SEARCH_T>,Context...)
as a member of the raw type CleartkExtractor
[WARNING]   where SEARCH_T is a type-variable:
    SEARCH_T extends Annotation declared in class CleartkExtractor
<https://builds.apache.org/job/cTAKES-trunk/org.apache.ctakes$ctakes-temporal/ws/src/main/java/org/apache/ctakes/temporal/ae/ContextualModalityAnnotator.java>:[115,62]
[unchecked] unchecked call to extract(JCas,FOCUS_T) as a member of the raw type CleartkExtractor
[WARNING]   where FOCUS_T is a type-variable:
    FOCUS_T extends Annotation declared in class CleartkExtractor
<https://builds.apache.org/job/cTAKES-trunk/org.apache.ctakes$ctakes-temporal/ws/src/main/java/org/apache/ctakes/temporal/ae/ContextualModalityAnnotator.java>:[115,62]
[unchecked] unchecked conversion
[WARNING]   required: List<Feature>
  found:    List
<https://builds.apache.org/job/cTAKES-trunk/org.apache.ctakes$ctakes-temporal/ws/src/main/java/org/apache/ctakes/temporal/ae/EventTimeSelfRelationAnnotator.java>:[149,27]
[unchecked] unchecked generic array creation for varargs parameter of type RelationFeaturesExtractor<IdentifiedAnnotation,IdentifiedAnnotation>[]
[INFO] 
[INFO] --- maven-resources-plugin:2.5:testResources (default-testResources) @ ctakes-temporal
---
[debug] execute contextualize
[INFO] Using 'UTF-8' encoding to copy filtered resources.
[INFO] skip non existing resourceDirectory <https://builds.apache.org/job/cTAKES-trunk/org.apache.ctakes$ctakes-temporal/ws/src/test/resources>
[INFO] Copying 3 resources
[INFO] 
[INFO] --- maven-compiler-plugin:2.4:testCompile (default-testCompile) @ ctakes-temporal ---
[INFO] Compiling 7 source files to <https://builds.apache.org/job/cTAKES-trunk/org.apache.ctakes$ctakes-temporal/ws/target/test-classes>
[INFO] 
[INFO] --- maven-surefire-plugin:2.12.1:test (default-test) @ ctakes-temporal ---
[INFO] Surefire report directory: <https://builds.apache.org/job/cTAKES-trunk/org.apache.ctakes$ctakes-temporal/ws/target/surefire-reports>

-------------------------------------------------------
 T E S T S
-------------------------------------------------------
Running org.apache.ctakes.temporal.ae.EventAnnotatorTest
log4j: reset attribute= "false".
log4j: Threshold ="null".
log4j: Retreiving an instance of org.apache.log4j.Logger.
log4j: Setting [ProgressAppender] additivity to [false].
log4j: Level value for ProgressAppender is  [INFO].
log4j: ProgressAppender level set to INFO
log4j: Class name: [org.apache.log4j.ConsoleAppender]
log4j: Parsing layout of class: "org.apache.log4j.PatternLayout"
log4j: Setting property [conversionPattern] to [%m].
log4j: Adding appender named [noEolAppender] to category [ProgressAppender].
log4j: Retreiving an instance of org.apache.log4j.Logger.
log4j: Setting [ProgressDone] additivity to [false].
log4j: Level value for ProgressDone is  [INFO].
log4j: ProgressDone level set to INFO
log4j: Class name: [org.apache.log4j.ConsoleAppender]
log4j: Parsing layout of class: "org.apache.log4j.PatternLayout"
log4j: Setting property [conversionPattern] to [%m%n].
log4j: Adding appender named [eolAppender] to category [ProgressDone].
log4j: Level value for root is  [INFO].
log4j: root level set to INFO
log4j: Class name: [org.apache.log4j.ConsoleAppender]
log4j: Parsing layout of class: "org.apache.log4j.PatternLayout"
log4j: Setting property [conversionPattern] to [%d{dd MMM yyyy HH:mm:ss} %5p %c{1} - %m%n].
log4j: Adding appender named [consoleAppender] to category [root].
28 Sep 2017 22:57:56  INFO LvgAnnotator - URL for lvg.properties =file:/home/jenkins/jenkins-slave/maven-repositories/0/net/sourceforge/ctakesresources/ctakes-resources-lvg2008/4.0.0/ctakes-resources-lvg2008-4.0.0.jar!/org/apache/ctakes/lvg/data/config/lvg.properties
28 Sep 2017 22:57:59  INFO SentenceDetector - Sentence detector model file: org/apache/ctakes/core/sentdetect/sd-med-model.zip
28 Sep 2017 22:57:59  INFO TokenizerAnnotatorPTB - Initializing org.apache.ctakes.core.ae.TokenizerAnnotatorPTB
Tests run: 1, Failures: 0, Errors: 1, Skipped: 0, Time elapsed: 6.86 sec <<< FAILURE!
Running org.apache.ctakes.temporal.ae.ContextualModalityAnnotatorTest
28 Sep 2017 22:58:00  INFO LvgAnnotator - URL for lvg.properties =file:/home/jenkins/jenkins-slave/maven-repositories/0/net/sourceforge/ctakesresources/ctakes-resources-lvg2008/4.0.0/ctakes-resources-lvg2008-4.0.0.jar!/org/apache/ctakes/lvg/data/config/lvg.properties
28 Sep 2017 22:58:03  INFO SentenceDetector - Sentence detector model file: org/apache/ctakes/core/sentdetect/sd-med-model.zip
28 Sep 2017 22:58:03  INFO TokenizerAnnotatorPTB - Initializing org.apache.ctakes.core.ae.TokenizerAnnotatorPTB
Tests run: 1, Failures: 0, Errors: 1, Skipped: 0, Time elapsed: 4.089 sec <<< FAILURE!
Running org.apache.ctakes.temporal.ae.BackwardsTimeAnnotatorTest
28 Sep 2017 22:58:04  INFO LvgAnnotator - URL for lvg.properties =file:/home/jenkins/jenkins-slave/maven-repositories/0/net/sourceforge/ctakesresources/ctakes-resources-lvg2008/4.0.0/ctakes-resources-lvg2008-4.0.0.jar!/org/apache/ctakes/lvg/data/config/lvg.properties
28 Sep 2017 22:58:06  INFO SentenceDetector - Sentence detector model file: org/apache/ctakes/core/sentdetect/sd-med-model.zip
28 Sep 2017 22:58:06  INFO TokenizerAnnotatorPTB - Initializing org.apache.ctakes.core.ae.TokenizerAnnotatorPTB
Tests run: 1, Failures: 0, Errors: 1, Skipped: 0, Time elapsed: 3.017 sec <<< FAILURE!
Running org.apache.ctakes.temporal.ae.EventTimeRelationAnnotatorTest
28 Sep 2017 22:58:07  INFO LvgAnnotator - URL for lvg.properties =file:/home/jenkins/jenkins-slave/maven-repositories/0/net/sourceforge/ctakesresources/ctakes-resources-lvg2008/4.0.0/ctakes-resources-lvg2008-4.0.0.jar!/org/apache/ctakes/lvg/data/config/lvg.properties
28 Sep 2017 22:58:10  INFO SentenceDetector - Sentence detector model file: org/apache/ctakes/core/sentdetect/sd-med-model.zip
28 Sep 2017 22:58:10  INFO TokenizerAnnotatorPTB - Initializing org.apache.ctakes.core.ae.TokenizerAnnotatorPTB
Tests run: 1, Failures: 0, Errors: 1, Skipped: 0, Time elapsed: 3.761 sec <<< FAILURE!
Running org.apache.ctakes.temporal.ae.EventEventRelationAnnotatorTest
28 Sep 2017 22:58:11  INFO LvgAnnotator - URL for lvg.properties =file:/home/jenkins/jenkins-slave/maven-repositories/0/net/sourceforge/ctakesresources/ctakes-resources-lvg2008/4.0.0/ctakes-resources-lvg2008-4.0.0.jar!/org/apache/ctakes/lvg/data/config/lvg.properties
28 Sep 2017 22:58:13  INFO SentenceDetector - Sentence detector model file: org/apache/ctakes/core/sentdetect/sd-med-model.zip
28 Sep 2017 22:58:13  INFO TokenizerAnnotatorPTB - Initializing org.apache.ctakes.core.ae.TokenizerAnnotatorPTB
Tests run: 1, Failures: 0, Errors: 1, Skipped: 0, Time elapsed: 3.262 sec <<< FAILURE!

Results :

Tests in error: 
  testPipeline(org.apache.ctakes.temporal.ae.EventAnnotatorTest): URI is not hierarchical
  testPipeline(org.apache.ctakes.temporal.ae.ContextualModalityAnnotatorTest): URI is not
hierarchical
  testPipeline(org.apache.ctakes.temporal.ae.BackwardsTimeAnnotatorTest): URI is not hierarchical
  testPipeline(org.apache.ctakes.temporal.ae.EventTimeRelationAnnotatorTest): URI is not hierarchical
  testPipeline(org.apache.ctakes.temporal.ae.EventEventRelationAnnotatorTest): URI is not
hierarchical

Tests run: 5, Failures: 0, Errors: 5, Skipped: 0

[JENKINS] Recording test results
[JENKINS] Archiving disabled

Mime
View raw message