ctakes-notifications mailing list archives

Site index · List index
Message view « Date » · « Thread »
Top « Date » · « Thread »
From Apache Jenkins Server <jenk...@builds.apache.org>
Subject Build failed in Jenkins: ctakes-trunk-compiletest #1100
Date Tue, 26 Sep 2017 21:28:41 GMT
See <https://builds.apache.org/job/ctakes-trunk-compiletest/1100/display/redirect?page=changes>

Changes:

[seanfinan] Check for piper files without .piper specified in the name

[seanfinan] ctakes - 455.  Hide failing passwords, log improved "check settings" instead.

------------------------------------------
[...truncated 321.25 KB...]
A         ctakes-context-tokenizer/src/test/java/org
A         ctakes-context-tokenizer/src/test/java/org/apache
A         ctakes-context-tokenizer/src/test/java/org/apache/ctakes
A         ctakes-context-tokenizer/src/test/java/org/apache/ctakes/contexttokenizer
A         ctakes-context-tokenizer/src/test/java/org/apache/ctakes/contexttokenizer/ae
AU        ctakes-context-tokenizer/src/test/java/org/apache/ctakes/contexttokenizer/ae/TestContextDependentTokenizerAnnotator.java
A         ctakes-context-tokenizer/data
A         ctakes-context-tokenizer/data/test
A         ctakes-context-tokenizer/data/test/output
A         ctakes-context-tokenizer/pom.xml
A         ctakes-context-tokenizer/resources
A         ctakes-context-tokenizer/resources/launch
A         ctakes-context-tokenizer/README
A         ctakes-context-tokenizer/desc
A         ctakes-context-tokenizer/desc/analysis_engine
A         ctakes-context-tokenizer/desc/analysis_engine/AggregateAE.xml
A         ctakes-context-tokenizer/desc/analysis_engine/ContextDependentTokenizerAnnotator.xml
A         ctakes-context-tokenizer/desc/analysis_engine/TestTAE.xml
A         ctakes-context-tokenizer/LICENSE
A         ctakes-dictionary-lookup-fast-res
AU        ctakes-dictionary-lookup-fast-res/LICENSE
A         ctakes-dictionary-lookup-fast-res/src
A         ctakes-dictionary-lookup-fast-res/src/main
A         ctakes-dictionary-lookup-fast-res/src/main/resources
A         ctakes-dictionary-lookup-fast-res/src/main/resources/org
A         ctakes-dictionary-lookup-fast-res/src/main/resources/org/apache
A         ctakes-dictionary-lookup-fast-res/src/main/resources/org/apache/ctakes
A         ctakes-dictionary-lookup-fast-res/src/main/resources/org/apache/ctakes/dictionary
A         ctakes-dictionary-lookup-fast-res/src/main/resources/org/apache/ctakes/dictionary/lookup
A         ctakes-dictionary-lookup-fast-res/src/main/resources/org/apache/ctakes/dictionary/lookup/fast
A         ctakes-dictionary-lookup-fast-res/src/main/resources/org/apache/ctakes/dictionary/lookup/fast/pipeline
A         ctakes-dictionary-lookup-fast-res/src/main/resources/org/apache/ctakes/dictionary/lookup/fast/pipeline/DictionarySubPipe.piper
A         ctakes-dictionary-lookup-fast-res/src/main/resources/org/apache/ctakes/dictionary/lookup/fast/example
A         ctakes-dictionary-lookup-fast-res/src/main/resources/org/apache/ctakes/dictionary/lookup/fast/example/bsv
A         ctakes-dictionary-lookup-fast-res/src/main/resources/org/apache/ctakes/dictionary/lookup/fast/example/bsv/custom_cui_bsv.bsv
A         ctakes-dictionary-lookup-fast-res/src/main/resources/org/apache/ctakes/dictionary/lookup/fast/example/bsv/custom_cui_tui_bsv.bsv
A         ctakes-dictionary-lookup-fast-res/src/main/resources/org/apache/ctakes/dictionary/lookup/fast/example/bsv/custom_tui_bsv.bsv
A         ctakes-dictionary-lookup-fast-res/src/main/resources/org/apache/ctakes/dictionary/lookup/fast/example/bsv/custom_mixed_bsv.bsv
A         ctakes-dictionary-lookup-fast-res/src/main/resources/org/apache/ctakes/dictionary/lookup/fast/example/bsv/CustomCuiBsv.xml
A         ctakes-dictionary-lookup-fast-res/src/main/resources/org/apache/ctakes/dictionary/lookup/fast/example/bsv/CustomCuiTuiBsv.xml
A         ctakes-dictionary-lookup-fast-res/src/main/resources/org/apache/ctakes/dictionary/lookup/fast/example/bsv/CustomCuiTui2Bsv.xml
AU        ctakes-dictionary-lookup-fast-res/pom.xml
A         ctakes-ne-contexts-res
A         ctakes-ne-contexts-res/LICENSE
A         ctakes-ne-contexts-res/src
A         ctakes-ne-contexts-res/src/test
A         ctakes-ne-contexts-res/src/main
A         ctakes-ne-contexts-res/src/main/resources
A         ctakes-ne-contexts-res/src/main/resources/org
A         ctakes-ne-contexts-res/src/main/resources/org/apache
A         ctakes-ne-contexts-res/src/main/resources/org/apache/ctakes
A         ctakes-ne-contexts-res/src/main/resources/org/apache/ctakes/necontexts
A         ctakes-ne-contexts-res/src/main/resources/org/apache/ctakes/necontexts/pipeline
A         ctakes-ne-contexts-res/src/main/resources/org/apache/ctakes/necontexts/pipeline/NeContextsSubPipe.piper
A         ctakes-ne-contexts-res/src/main/resources/org/apache/ctakes/necontexts/desc
A         ctakes-ne-contexts-res/src/main/resources/org/apache/ctakes/necontexts/desc/NegationAnnotator.xml
A         ctakes-ne-contexts-res/pom.xml
A         ctakes-dependency-parser-res
A         ctakes-dependency-parser-res/pom.xml
A         ctakes-dependency-parser-res/LICENSE
A         ctakes-dependency-parser-res/src
A         ctakes-dependency-parser-res/src/test
A         ctakes-dependency-parser-res/src/main
A         ctakes-dependency-parser-res/src/main/resources
A         ctakes-dependency-parser-res/src/main/resources/org
A         ctakes-dependency-parser-res/src/main/resources/org/apache
A         ctakes-dependency-parser-res/src/main/resources/org/apache/ctakes
A         ctakes-dependency-parser-res/src/main/resources/org/apache/ctakes/dependency
A         ctakes-dependency-parser-res/src/main/resources/org/apache/ctakes/dependency/parser
A         ctakes-dependency-parser-res/src/main/resources/org/apache/ctakes/dependency/parser/models
A         ctakes-dependency-parser-res/src/main/resources/org/apache/ctakes/dependency/parser/models/lemmatizer
A         ctakes-dependency-parser-res/src/main/resources/org/apache/ctakes/dependency/parser/models/lemmatizer/README
AU        ctakes-dependency-parser-res/src/main/resources/org/apache/ctakes/dependency/parser/models/lemmatizer/dictionary-1.3.1.jar
A         ctakes-dependency-parser-res/src/main/resources/org/apache/ctakes/dependency/parser/models/pred
AU        ctakes-dependency-parser-res/src/main/resources/org/apache/ctakes/dependency/parser/models/pred/mayo-en-pred-1.3.0.jar
A         ctakes-dependency-parser-res/src/main/resources/org/apache/ctakes/dependency/parser/models/dependency
A         ctakes-dependency-parser-res/src/main/resources/org/apache/ctakes/dependency/parser/models/dependency/README
AU        ctakes-dependency-parser-res/src/main/resources/org/apache/ctakes/dependency/parser/models/dependency/mayo-en-dep-1.3.0.jar
A         ctakes-dependency-parser-res/src/main/resources/org/apache/ctakes/dependency/parser/models/srl
AU        ctakes-dependency-parser-res/src/main/resources/org/apache/ctakes/dependency/parser/models/srl/mayo-en-srl-1.3.0.jar
A         ctakes-dependency-parser-res/src/main/resources/org/apache/ctakes/dependency/parser/models/srl/README
AU        ctakes-dependency-parser-res/src/main/resources/org/apache/ctakes/dependency/parser/models/clearparser_models.jar
A         ctakes-dependency-parser-res/src/main/resources/org/apache/ctakes/dependency/parser/models/role
AU        ctakes-dependency-parser-res/src/main/resources/org/apache/ctakes/dependency/parser/models/role/mayo-en-role-1.3.0.jar
A         ctakes-chunker
A         ctakes-chunker/LICENSE
A         ctakes-chunker/scripts
A         ctakes-chunker/scripts/java
A         ctakes-chunker/scripts/java/data
A         ctakes-chunker/scripts/java/data/chunk
A         ctakes-chunker/scripts/java/data/chunk/genia
A         ctakes-chunker/scripts/java/data/chunk/genia/Genia2PTB.java
A         ctakes-chunker/scripts/java/data/chunk/Chunklink2OpenNLP.java
A         ctakes-chunker/scripts/perl
A         ctakes-chunker/scripts/perl/README
A         ctakes-chunker/scripts/groovy
A         ctakes-chunker/scripts/groovy/data
A         ctakes-chunker/scripts/groovy/data/chunk
A         ctakes-chunker/scripts/groovy/data/chunk/TagReport.groovy
A         ctakes-chunker/src
A         ctakes-chunker/src/test
A         ctakes-chunker/src/test/resources
A         ctakes-chunker/src/test/resources/data
A         ctakes-chunker/src/test/resources/data/text-files
A         ctakes-chunker/src/test/resources/data/text-files/text1.txt
A         ctakes-chunker/src/test/resources/data/README
A         ctakes-chunker/src/test/resources/data/output
A         ctakes-chunker/src/test/resources/data/output/text1.txt.included.used.tag-dictionary.xml
A         ctakes-chunker/src/test/resources/data/output/NotesIIST_RTF.DTD
A         ctakes-chunker/src/test/resources/data/output/text1.txt.included.xml
A         ctakes-chunker/src/test/resources/data/unit-test.opennlp.chunks
A         ctakes-chunker/src/test/java
A         ctakes-chunker/src/test/java/org
A         ctakes-chunker/src/test/java/org/apache
A         ctakes-chunker/src/test/java/org/apache/ctakes
A         ctakes-chunker/src/test/java/org/apache/ctakes/chunker
A         ctakes-chunker/src/test/java/org/apache/ctakes/chunker/ChunkerTests.java
A         ctakes-chunker/src/test/java/org/apache/ctakes/chunker/ChunkAdjusterTests.java
A         ctakes-chunker/src/main
A         ctakes-chunker/src/main/java
A         ctakes-chunker/src/main/java/org
A         ctakes-chunker/src/main/java/org/apache
A         ctakes-chunker/src/main/java/org/apache/ctakes
A         ctakes-chunker/src/main/java/org/apache/ctakes/chunker
A         ctakes-chunker/src/main/java/org/apache/ctakes/chunker/ae
A         ctakes-chunker/src/main/java/org/apache/ctakes/chunker/ae/adjuster
A         ctakes-chunker/src/main/java/org/apache/ctakes/chunker/ae/adjuster/ChunkAdjuster.java
A         ctakes-chunker/src/main/java/org/apache/ctakes/chunker/ae/ChunkCreator.java
A         ctakes-chunker/src/main/java/org/apache/ctakes/chunker/ae/DefaultChunkCreator.java
A         ctakes-chunker/src/main/java/org/apache/ctakes/chunker/ae/PhraseTypeChunkCreator.java
A         ctakes-chunker/src/main/java/org/apache/ctakes/chunker/ae/Chunker.java
A         ctakes-chunker/data
A         ctakes-chunker/data/chunk
A         ctakes-chunker/data/chunk/genia
A         ctakes-chunker/data/chunk/genia/genia.opennlp.chunks
A         ctakes-chunker/data/chunk/genia/README
A         ctakes-chunker/data/chunk/combinations
A         ctakes-chunker/data/chunk/ptb
A         ctakes-chunker/data/chunk/ptb/README
A         ctakes-chunker/data/treebank
A         ctakes-chunker/data/treebank/genia
A         ctakes-chunker/data/treebank/genia/00
A         ctakes-chunker/data/treebank/genia/names-01.txt
A         ctakes-chunker/data/treebank/genia/01
A         ctakes-chunker/data/treebank/genia/README
A         ctakes-chunker/data/treebank/genia/names-00.txt
A         ctakes-chunker/pom.xml
A         ctakes-chunker/resources
A         ctakes-chunker/resources/launch
AU        ctakes-chunker/resources/launch/ChunkAdjusterTests.launch
AU        ctakes-chunker/resources/launch/chunker.launch
AU        ctakes-chunker/resources/launch/UIMA_CPE_GUI--chunker.launch
A         ctakes-chunker/README
A         ctakes-chunker/ExampleTrainChunker.bat
A         ctakes-chunker/desc
A         ctakes-chunker/desc/ChunkAdjuster.xml
A         ctakes-chunker/desc/POSTagger.xml
A         ctakes-chunker/desc/AggregateAE.xml
A         ctakes-chunker/desc/collection_processing_engine
A         ctakes-chunker/desc/Chunker.xml
A         ctakes-chunker/desc/test
A         ctakes-chunker/desc/test/ChunkerAggregate.xml
A         ctakes-chunker/desc/test/ChunkerCPE.xml
A         ctakes-chunker/desc/test/POSTagger.xml
A         ctakes-chunker/desc/test/PhraseTypeChunkerAggregate.xml
A         ctakes-chunker/desc/test/Chunker.xml
A         ctakes-chunker/desc/test/TokenizerAnnotator.xml
A         ctakes-chunker/desc/test/ChunkAdjusterAggregate.xml
A         ctakes-chunker/desc/test/ChunkerCpeUsingPosTagDictionary.xml
A         ctakes-chunker/desc/test/SimpleSegmentAnnotator.xml
A         ctakes-chunker/desc/test/AdjustNounPhraseToIncludeFollowingPPNP.xml
A         ctakes-chunker/desc/SimpleSegmentAnnotator.xml
A         ctakes-chunker/desc/AdjustNounPhraseToIncludeFollowingNP.xml
A         ctakes-chunker/desc/AdjustNounPhraseToIncludeFollowingPPNP.xml
A         ctakes-chunker/desc/AdjustOPhraseToIncludeFollowingO.xml
A         ctakes-chunker/desc/ChunkerAggregate.xml
A         ctakes-chunker/desc/ChunkerCPE.xml
A         ctakes-chunker/desc/analysis_engine
A         ctakes-pos-tagger-res
A         ctakes-pos-tagger-res/pom.xml
A         ctakes-pos-tagger-res/LICENSE
A         ctakes-pos-tagger-res/src
A         ctakes-pos-tagger-res/src/test
A         ctakes-pos-tagger-res/src/main
A         ctakes-pos-tagger-res/src/main/resources
A         ctakes-pos-tagger-res/src/main/resources/org
A         ctakes-pos-tagger-res/src/main/resources/org/apache
A         ctakes-pos-tagger-res/src/main/resources/org/apache/ctakes
A         ctakes-pos-tagger-res/src/main/resources/org/apache/ctakes/postagger
A         ctakes-pos-tagger-res/src/main/resources/org/apache/ctakes/postagger/models
A         ctakes-pos-tagger-res/src/main/resources/org/apache/ctakes/postagger/models/clearnlp
AU        ctakes-pos-tagger-res/src/main/resources/org/apache/ctakes/postagger/models/clearnlp/mayo-en-pos-1.3.0.jar
AU        ctakes-pos-tagger-res/src/main/resources/org/apache/ctakes/postagger/models/mayo-pos.zip
A         ctakes-pos-tagger-res/src/main/resources/org/apache/ctakes/postagger/models/README
AU        KEYS
 U        .
At revision 1809788

Parsing POMs
ERROR: Failed to parse POMs
java.io.IOException: remote file operation failed: <https://builds.apache.org/job/ctakes-trunk-compiletest/ws/>
at hudson.remoting.Channel@6d2aa5d3:H27: hudson.remoting.ProxyException: hudson.maven.MavenModuleSetBuild$MavenExecutionException:
org.apache.maven.project.ProjectBuildingException: Some problems were encountered while processing
the POMs:
[ERROR] Child module <https://builds.apache.org/job/ctakes-trunk-compiletest/ws/ctakes-scaleout>
of <https://builds.apache.org/job/ctakes-trunk-compiletest/ws/pom.xml> does not exist
@ 

	at hudson.FilePath.act(FilePath.java:993)
	at hudson.FilePath.act(FilePath.java:975)
	at hudson.maven.MavenModuleSetBuild$MavenModuleSetBuildExecution.parsePoms(MavenModuleSetBuild.java:985)
	at hudson.maven.MavenModuleSetBuild$MavenModuleSetBuildExecution.doRun(MavenModuleSetBuild.java:690)
	at hudson.model.AbstractBuild$AbstractBuildExecution.run(AbstractBuild.java:490)
	at hudson.model.Run.execute(Run.java:1735)
	at hudson.maven.MavenModuleSetBuild.run(MavenModuleSetBuild.java:542)
	at hudson.model.ResourceController.execute(ResourceController.java:97)
	at hudson.model.Executor.run(Executor.java:405)
Caused by: hudson.remoting.ProxyException: hudson.maven.MavenModuleSetBuild$MavenExecutionException:
org.apache.maven.project.ProjectBuildingException: Some problems were encountered while processing
the POMs:
[ERROR] Child module <https://builds.apache.org/job/ctakes-trunk-compiletest/ws/ctakes-scaleout>
of <https://builds.apache.org/job/ctakes-trunk-compiletest/ws/pom.xml> does not exist
@ 

	at hudson.maven.MavenModuleSetBuild$PomParser.invoke(MavenModuleSetBuild.java:1389)
	at hudson.maven.MavenModuleSetBuild$PomParser.invoke(MavenModuleSetBuild.java:1123)
	at hudson.FilePath$FileCallableWrapper.call(FilePath.java:2739)
	at hudson.remoting.UserRequest.perform(UserRequest.java:153)
	at hudson.remoting.UserRequest.perform(UserRequest.java:50)
	at hudson.remoting.Request$2.run(Request.java:336)
	at hudson.remoting.InterceptingExecutorService$1.call(InterceptingExecutorService.java:68)
	at java.util.concurrent.FutureTask.run(FutureTask.java:266)
	at java.util.concurrent.ThreadPoolExecutor.runWorker(ThreadPoolExecutor.java:1142)
	at java.util.concurrent.ThreadPoolExecutor$Worker.run(ThreadPoolExecutor.java:617)
	at java.lang.Thread.run(Thread.java:748)
	at ......remote call to H27(Native Method)
	at hudson.remoting.Channel.attachCallSiteStackTrace(Channel.java:1545)
	at hudson.remoting.UserResponse.retrieve(UserRequest.java:253)
	at hudson.remoting.Channel.call(Channel.java:830)
	at hudson.FilePath.act(FilePath.java:986)
	... 8 more
Caused by: hudson.remoting.ProxyException: org.apache.maven.project.ProjectBuildingException:
Some problems were encountered while processing the POMs:
[ERROR] Child module <https://builds.apache.org/job/ctakes-trunk-compiletest/ws/ctakes-scaleout>
of <https://builds.apache.org/job/ctakes-trunk-compiletest/ws/pom.xml> does not exist
@ 

	at org.apache.maven.project.DefaultProjectBuilder.build(DefaultProjectBuilder.java:364)
	at hudson.maven.MavenEmbedder.buildProjects(MavenEmbedder.java:361)
	at hudson.maven.MavenEmbedder.readProjects(MavenEmbedder.java:331)
	at hudson.maven.MavenModuleSetBuild$PomParser.invoke(MavenModuleSetBuild.java:1326)
	at hudson.maven.MavenModuleSetBuild$PomParser.invoke(MavenModuleSetBuild.java:1123)
	at hudson.FilePath$FileCallableWrapper.call(FilePath.java:2739)
	at hudson.remoting.UserRequest.perform(UserRequest.java:153)
	at hudson.remoting.UserRequest.perform(UserRequest.java:50)
	at hudson.remoting.Request$2.run(Request.java:336)
	at hudson.remoting.InterceptingExecutorService$1.call(InterceptingExecutorService.java:68)
	at java.util.concurrent.FutureTask.run(FutureTask.java:266)
	at java.util.concurrent.ThreadPoolExecutor.runWorker(ThreadPoolExecutor.java:1142)
	at java.util.concurrent.ThreadPoolExecutor$Worker.run(ThreadPoolExecutor.java:617)
	at java.lang.Thread.run(Thread.java:748)

Mime
View raw message