ctakes-notifications mailing list archives

Site index · List index
Message view « Date » · « Thread »
Top « Date » · « Thread »
From Apache Jenkins Server <jenk...@builds.apache.org>
Subject Build failed in Jenkins: ctakes-trunk-package #593
Date Sat, 26 Aug 2017 12:01:44 GMT
See <https://builds.apache.org/job/ctakes-trunk-package/593/display/redirect?page=changes>

Changes:

[tmill] Changes to coreference for processing multiple notes per patient in a single cas.

------------------------------------------
[...truncated 388.32 KB...]
[INFO] JCasGen: Creating: 'org.apache.ctakes.coreference.type.PredicateArgRelation'.
[INFO] JCasGen: Creating: 'org.apache.ctakes.coreference.type.PredicateArgRelation_Type'.
[INFO] JCasGen: Creating: 'org.apache.ctakes.coreference.type.PronounMarkable'.
[INFO] JCasGen: Creating: 'org.apache.ctakes.coreference.type.PronounMarkable_Type'.
[INFO] JCasGen: Creating: 'org.apache.ctakes.coreference.type.Properties'.
[INFO] JCasGen: Creating: 'org.apache.ctakes.coreference.type.Properties_Type'.
[INFO] JCasGen: Creating: 'org.apache.ctakes.coreference.type.Relation'.
[INFO] JCasGen: Creating: 'org.apache.ctakes.coreference.type.Relation_Type'.
[INFO] JCasGen: Creating: 'org.apache.ctakes.coreference.type.RelationArgument'.
[INFO] JCasGen: Creating: 'org.apache.ctakes.coreference.type.RelationArgument_Type'.
[INFO] JCasGen: Creating: 'org.apache.ctakes.coreference.type.UnrelationArgument'.
[INFO] JCasGen: Creating: 'org.apache.ctakes.coreference.type.UnrelationArgument_Type'.
[INFO] JCasGen: Creating: 'org.apache.ctakes.coreference.type.VecInstance'.
[INFO] JCasGen: Creating: 'org.apache.ctakes.coreference.type.VecInstance_Type'.
[INFO] 
[INFO] --- maven-compiler-plugin:2.4:compile (default-compile) @ ctakes-coreference ---
[INFO] Compiling 130 source files to <https://builds.apache.org/job/ctakes-trunk-package/ws/ctakes-coreference/target/classes>
[INFO] -------------------------------------------------------------
[ERROR] COMPILATION ERROR : 
[INFO] -------------------------------------------------------------
[ERROR] <https://builds.apache.org/job/ctakes-trunk-package/ws/ctakes-coreference/src/main/java/org/apache/ctakes/coreference/eval/EvaluationOfEventCoreference.java>:[46,36]
error: cannot find symbol
[ERROR]   symbol:   class ThymePatientViewAnnotator
  location: package org.apache.ctakes.temporal.ae
<https://builds.apache.org/job/ctakes-trunk-package/ws/ctakes-coreference/src/main/java/org/apache/ctakes/coreference/eval/EvaluationOfEventCoreference.java>:[280,37]
error: cannot find symbol
[ERROR]   symbol:   variable MAX_DOC_VIEWS
  location: class EvaluationOfEventCoreference
<https://builds.apache.org/job/ctakes-trunk-package/ws/ctakes-coreference/src/main/java/org/apache/ctakes/coreference/eval/EvaluationOfEventCoreference.java>:[413,35]
error: cannot find symbol
[ERROR]   symbol:   variable MAX_DOC_VIEWS
  location: class EvaluationOfEventCoreference
<https://builds.apache.org/job/ctakes-trunk-package/ws/ctakes-coreference/src/main/java/org/apache/ctakes/coreference/eval/EvaluationOfEventCoreference.java>:[477,35]
error: cannot find symbol
[ERROR]   symbol:   variable MAX_DOC_VIEWS
  location: class EvaluationOfEventCoreference
<https://builds.apache.org/job/ctakes-trunk-package/ws/ctakes-coreference/src/main/java/org/apache/ctakes/coreference/eval/EvaluationOfEventCoreference.java>:[564,66]
error: cannot find symbol
[ERROR]   symbol:   class ThymePatientViewAnnotator
  location: class EvaluationOfEventCoreference
<https://builds.apache.org/job/ctakes-trunk-package/ws/ctakes-coreference/src/main/java/org/apache/ctakes/coreference/eval/EvaluationOfEventCoreference.java>:[567,23]
error: cannot find symbol
[ERROR]   symbol:   variable MAX_DOC_VIEWS
  location: class EvaluationOfEventCoreference
<https://builds.apache.org/job/ctakes-trunk-package/ws/ctakes-coreference/src/main/java/org/apache/ctakes/coreference/eval/EvaluationOfEventCoreference.java>:[573,21]
error: cannot find symbol
[ERROR]   symbol:   method getLinguisticProcessingDescription()
  location: class EvaluationOfEventCoreference
<https://builds.apache.org/job/ctakes-trunk-package/ws/ctakes-coreference/src/main/java/org/apache/ctakes/coreference/eval/EvaluationOfEventCoreference.java>:[575,21]
error: cannot find symbol
[ERROR]   symbol:   method getGoldWritingAggregate(String)
  location: class EvaluationOfEventCoreference
<https://builds.apache.org/job/ctakes-trunk-package/ws/ctakes-coreference/src/main/java/org/apache/ctakes/coreference/util/SvmVectorCreator.java>:[53,50]
[deprecation] locateFile(String) in FileLocator has been deprecated
[ERROR] <https://builds.apache.org/job/ctakes-trunk-package/ws/ctakes-coreference/src/main/java/org/apache/ctakes/coreference/cc/ODIEVectorFileWriter.java>:[169,30]
[deprecation] locateFile(String) in FileLocator has been deprecated
[ERROR] <https://builds.apache.org/job/ctakes-trunk-package/ws/ctakes-coreference/src/main/java/org/apache/ctakes/coreference/cc/ODIEVectorFileWriter.java>:[185,30]
[deprecation] locateFile(String) in FileLocator has been deprecated
[ERROR] <https://builds.apache.org/job/ctakes-trunk-package/ws/ctakes-coreference/src/main/java/org/apache/ctakes/coreference/util/SyntaxAttributeCalculator.java>:[97,36]
[deprecation] locateFile(String) in FileLocator has been deprecated
[INFO] 12 errors 
[INFO] -------------------------------------------------------------
[INFO] ------------------------------------------------------------------------
[INFO] Reactor Summary:
[INFO] 
[INFO] Apache cTAKES ..................................... SUCCESS [3.094s]
[INFO] ctakes-gui-res .................................... SUCCESS [2.214s]
[INFO] Apache cTAKES Resources core ...................... SUCCESS [1.076s]
[INFO] Apache cTAKES common type system .................. SUCCESS [10.099s]
[INFO] Apache cTAKES utils ............................... SUCCESS [3.546s]
[INFO] Apache cTAKES core ................................ SUCCESS [10.744s]
[INFO] ctakes-gui ........................................ SUCCESS [5.477s]
[INFO] Apache cTAKES Resources pos-tagger ................ SUCCESS [4.043s]
[INFO] Apache cTAKES part-of-speech tagger ............... SUCCESS [3.661s]
[INFO] Apache cTAKES Resources ctakes-chunker-res ........ SUCCESS [19.344s]
[INFO] Apache cTAKES chunker ............................. SUCCESS [2.332s]
[INFO] Apache cTAKES document preprocessor ............... SUCCESS [2.078s]
[INFO] Apache cTAKES Resources dictionary-lookup ......... SUCCESS [20.852s]
[INFO] Apache cTAKES dictionary lookup ................... SUCCESS [4.166s]
[INFO] Apache cTAKES context dependent tokenizer ......... SUCCESS [1.520s]
[INFO] Apache cTAKES Resources lvg ....................... SUCCESS [38.905s]
[INFO] Apache cTAKES LVG lexical tools ................... SUCCESS [3.740s]
[INFO] Apache cTAKES Resources ne-contexts ............... SUCCESS [0.740s]
[INFO] Apache cTAKES named entity contexts ............... SUCCESS [1.272s]
[INFO] Apache cTAKES Resources constituency-parser ....... SUCCESS [5.040s]
[INFO] Apache cTAKES Constituency Parser ................. SUCCESS [1.815s]
[INFO] Apache cTAKES Resources coreference ............... SUCCESS [8.773s]
[INFO] Apache cTAKES Resources temporal .................. SUCCESS [1.740s]
[INFO] Apache cTAKES Resources relation-extractor ........ SUCCESS [0.957s]
[INFO] Apache cTAKES Resources dictionary-lookup-fast-res  SUCCESS [2.133s]
[INFO] Apache cTAKES dictionary lookup fast .............. SUCCESS [5.863s]
[INFO] Apache cTAKES Resources assertion ................. SUCCESS [4.758s]
[INFO] Apache cTAKES Resources dependency-parser ......... SUCCESS [39.075s]
[INFO] Apache cTAKES Dependency Parser ................... SUCCESS [4.908s]
[INFO] Apache cTAKES Assertion ........................... SUCCESS [8.500s]
[INFO] ctakes-clinical-pipeline-res ...................... SUCCESS [0.742s]
[INFO] Apache cTAKES ctakes-clinical-pipeline ............ SUCCESS [8.038s]
[INFO] Apache cTAKES Relation Extractor .................. SUCCESS [12.460s]
[INFO] Apache cTAKES Temporal Information Extraction ..... SUCCESS [1:05.416s]
[INFO] Apache cTAKES CoReference Resolver ................ FAILURE [17.168s]
[INFO] Apache cTAKES Resources drug-ner .................. SKIPPED
[INFO] Apache cTAKES Drug NER ............................ SKIPPED
[INFO] Apache cTAKES Resources side-effect ............... SKIPPED
[INFO] Apache cTAKES Side Effects ........................ SKIPPED
[INFO] Apache cTAKES Resources smoking-status ............ SKIPPED
[INFO] Apache cTAKES Smoking Status ...................... SKIPPED
[INFO] Apache cTAKES Resources assertion-zoner ........... SKIPPED
[INFO] Apache cTAKES Assertion's zoner ................... SKIPPED
[INFO] ctakes-examples-res ............................... SKIPPED
[INFO] ctakes-examples ................................... SKIPPED
[INFO] Apache cTAKES Resources ctakes-ytex-res ........... SKIPPED
[INFO] Apache cTAKES YTEX ................................ SKIPPED
[INFO] Apache cTAKES YTEX UIMA ........................... SKIPPED
[INFO] Apache cTAKES YTEX Web ............................ SKIPPED
[INFO] Apache cTAKES Distribution ........................ SKIPPED
[INFO] Apache cTAKES Regression-test ..................... SKIPPED
[INFO] Apache cTAKES template filler ..................... SKIPPED
[INFO] ------------------------------------------------------------------------
[INFO] BUILD FAILURE
[INFO] ------------------------------------------------------------------------
[INFO] Total time: 5:45.321s
[INFO] Finished at: Sat Aug 26 11:49:40 UTC 2017
[INFO] Final Memory: 77M/733M
[INFO] ------------------------------------------------------------------------
Waiting for Jenkins to finish collecting data[ERROR] Failed to execute goal org.apache.maven.plugins:maven-compiler-plugin:2.4:compile
(default-compile) on project ctakes-coreference: Compilation failure: Compilation failure:
[ERROR] <https://builds.apache.org/job/ctakes-trunk-package/ws/ctakes-coreference/src/main/java/org/apache/ctakes/coreference/eval/EvaluationOfEventCoreference.java>:[46,36]
error: cannot find symbol
[ERROR] symbol:   class ThymePatientViewAnnotator
[ERROR] location: package org.apache.ctakes.temporal.ae
[ERROR] <https://builds.apache.org/job/ctakes-trunk-package/ws/ctakes-coreference/src/main/java/org/apache/ctakes/coreference/eval/EvaluationOfEventCoreference.java>:[280,37]
error: cannot find symbol
[ERROR] symbol:   variable MAX_DOC_VIEWS
[ERROR] location: class EvaluationOfEventCoreference
[ERROR] <https://builds.apache.org/job/ctakes-trunk-package/ws/ctakes-coreference/src/main/java/org/apache/ctakes/coreference/eval/EvaluationOfEventCoreference.java>:[413,35]
error: cannot find symbol
[ERROR] symbol:   variable MAX_DOC_VIEWS
[ERROR] location: class EvaluationOfEventCoreference
[ERROR] <https://builds.apache.org/job/ctakes-trunk-package/ws/ctakes-coreference/src/main/java/org/apache/ctakes/coreference/eval/EvaluationOfEventCoreference.java>:[477,35]
error: cannot find symbol
[ERROR] symbol:   variable MAX_DOC_VIEWS
[ERROR] location: class EvaluationOfEventCoreference
[ERROR] <https://builds.apache.org/job/ctakes-trunk-package/ws/ctakes-coreference/src/main/java/org/apache/ctakes/coreference/eval/EvaluationOfEventCoreference.java>:[564,66]
error: cannot find symbol
[ERROR] symbol:   class ThymePatientViewAnnotator
[ERROR] location: class EvaluationOfEventCoreference
[ERROR] <https://builds.apache.org/job/ctakes-trunk-package/ws/ctakes-coreference/src/main/java/org/apache/ctakes/coreference/eval/EvaluationOfEventCoreference.java>:[567,23]
error: cannot find symbol
[ERROR] symbol:   variable MAX_DOC_VIEWS
[ERROR] location: class EvaluationOfEventCoreference
[ERROR] <https://builds.apache.org/job/ctakes-trunk-package/ws/ctakes-coreference/src/main/java/org/apache/ctakes/coreference/eval/EvaluationOfEventCoreference.java>:[573,21]
error: cannot find symbol
[ERROR] symbol:   method getLinguisticProcessingDescription()
[ERROR] location: class EvaluationOfEventCoreference
[ERROR] <https://builds.apache.org/job/ctakes-trunk-package/ws/ctakes-coreference/src/main/java/org/apache/ctakes/coreference/eval/EvaluationOfEventCoreference.java>:[575,21]
error: cannot find symbol
[ERROR] symbol:   method getGoldWritingAggregate(String)
[ERROR] location: class EvaluationOfEventCoreference
[ERROR] <https://builds.apache.org/job/ctakes-trunk-package/ws/ctakes-coreference/src/main/java/org/apache/ctakes/coreference/util/SvmVectorCreator.java>:[53,50]
[deprecation] locateFile(String) in FileLocator has been deprecated
[ERROR] <https://builds.apache.org/job/ctakes-trunk-package/ws/ctakes-coreference/src/main/java/org/apache/ctakes/coreference/cc/ODIEVectorFileWriter.java>:[169,30]
[deprecation] locateFile(String) in FileLocator has been deprecated
[ERROR] <https://builds.apache.org/job/ctakes-trunk-package/ws/ctakes-coreference/src/main/java/org/apache/ctakes/coreference/cc/ODIEVectorFileWriter.java>:[185,30]
[deprecation] locateFile(String) in FileLocator has been deprecated
[ERROR] <https://builds.apache.org/job/ctakes-trunk-package/ws/ctakes-coreference/src/main/java/org/apache/ctakes/coreference/util/SyntaxAttributeCalculator.java>:[97,36]
[deprecation] locateFile(String) in FileLocator has been deprecated
[ERROR] -> [Help 1]
[ERROR] 
[ERROR] To see the full stack trace of the errors, re-run Maven with the -e switch.
[ERROR] Re-run Maven using the -X switch to enable full debug logging.
[ERROR] 
[ERROR] For more information about the errors and possible solutions, please read the following
articles:

[ERROR] [Help 1] http://cwiki.apache.org/confluence/display/MAVEN/MojoFailureException
[ERROR] 
[ERROR] After correcting the problems, you can resume the build with the command
[ERROR]   mvn <goals> -rf :ctakes-coreference
[JENKINS] Archiving <https://builds.apache.org/job/ctakes-trunk-package/ws/ctakes-clinical-pipeline/pom.xml>
to org.apache.ctakes/ctakes-clinical-pipeline/4.0.1-SNAPSHOT/ctakes-clinical-pipeline-4.0.1-SNAPSHOT.pom
[JENKINS] Archiving <https://builds.apache.org/job/ctakes-trunk-package/ws/ctakes-clinical-pipeline/target/ctakes-clinical-pipeline-4.0.1-SNAPSHOT.jar>
to org.apache.ctakes/ctakes-clinical-pipeline/4.0.1-SNAPSHOT/ctakes-clinical-pipeline-4.0.1-SNAPSHOT.jar
[JENKINS] Archiving <https://builds.apache.org/job/ctakes-trunk-package/ws/ctakes-type-system/pom.xml>
to org.apache.ctakes/ctakes-type-system/4.0.1-SNAPSHOT/ctakes-type-system-4.0.1-SNAPSHOT.pom
[JENKINS] Archiving <https://builds.apache.org/job/ctakes-trunk-package/ws/ctakes-type-system/target/ctakes-type-system-4.0.1-SNAPSHOT.jar>
to org.apache.ctakes/ctakes-type-system/4.0.1-SNAPSHOT/ctakes-type-system-4.0.1-SNAPSHOT.jar
[JENKINS] Archiving <https://builds.apache.org/job/ctakes-trunk-package/ws/ctakes-dictionary-lookup/pom.xml>
to org.apache.ctakes/ctakes-dictionary-lookup/4.0.1-SNAPSHOT/ctakes-dictionary-lookup-4.0.1-SNAPSHOT.pom
[JENKINS] Archiving <https://builds.apache.org/job/ctakes-trunk-package/ws/ctakes-dictionary-lookup/target/ctakes-dictionary-lookup-4.0.1-SNAPSHOT.jar>
to org.apache.ctakes/ctakes-dictionary-lookup/4.0.1-SNAPSHOT/ctakes-dictionary-lookup-4.0.1-SNAPSHOT.jar
[JENKINS] Archiving <https://builds.apache.org/job/ctakes-trunk-package/ws/ctakes-constituency-parser/pom.xml>
to org.apache.ctakes/ctakes-constituency-parser/4.0.1-SNAPSHOT/ctakes-constituency-parser-4.0.1-SNAPSHOT.pom
[JENKINS] Archiving <https://builds.apache.org/job/ctakes-trunk-package/ws/ctakes-constituency-parser/target/ctakes-constituency-parser-4.0.1-SNAPSHOT.jar>
to org.apache.ctakes/ctakes-constituency-parser/4.0.1-SNAPSHOT/ctakes-constituency-parser-4.0.1-SNAPSHOT.jar
[JENKINS] Archiving <https://builds.apache.org/job/ctakes-trunk-package/ws/ctakes-examples-res/pom.xml>
to org.apache.ctakes/ctakes-examples-res/4.0.1-SNAPSHOT/ctakes-examples-res-4.0.1-SNAPSHOT.pom
[JENKINS] Archiving <https://builds.apache.org/job/ctakes-trunk-package/ws/ctakes-temporal/pom.xml>
to org.apache.ctakes/ctakes-temporal/4.0.1-SNAPSHOT/ctakes-temporal-4.0.1-SNAPSHOT.pom
[JENKINS] Archiving <https://builds.apache.org/job/ctakes-trunk-package/ws/ctakes-temporal/target/ctakes-temporal-4.0.1-SNAPSHOT.jar>
to org.apache.ctakes/ctakes-temporal/4.0.1-SNAPSHOT/ctakes-temporal-4.0.1-SNAPSHOT.jar
[Fast Archiver] Compressed 57.89 MB of artifacts by 97.8% relative to #592
[JENKINS] Archiving <https://builds.apache.org/job/ctakes-trunk-package/ws/ctakes-chunker-res/pom.xml>
to org.apache.ctakes/ctakes-chunker-res/4.0.1-SNAPSHOT/ctakes-chunker-res-4.0.1-SNAPSHOT.pom
[JENKINS] Archiving <https://builds.apache.org/job/ctakes-trunk-package/ws/ctakes-chunker-res/target/ctakes-chunker-res-4.0.1-SNAPSHOT.jar>
to org.apache.ctakes/ctakes-chunker-res/4.0.1-SNAPSHOT/ctakes-chunker-res-4.0.1-SNAPSHOT.jar
[Fast Archiver] Compressed 12.16 MB of artifacts by 99.7% relative to #592
[JENKINS] Archiving <https://builds.apache.org/job/ctakes-trunk-package/ws/ctakes-regression-test/pom.xml>
to org.apache.ctakes/ctakes-regression-test/4.0.1-SNAPSHOT/ctakes-regression-test-4.0.1-SNAPSHOT.pom
[JENKINS] Archiving <https://builds.apache.org/job/ctakes-trunk-package/ws/ctakes-relation-extractor/pom.xml>
to org.apache.ctakes/ctakes-relation-extractor/4.0.1-SNAPSHOT/ctakes-relation-extractor-4.0.1-SNAPSHOT.pom
[JENKINS] Archiving <https://builds.apache.org/job/ctakes-trunk-package/ws/ctakes-relation-extractor/target/ctakes-relation-extractor-4.0.1-SNAPSHOT.jar>
to org.apache.ctakes/ctakes-relation-extractor/4.0.1-SNAPSHOT/ctakes-relation-extractor-4.0.1-SNAPSHOT.jar
[JENKINS] Archiving <https://builds.apache.org/job/ctakes-trunk-package/ws/ctakes-gui/pom.xml>
to org.apache.ctakes/ctakes-gui/4.0.1-SNAPSHOT/ctakes-gui-4.0.1-SNAPSHOT.pom
[JENKINS] Archiving <https://builds.apache.org/job/ctakes-trunk-package/ws/ctakes-gui/target/ctakes-gui-4.0.1-SNAPSHOT.jar>
to org.apache.ctakes/ctakes-gui/4.0.1-SNAPSHOT/ctakes-gui-4.0.1-SNAPSHOT.jar
[JENKINS] Archiving <https://builds.apache.org/job/ctakes-trunk-package/ws/ctakes-preprocessor/pom.xml>
to org.apache.ctakes/ctakes-preprocessor/4.0.1-SNAPSHOT/ctakes-preprocessor-4.0.1-SNAPSHOT.pom
[JENKINS] Archiving <https://builds.apache.org/job/ctakes-trunk-package/ws/ctakes-preprocessor/target/ctakes-preprocessor-4.0.1-SNAPSHOT.jar>
to org.apache.ctakes/ctakes-preprocessor/4.0.1-SNAPSHOT/ctakes-preprocessor-4.0.1-SNAPSHOT.jar
[JENKINS] Archiving <https://builds.apache.org/job/ctakes-trunk-package/ws/ctakes-assertion-res/pom.xml>
to org.apache.ctakes/ctakes-assertion-res/4.0.1-SNAPSHOT/ctakes-assertion-res-4.0.1-SNAPSHOT.pom
[JENKINS] Archiving <https://builds.apache.org/job/ctakes-trunk-package/ws/ctakes-assertion-res/target/ctakes-assertion-res-4.0.1-SNAPSHOT.jar>
to org.apache.ctakes/ctakes-assertion-res/4.0.1-SNAPSHOT/ctakes-assertion-res-4.0.1-SNAPSHOT.jar
[Fast Archiver] Compressed 11.18 MB of artifacts by 95.8% relative to #592
[JENKINS] Archiving <https://builds.apache.org/job/ctakes-trunk-package/ws/ctakes-assertion-zoner-res/pom.xml>
to org.apache.ctakes/ctakes-assertion-zoner-res/4.0.1-SNAPSHOT/ctakes-assertion-zoner-res-4.0.1-SNAPSHOT.pom
[JENKINS] Archiving <https://builds.apache.org/job/ctakes-trunk-package/ws/ctakes-assertion-zoner/pom.xml>
to org.apache.ctakes/ctakes-assertion-zoner/4.0.1-SNAPSHOT/ctakes-assertion-zoner-4.0.1-SNAPSHOT.pom
[JENKINS] Archiving <https://builds.apache.org/job/ctakes-trunk-package/ws/ctakes-ne-contexts-res/pom.xml>
to org.apache.ctakes/ctakes-ne-contexts-res/4.0.1-SNAPSHOT/ctakes-ne-contexts-res-4.0.1-SNAPSHOT.pom
[JENKINS] Archiving <https://builds.apache.org/job/ctakes-trunk-package/ws/ctakes-ne-contexts-res/target/ctakes-ne-contexts-res-4.0.1-SNAPSHOT.jar>
to org.apache.ctakes/ctakes-ne-contexts-res/4.0.1-SNAPSHOT/ctakes-ne-contexts-res-4.0.1-SNAPSHOT.jar
[JENKINS] Archiving <https://builds.apache.org/job/ctakes-trunk-package/ws/ctakes-drug-ner/pom.xml>
to org.apache.ctakes/ctakes-drug-ner/4.0.1-SNAPSHOT/ctakes-drug-ner-4.0.1-SNAPSHOT.pom
[JENKINS] Archiving <https://builds.apache.org/job/ctakes-trunk-package/ws/ctakes-ytex-web/pom.xml>
to org.apache.ctakes/ctakes-ytex-web/4.0.1-SNAPSHOT/ctakes-ytex-web-4.0.1-SNAPSHOT.pom
[JENKINS] Archiving <https://builds.apache.org/job/ctakes-trunk-package/ws/ctakes-context-tokenizer/pom.xml>
to org.apache.ctakes/ctakes-context-tokenizer/4.0.1-SNAPSHOT/ctakes-context-tokenizer-4.0.1-SNAPSHOT.pom
[JENKINS] Archiving <https://builds.apache.org/job/ctakes-trunk-package/ws/ctakes-context-tokenizer/target/ctakes-context-tokenizer-4.0.1-SNAPSHOT.jar>
to org.apache.ctakes/ctakes-context-tokenizer/4.0.1-SNAPSHOT/ctakes-context-tokenizer-4.0.1-SNAPSHOT.jar
[JENKINS] Archiving <https://builds.apache.org/job/ctakes-trunk-package/ws/ctakes-side-effect-res/pom.xml>
to org.apache.ctakes/ctakes-side-effect-res/4.0.1-SNAPSHOT/ctakes-side-effect-res-4.0.1-SNAPSHOT.pom
[JENKINS] Archiving <https://builds.apache.org/job/ctakes-trunk-package/ws/ctakes-examples/pom.xml>
to org.apache.ctakes/ctakes-examples/4.0.1-SNAPSHOT/ctakes-examples-4.0.1-SNAPSHOT.pom
[JENKINS] Archiving <https://builds.apache.org/job/ctakes-trunk-package/ws/ctakes-dictionary-lookup-fast-res/pom.xml>
to org.apache.ctakes/ctakes-dictionary-lookup-fast-res/4.0.1-SNAPSHOT/ctakes-dictionary-lookup-fast-res-4.0.1-SNAPSHOT.pom
[JENKINS] Archiving <https://builds.apache.org/job/ctakes-trunk-package/ws/ctakes-dictionary-lookup-fast-res/target/ctakes-dictionary-lookup-fast-res-4.0.1-SNAPSHOT.jar>
to org.apache.ctakes/ctakes-dictionary-lookup-fast-res/4.0.1-SNAPSHOT/ctakes-dictionary-lookup-fast-res-4.0.1-SNAPSHOT.jar
[JENKINS] Archiving <https://builds.apache.org/job/ctakes-trunk-package/ws/ctakes-dictionary-lookup-fast/pom.xml>
to org.apache.ctakes/ctakes-dictionary-lookup-fast/4.0.1-SNAPSHOT/ctakes-dictionary-lookup-fast-4.0.1-SNAPSHOT.pom
[JENKINS] Archiving <https://builds.apache.org/job/ctakes-trunk-package/ws/ctakes-dictionary-lookup-fast/target/ctakes-dictionary-lookup-fast-4.0.1-SNAPSHOT.jar>
to org.apache.ctakes/ctakes-dictionary-lookup-fast/4.0.1-SNAPSHOT/ctakes-dictionary-lookup-fast-4.0.1-SNAPSHOT.jar
[JENKINS] Archiving <https://builds.apache.org/job/ctakes-trunk-package/ws/ctakes-ne-contexts/pom.xml>
to org.apache.ctakes/ctakes-ne-contexts/4.0.1-SNAPSHOT/ctakes-ne-contexts-4.0.1-SNAPSHOT.pom
[JENKINS] Archiving <https://builds.apache.org/job/ctakes-trunk-package/ws/ctakes-ne-contexts/target/ctakes-ne-contexts-4.0.1-SNAPSHOT.jar>
to org.apache.ctakes/ctakes-ne-contexts/4.0.1-SNAPSHOT/ctakes-ne-contexts-4.0.1-SNAPSHOT.jar
[JENKINS] Archiving <https://builds.apache.org/job/ctakes-trunk-package/ws/ctakes-lvg/pom.xml>
to org.apache.ctakes/ctakes-lvg/4.0.1-SNAPSHOT/ctakes-lvg-4.0.1-SNAPSHOT.pom
[JENKINS] Archiving <https://builds.apache.org/job/ctakes-trunk-package/ws/ctakes-lvg/target/ctakes-lvg-4.0.1-SNAPSHOT.jar>
to org.apache.ctakes/ctakes-lvg/4.0.1-SNAPSHOT/ctakes-lvg-4.0.1-SNAPSHOT.jar
[JENKINS] Archiving <https://builds.apache.org/job/ctakes-trunk-package/ws/ctakes-smoking-status-res/pom.xml>
to org.apache.ctakes/ctakes-smoking-status-res/4.0.1-SNAPSHOT/ctakes-smoking-status-res-4.0.1-SNAPSHOT.pom
[JENKINS] Archiving <https://builds.apache.org/job/ctakes-trunk-package/ws/ctakes-pos-tagger/pom.xml>
to org.apache.ctakes/ctakes-pos-tagger/4.0.1-SNAPSHOT/ctakes-pos-tagger-4.0.1-SNAPSHOT.pom
[JENKINS] Archiving <https://builds.apache.org/job/ctakes-trunk-package/ws/ctakes-pos-tagger/target/ctakes-pos-tagger-4.0.1-SNAPSHOT.jar>
to org.apache.ctakes/ctakes-pos-tagger/4.0.1-SNAPSHOT/ctakes-pos-tagger-4.0.1-SNAPSHOT.jar
[JENKINS] Archiving <https://builds.apache.org/job/ctakes-trunk-package/ws/ctakes-side-effect/pom.xml>
to org.apache.ctakes/ctakes-side-effect/4.0.1-SNAPSHOT/ctakes-side-effect-4.0.1-SNAPSHOT.pom
[JENKINS] Archiving <https://builds.apache.org/job/ctakes-trunk-package/ws/ctakes-template-filler/pom.xml>
to org.apache.ctakes/ctakes-template-filler/4.0.1-SNAPSHOT/ctakes-template-filler-4.0.1-SNAPSHOT.pom
[JENKINS] Archiving <https://builds.apache.org/job/ctakes-trunk-package/ws/pom.xml>
to org.apache.ctakes/ctakes/4.0.1-SNAPSHOT/ctakes-4.0.1-SNAPSHOT.pom
[JENKINS] Archiving <https://builds.apache.org/job/ctakes-trunk-package/ws/ctakes-chunker/pom.xml>
to org.apache.ctakes/ctakes-chunker/4.0.1-SNAPSHOT/ctakes-chunker-4.0.1-SNAPSHOT.pom
[JENKINS] Archiving <https://builds.apache.org/job/ctakes-trunk-package/ws/ctakes-chunker/target/ctakes-chunker-4.0.1-SNAPSHOT.jar>
to org.apache.ctakes/ctakes-chunker/4.0.1-SNAPSHOT/ctakes-chunker-4.0.1-SNAPSHOT.jar
[JENKINS] Archiving <https://builds.apache.org/job/ctakes-trunk-package/ws/ctakes-utils/pom.xml>
to org.apache.ctakes/ctakes-utils/4.0.1-SNAPSHOT/ctakes-utils-4.0.1-SNAPSHOT.pom
[JENKINS] Archiving <https://builds.apache.org/job/ctakes-trunk-package/ws/ctakes-utils/target/ctakes-utils-4.0.1-SNAPSHOT.jar>
to org.apache.ctakes/ctakes-utils/4.0.1-SNAPSHOT/ctakes-utils-4.0.1-SNAPSHOT.jar
[JENKINS] Archiving <https://builds.apache.org/job/ctakes-trunk-package/ws/ctakes-drug-ner-res/pom.xml>
to org.apache.ctakes/ctakes-drug-ner-res/4.0.1-SNAPSHOT/ctakes-drug-ner-res-4.0.1-SNAPSHOT.pom
[JENKINS] Archiving <https://builds.apache.org/job/ctakes-trunk-package/ws/ctakes-core/pom.xml>
to org.apache.ctakes/ctakes-core/4.0.1-SNAPSHOT/ctakes-core-4.0.1-SNAPSHOT.pom
[JENKINS] Archiving <https://builds.apache.org/job/ctakes-trunk-package/ws/ctakes-core/target/ctakes-core-4.0.1-SNAPSHOT.jar>
to org.apache.ctakes/ctakes-core/4.0.1-SNAPSHOT/ctakes-core-4.0.1-SNAPSHOT.jar
[JENKINS] Archiving <https://builds.apache.org/job/ctakes-trunk-package/ws/ctakes-dependency-parser/pom.xml>
to org.apache.ctakes/ctakes-dependency-parser/4.0.1-SNAPSHOT/ctakes-dependency-parser-4.0.1-SNAPSHOT.pom
[JENKINS] Archiving <https://builds.apache.org/job/ctakes-trunk-package/ws/ctakes-dependency-parser/target/ctakes-dependency-parser-4.0.1-SNAPSHOT.jar>
to org.apache.ctakes/ctakes-dependency-parser/4.0.1-SNAPSHOT/ctakes-dependency-parser-4.0.1-SNAPSHOT.jar
[JENKINS] Archiving <https://builds.apache.org/job/ctakes-trunk-package/ws/ctakes-distribution/pom.xml>
to org.apache.ctakes/ctakes-distribution/4.0.1-SNAPSHOT/ctakes-distribution-4.0.1-SNAPSHOT.pom
[JENKINS] Archiving <https://builds.apache.org/job/ctakes-trunk-package/ws/ctakes-coreference-res/pom.xml>
to org.apache.ctakes/ctakes-coreference-res/4.0.1-SNAPSHOT/ctakes-coreference-res-4.0.1-SNAPSHOT.pom
[JENKINS] Archiving <https://builds.apache.org/job/ctakes-trunk-package/ws/ctakes-coreference-res/target/ctakes-coreference-res-4.0.1-SNAPSHOT.jar>
to org.apache.ctakes/ctakes-coreference-res/4.0.1-SNAPSHOT/ctakes-coreference-res-4.0.1-SNAPSHOT.jar
[Fast Archiver] Compressed 23.90 MB of artifacts by 98.3% relative to #592
[JENKINS] Archiving <https://builds.apache.org/job/ctakes-trunk-package/ws/ctakes-coreference/pom.xml>
to org.apache.ctakes/ctakes-coreference/4.0.1-SNAPSHOT/ctakes-coreference-4.0.1-SNAPSHOT.pom
[JENKINS] Archiving <https://builds.apache.org/job/ctakes-trunk-package/ws/ctakes-assertion/pom.xml>
to org.apache.ctakes/ctakes-assertion/4.0.1-SNAPSHOT/ctakes-assertion-4.0.1-SNAPSHOT.pom
[JENKINS] Archiving <https://builds.apache.org/job/ctakes-trunk-package/ws/ctakes-assertion/target/ctakes-assertion-4.0.1-SNAPSHOT.jar>
to org.apache.ctakes/ctakes-assertion/4.0.1-SNAPSHOT/ctakes-assertion-4.0.1-SNAPSHOT.jar
[JENKINS] Archiving <https://builds.apache.org/job/ctakes-trunk-package/ws/ctakes-clinical-pipeline-res/pom.xml>
to org.apache.ctakes/ctakes-clinical-pipeline-res/4.0.1-SNAPSHOT/ctakes-clinical-pipeline-res-4.0.1-SNAPSHOT.pom
[JENKINS] Archiving <https://builds.apache.org/job/ctakes-trunk-package/ws/ctakes-clinical-pipeline-res/target/ctakes-clinical-pipeline-res-4.0.1-SNAPSHOT.jar>
to org.apache.ctakes/ctakes-clinical-pipeline-res/4.0.1-SNAPSHOT/ctakes-clinical-pipeline-res-4.0.1-SNAPSHOT.jar
[JENKINS] Archiving <https://builds.apache.org/job/ctakes-trunk-package/ws/ctakes-ytex-res/pom.xml>
to org.apache.ctakes/ctakes-ytex-res/4.0.1-SNAPSHOT/ctakes-ytex-res-4.0.1-SNAPSHOT.pom
[JENKINS] Archiving <https://builds.apache.org/job/ctakes-trunk-package/ws/ctakes-dictionary-lookup-res/pom.xml>
to org.apache.ctakes/ctakes-dictionary-lookup-res/4.0.1-SNAPSHOT/ctakes-dictionary-lookup-res-4.0.1-SNAPSHOT.pom
[JENKINS] Archiving <https://builds.apache.org/job/ctakes-trunk-package/ws/ctakes-dictionary-lookup-res/target/ctakes-dictionary-lookup-res-4.0.1-SNAPSHOT.jar>
to org.apache.ctakes/ctakes-dictionary-lookup-res/4.0.1-SNAPSHOT/ctakes-dictionary-lookup-res-4.0.1-SNAPSHOT.jar
[JENKINS] Archiving <https://builds.apache.org/job/ctakes-trunk-package/ws/ctakes-temporal-res/pom.xml>
to org.apache.ctakes/ctakes-temporal-res/4.0.1-SNAPSHOT/ctakes-temporal-res-4.0.1-SNAPSHOT.pom
[JENKINS] Archiving <https://builds.apache.org/job/ctakes-trunk-package/ws/ctakes-temporal-res/target/ctakes-temporal-res-4.0.1-SNAPSHOT.jar>
to org.apache.ctakes/ctakes-temporal-res/4.0.1-SNAPSHOT/ctakes-temporal-res-4.0.1-SNAPSHOT.jar
[Fast Archiver] Compressed 6.86 MB of artifacts by 97.1% relative to #592
[JENKINS] Archiving <https://builds.apache.org/job/ctakes-trunk-package/ws/ctakes-gui-res/pom.xml>
to org.apache.ctakes/ctakes-gui-res/4.0.1-SNAPSHOT/ctakes-gui-res-4.0.1-SNAPSHOT.pom
[JENKINS] Archiving <https://builds.apache.org/job/ctakes-trunk-package/ws/ctakes-gui-res/target/ctakes-gui-res-4.0.1-SNAPSHOT.jar>
to org.apache.ctakes/ctakes-gui-res/4.0.1-SNAPSHOT/ctakes-gui-res-4.0.1-SNAPSHOT.jar
[JENKINS] Archiving <https://builds.apache.org/job/ctakes-trunk-package/ws/ctakes-lvg-res/pom.xml>
to org.apache.ctakes/ctakes-lvg-res/4.0.1-SNAPSHOT/ctakes-lvg-res-4.0.1-SNAPSHOT.pom
[JENKINS] Archiving <https://builds.apache.org/job/ctakes-trunk-package/ws/ctakes-lvg-res/target/ctakes-lvg-res-4.0.1-SNAPSHOT.jar>
to org.apache.ctakes/ctakes-lvg-res/4.0.1-SNAPSHOT/ctakes-lvg-res-4.0.1-SNAPSHOT.jar
[JENKINS] Archiving <https://builds.apache.org/job/ctakes-trunk-package/ws/ctakes-ytex/pom.xml>
to org.apache.ctakes/ctakes-ytex/4.0.1-SNAPSHOT/ctakes-ytex-4.0.1-SNAPSHOT.pom
[JENKINS] Archiving <https://builds.apache.org/job/ctakes-trunk-package/ws/ctakes-relation-extractor-res/pom.xml>
to org.apache.ctakes/ctakes-relation-extractor-res/4.0.1-SNAPSHOT/ctakes-relation-extractor-res-4.0.1-SNAPSHOT.pom
[JENKINS] Archiving <https://builds.apache.org/job/ctakes-trunk-package/ws/ctakes-relation-extractor-res/target/ctakes-relation-extractor-res-4.0.1-SNAPSHOT.jar>
to org.apache.ctakes/ctakes-relation-extractor-res/4.0.1-SNAPSHOT/ctakes-relation-extractor-res-4.0.1-SNAPSHOT.jar
[Fast Archiver] Compressed 1.45 MB of artifacts by 92.7% relative to #592
[JENKINS] Archiving <https://builds.apache.org/job/ctakes-trunk-package/ws/ctakes-constituency-parser-res/pom.xml>
to org.apache.ctakes/ctakes-constituency-parser-res/4.0.1-SNAPSHOT/ctakes-constituency-parser-res-4.0.1-SNAPSHOT.pom
[JENKINS] Archiving <https://builds.apache.org/job/ctakes-trunk-package/ws/ctakes-constituency-parser-res/target/ctakes-constituency-parser-res-4.0.1-SNAPSHOT.jar>
to org.apache.ctakes/ctakes-constituency-parser-res/4.0.1-SNAPSHOT/ctakes-constituency-parser-res-4.0.1-SNAPSHOT.jar
[Fast Archiver] Compressed 32.15 MB of artifacts by 99.6% relative to #592
[JENKINS] Archiving <https://builds.apache.org/job/ctakes-trunk-package/ws/ctakes-core-res/pom.xml>
to org.apache.ctakes/ctakes-core-res/4.0.1-SNAPSHOT/ctakes-core-res-4.0.1-SNAPSHOT.pom
[JENKINS] Archiving <https://builds.apache.org/job/ctakes-trunk-package/ws/ctakes-core-res/target/ctakes-core-res-4.0.1-SNAPSHOT.jar>
to org.apache.ctakes/ctakes-core-res/4.0.1-SNAPSHOT/ctakes-core-res-4.0.1-SNAPSHOT.jar
[Fast Archiver] Compressed 2.10 MB of artifacts by 89.4% relative to #592
[JENKINS] Archiving <https://builds.apache.org/job/ctakes-trunk-package/ws/ctakes-dependency-parser-res/pom.xml>
to org.apache.ctakes/ctakes-dependency-parser-res/4.0.1-SNAPSHOT/ctakes-dependency-parser-res-4.0.1-SNAPSHOT.pom
[JENKINS] Archiving <https://builds.apache.org/job/ctakes-trunk-package/ws/ctakes-dependency-parser-res/target/ctakes-dependency-parser-res-4.0.1-SNAPSHOT.jar>
to org.apache.ctakes/ctakes-dependency-parser-res/4.0.1-SNAPSHOT/ctakes-dependency-parser-res-4.0.1-SNAPSHOT.jar
[Fast Archiver] Compressed 259.20 MB of artifacts by 99.9% relative to #592
[JENKINS] Archiving <https://builds.apache.org/job/ctakes-trunk-package/ws/ctakes-smoking-status/pom.xml>
to org.apache.ctakes/ctakes-smoking-status/4.0.1-SNAPSHOT/ctakes-smoking-status-4.0.1-SNAPSHOT.pom
[JENKINS] Archiving <https://builds.apache.org/job/ctakes-trunk-package/ws/ctakes-pos-tagger-res/pom.xml>
to org.apache.ctakes/ctakes-pos-tagger-res/4.0.1-SNAPSHOT/ctakes-pos-tagger-res-4.0.1-SNAPSHOT.pom
[JENKINS] Archiving <https://builds.apache.org/job/ctakes-trunk-package/ws/ctakes-pos-tagger-res/target/ctakes-pos-tagger-res-4.0.1-SNAPSHOT.jar>
to org.apache.ctakes/ctakes-pos-tagger-res/4.0.1-SNAPSHOT/ctakes-pos-tagger-res-4.0.1-SNAPSHOT.jar
[Fast Archiver] Compressed 11.26 MB of artifacts by 99.4% relative to #592
[JENKINS] Archiving <https://builds.apache.org/job/ctakes-trunk-package/ws/ctakes-ytex-uima/pom.xml>
to org.apache.ctakes/ctakes-ytex-uima/4.0.1-SNAPSHOT/ctakes-ytex-uima-4.0.1-SNAPSHOT.pom
Sending e-mails to: notifications@ctakes.apache.org timothy.miller@childrens.harvard.edu
channel stopped

Mime
View raw message