ctakes-notifications mailing list archives

Site index · List index
Message view « Date » · « Thread »
Top « Date » · « Thread »
From Apache Jenkins Server <jenk...@builds.apache.org>
Subject Build failed in Jenkins: ctakes-trunk-package #582
Date Mon, 31 Jul 2017 12:22:41 GMT
See <https://builds.apache.org/job/ctakes-trunk-package/582/display/redirect?page=changes>

Changes:

[seanfinan] List regex additions, improvements

------------------------------------------
[...truncated 661.56 KB...]
[INFO] Apache cTAKES Constituency Parser ................. SUCCESS [2.923s]
[INFO] Apache cTAKES Resources coreference ............... SUCCESS [6.433s]
[INFO] Apache cTAKES Resources temporal .................. SUCCESS [2.565s]
[INFO] Apache cTAKES Resources relation-extractor ........ SUCCESS [2.192s]
[INFO] Apache cTAKES Resources dictionary-lookup-fast-res  SUCCESS [2.903s]
[INFO] Apache cTAKES dictionary lookup fast .............. SUCCESS [2.742s]
[INFO] Apache cTAKES Resources assertion ................. SUCCESS [4.051s]
[INFO] Apache cTAKES Resources dependency-parser ......... SUCCESS [21.670s]
[INFO] Apache cTAKES Dependency Parser ................... SUCCESS [4.231s]
[INFO] Apache cTAKES Assertion ........................... SUCCESS [5.134s]
[INFO] ctakes-clinical-pipeline-res ...................... SUCCESS [2.121s]
[INFO] Apache cTAKES ctakes-clinical-pipeline ............ SUCCESS [5.763s]
[INFO] Apache cTAKES Relation Extractor .................. SUCCESS [6.349s]
[INFO] Apache cTAKES Temporal Information Extraction ..... SUCCESS [28.020s]
[INFO] Apache cTAKES CoReference Resolver ................ SUCCESS [7.141s]
[INFO] Apache cTAKES Resources drug-ner .................. SUCCESS [2.217s]
[INFO] Apache cTAKES Drug NER ............................ SUCCESS [6.329s]
[INFO] Apache cTAKES Resources side-effect ............... SUCCESS [2.186s]
[INFO] Apache cTAKES Side Effects ........................ SUCCESS [5.896s]
[INFO] Apache cTAKES Resources smoking-status ............ SUCCESS [2.174s]
[INFO] Apache cTAKES Smoking Status ...................... SUCCESS [5.877s]
[INFO] Apache cTAKES Resources assertion-zoner ........... SUCCESS [2.179s]
[INFO] Apache cTAKES Assertion's zoner ................... SUCCESS [2.687s]
[INFO] ctakes-examples-res ............................... SUCCESS [2.136s]
[INFO] ctakes-examples ................................... SUCCESS [6.753s]
[INFO] Apache cTAKES Resources ctakes-ytex-res ........... SUCCESS [2.167s]
[INFO] Apache cTAKES YTEX ................................ SUCCESS [1:03.498s]
[INFO] Apache cTAKES YTEX UIMA ........................... SUCCESS [44.767s]
[INFO] Apache cTAKES YTEX Web ............................ SUCCESS [1:11.059s]
[INFO] Apache cTAKES Distribution ........................ SUCCESS [3:03.773s]
[INFO] Apache cTAKES Regression-test ..................... SUCCESS [6.758s]
[INFO] Apache cTAKES template filler ..................... SUCCESS [6.758s]
[INFO] ------------------------------------------------------------------------
[INFO] BUILD SUCCESS
[INFO] ------------------------------------------------------------------------
[INFO] Total time: 12:16.758s
[INFO] Finished at: Mon Jul 31 11:56:17 UTC 2017
[INFO] Final Memory: 129M/898M
[INFO] ------------------------------------------------------------------------
Waiting for Jenkins to finish collecting data
[JENKINS] Archiving <https://builds.apache.org/job/ctakes-trunk-package/ws/ctakes-clinical-pipeline/pom.xml>
to org.apache.ctakes/ctakes-clinical-pipeline/4.0.1-SNAPSHOT/ctakes-clinical-pipeline-4.0.1-SNAPSHOT.pom
[JENKINS] Archiving <https://builds.apache.org/job/ctakes-trunk-package/ws/ctakes-clinical-pipeline/target/ctakes-clinical-pipeline-4.0.1-SNAPSHOT.jar>
to org.apache.ctakes/ctakes-clinical-pipeline/4.0.1-SNAPSHOT/ctakes-clinical-pipeline-4.0.1-SNAPSHOT.jar
[JENKINS] Archiving <https://builds.apache.org/job/ctakes-trunk-package/ws/ctakes-type-system/pom.xml>
to org.apache.ctakes/ctakes-type-system/4.0.1-SNAPSHOT/ctakes-type-system-4.0.1-SNAPSHOT.pom
[JENKINS] Archiving <https://builds.apache.org/job/ctakes-trunk-package/ws/ctakes-type-system/target/ctakes-type-system-4.0.1-SNAPSHOT.jar>
to org.apache.ctakes/ctakes-type-system/4.0.1-SNAPSHOT/ctakes-type-system-4.0.1-SNAPSHOT.jar
[JENKINS] Archiving <https://builds.apache.org/job/ctakes-trunk-package/ws/ctakes-dictionary-lookup/pom.xml>
to org.apache.ctakes/ctakes-dictionary-lookup/4.0.1-SNAPSHOT/ctakes-dictionary-lookup-4.0.1-SNAPSHOT.pom
[JENKINS] Archiving <https://builds.apache.org/job/ctakes-trunk-package/ws/ctakes-dictionary-lookup/target/ctakes-dictionary-lookup-4.0.1-SNAPSHOT.jar>
to org.apache.ctakes/ctakes-dictionary-lookup/4.0.1-SNAPSHOT/ctakes-dictionary-lookup-4.0.1-SNAPSHOT.jar
[JENKINS] Archiving <https://builds.apache.org/job/ctakes-trunk-package/ws/ctakes-constituency-parser/pom.xml>
to org.apache.ctakes/ctakes-constituency-parser/4.0.1-SNAPSHOT/ctakes-constituency-parser-4.0.1-SNAPSHOT.pom
[JENKINS] Archiving <https://builds.apache.org/job/ctakes-trunk-package/ws/ctakes-constituency-parser/target/ctakes-constituency-parser-4.0.1-SNAPSHOT.jar>
to org.apache.ctakes/ctakes-constituency-parser/4.0.1-SNAPSHOT/ctakes-constituency-parser-4.0.1-SNAPSHOT.jar
[JENKINS] Archiving <https://builds.apache.org/job/ctakes-trunk-package/ws/ctakes-examples-res/pom.xml>
to org.apache.ctakes/ctakes-examples-res/4.0.1-SNAPSHOT/ctakes-examples-res-4.0.1-SNAPSHOT.pom
[JENKINS] Archiving <https://builds.apache.org/job/ctakes-trunk-package/ws/ctakes-examples-res/target/ctakes-examples-res-4.0.1-SNAPSHOT.jar>
to org.apache.ctakes/ctakes-examples-res/4.0.1-SNAPSHOT/ctakes-examples-res-4.0.1-SNAPSHOT.jar
[JENKINS] Archiving <https://builds.apache.org/job/ctakes-trunk-package/ws/ctakes-temporal/pom.xml>
to org.apache.ctakes/ctakes-temporal/4.0.1-SNAPSHOT/ctakes-temporal-4.0.1-SNAPSHOT.pom
[JENKINS] Archiving <https://builds.apache.org/job/ctakes-trunk-package/ws/ctakes-temporal/target/ctakes-temporal-4.0.1-SNAPSHOT.jar>
to org.apache.ctakes/ctakes-temporal/4.0.1-SNAPSHOT/ctakes-temporal-4.0.1-SNAPSHOT.jar
[Fast Archiver] Compressed 57.89 MB of artifacts by 97.7% relative to #581
[JENKINS] Archiving <https://builds.apache.org/job/ctakes-trunk-package/ws/ctakes-chunker-res/pom.xml>
to org.apache.ctakes/ctakes-chunker-res/4.0.1-SNAPSHOT/ctakes-chunker-res-4.0.1-SNAPSHOT.pom
[JENKINS] Archiving <https://builds.apache.org/job/ctakes-trunk-package/ws/ctakes-chunker-res/target/ctakes-chunker-res-4.0.1-SNAPSHOT.jar>
to org.apache.ctakes/ctakes-chunker-res/4.0.1-SNAPSHOT/ctakes-chunker-res-4.0.1-SNAPSHOT.jar
[Fast Archiver] Compressed 12.16 MB of artifacts by 99.7% relative to #581
[JENKINS] Archiving <https://builds.apache.org/job/ctakes-trunk-package/ws/ctakes-regression-test/pom.xml>
to org.apache.ctakes/ctakes-regression-test/4.0.1-SNAPSHOT/ctakes-regression-test-4.0.1-SNAPSHOT.pom
[JENKINS] Archiving <https://builds.apache.org/job/ctakes-trunk-package/ws/ctakes-regression-test/target/ctakes-regression-test-4.0.1-SNAPSHOT.jar>
to org.apache.ctakes/ctakes-regression-test/4.0.1-SNAPSHOT/ctakes-regression-test-4.0.1-SNAPSHOT.jar
[JENKINS] Archiving <https://builds.apache.org/job/ctakes-trunk-package/ws/ctakes-relation-extractor/pom.xml>
to org.apache.ctakes/ctakes-relation-extractor/4.0.1-SNAPSHOT/ctakes-relation-extractor-4.0.1-SNAPSHOT.pom
[JENKINS] Archiving <https://builds.apache.org/job/ctakes-trunk-package/ws/ctakes-relation-extractor/target/ctakes-relation-extractor-4.0.1-SNAPSHOT.jar>
to org.apache.ctakes/ctakes-relation-extractor/4.0.1-SNAPSHOT/ctakes-relation-extractor-4.0.1-SNAPSHOT.jar
[JENKINS] Archiving <https://builds.apache.org/job/ctakes-trunk-package/ws/ctakes-gui/pom.xml>
to org.apache.ctakes/ctakes-gui/4.0.1-SNAPSHOT/ctakes-gui-4.0.1-SNAPSHOT.pom
[JENKINS] Archiving <https://builds.apache.org/job/ctakes-trunk-package/ws/ctakes-gui/target/ctakes-gui-4.0.1-SNAPSHOT.jar>
to org.apache.ctakes/ctakes-gui/4.0.1-SNAPSHOT/ctakes-gui-4.0.1-SNAPSHOT.jar
[JENKINS] Archiving <https://builds.apache.org/job/ctakes-trunk-package/ws/ctakes-preprocessor/pom.xml>
to org.apache.ctakes/ctakes-preprocessor/4.0.1-SNAPSHOT/ctakes-preprocessor-4.0.1-SNAPSHOT.pom
[JENKINS] Archiving <https://builds.apache.org/job/ctakes-trunk-package/ws/ctakes-preprocessor/target/ctakes-preprocessor-4.0.1-SNAPSHOT.jar>
to org.apache.ctakes/ctakes-preprocessor/4.0.1-SNAPSHOT/ctakes-preprocessor-4.0.1-SNAPSHOT.jar
[JENKINS] Archiving <https://builds.apache.org/job/ctakes-trunk-package/ws/ctakes-assertion-res/pom.xml>
to org.apache.ctakes/ctakes-assertion-res/4.0.1-SNAPSHOT/ctakes-assertion-res-4.0.1-SNAPSHOT.pom
[JENKINS] Archiving <https://builds.apache.org/job/ctakes-trunk-package/ws/ctakes-assertion-res/target/ctakes-assertion-res-4.0.1-SNAPSHOT.jar>
to org.apache.ctakes/ctakes-assertion-res/4.0.1-SNAPSHOT/ctakes-assertion-res-4.0.1-SNAPSHOT.jar
[Fast Archiver] Compressed 11.18 MB of artifacts by 95.8% relative to #581
[JENKINS] Archiving <https://builds.apache.org/job/ctakes-trunk-package/ws/ctakes-assertion-zoner-res/pom.xml>
to org.apache.ctakes/ctakes-assertion-zoner-res/4.0.1-SNAPSHOT/ctakes-assertion-zoner-res-4.0.1-SNAPSHOT.pom
[JENKINS] Archiving <https://builds.apache.org/job/ctakes-trunk-package/ws/ctakes-assertion-zoner-res/target/ctakes-assertion-zoner-res-4.0.1-SNAPSHOT.jar>
to org.apache.ctakes/ctakes-assertion-zoner-res/4.0.1-SNAPSHOT/ctakes-assertion-zoner-res-4.0.1-SNAPSHOT.jar
[JENKINS] Archiving <https://builds.apache.org/job/ctakes-trunk-package/ws/ctakes-assertion-zoner/pom.xml>
to org.apache.ctakes/ctakes-assertion-zoner/4.0.1-SNAPSHOT/ctakes-assertion-zoner-4.0.1-SNAPSHOT.pom
[JENKINS] Archiving <https://builds.apache.org/job/ctakes-trunk-package/ws/ctakes-assertion-zoner/target/ctakes-assertion-zoner-4.0.1-SNAPSHOT.jar>
to org.apache.ctakes/ctakes-assertion-zoner/4.0.1-SNAPSHOT/ctakes-assertion-zoner-4.0.1-SNAPSHOT.jar
[JENKINS] Archiving <https://builds.apache.org/job/ctakes-trunk-package/ws/ctakes-ne-contexts-res/pom.xml>
to org.apache.ctakes/ctakes-ne-contexts-res/4.0.1-SNAPSHOT/ctakes-ne-contexts-res-4.0.1-SNAPSHOT.pom
[JENKINS] Archiving <https://builds.apache.org/job/ctakes-trunk-package/ws/ctakes-ne-contexts-res/target/ctakes-ne-contexts-res-4.0.1-SNAPSHOT.jar>
to org.apache.ctakes/ctakes-ne-contexts-res/4.0.1-SNAPSHOT/ctakes-ne-contexts-res-4.0.1-SNAPSHOT.jar
[JENKINS] Archiving <https://builds.apache.org/job/ctakes-trunk-package/ws/ctakes-drug-ner/pom.xml>
to org.apache.ctakes/ctakes-drug-ner/4.0.1-SNAPSHOT/ctakes-drug-ner-4.0.1-SNAPSHOT.pom
[JENKINS] Archiving <https://builds.apache.org/job/ctakes-trunk-package/ws/ctakes-drug-ner/target/ctakes-drug-ner-4.0.1-SNAPSHOT.jar>
to org.apache.ctakes/ctakes-drug-ner/4.0.1-SNAPSHOT/ctakes-drug-ner-4.0.1-SNAPSHOT.jar
[JENKINS] Archiving <https://builds.apache.org/job/ctakes-trunk-package/ws/ctakes-ytex-web/pom.xml>
to org.apache.ctakes/ctakes-ytex-web/4.0.1-SNAPSHOT/ctakes-ytex-web-4.0.1-SNAPSHOT.pom
[JENKINS] Archiving <https://builds.apache.org/job/ctakes-trunk-package/ws/ctakes-ytex-web/target/ctakes-ytex-web-4.0.1-SNAPSHOT.war>
to org.apache.ctakes/ctakes-ytex-web/4.0.1-SNAPSHOT/ctakes-ytex-web-4.0.1-SNAPSHOT.war
[JENKINS] Archiving <https://builds.apache.org/job/ctakes-trunk-package/ws/ctakes-ytex-web/target/ctakes-ytex-web-4.0.1-SNAPSHOT-classes.jar>
to org.apache.ctakes/ctakes-ytex-web/4.0.1-SNAPSHOT/ctakes-ytex-web-4.0.1-SNAPSHOT-classes.jar
[Fast Archiver] Compressed 753.61 MB of artifacts by 55.6% relative to #581
[JENKINS] Archiving <https://builds.apache.org/job/ctakes-trunk-package/ws/ctakes-context-tokenizer/pom.xml>
to org.apache.ctakes/ctakes-context-tokenizer/4.0.1-SNAPSHOT/ctakes-context-tokenizer-4.0.1-SNAPSHOT.pom
[JENKINS] Archiving <https://builds.apache.org/job/ctakes-trunk-package/ws/ctakes-context-tokenizer/target/ctakes-context-tokenizer-4.0.1-SNAPSHOT.jar>
to org.apache.ctakes/ctakes-context-tokenizer/4.0.1-SNAPSHOT/ctakes-context-tokenizer-4.0.1-SNAPSHOT.jar
[JENKINS] Archiving <https://builds.apache.org/job/ctakes-trunk-package/ws/ctakes-side-effect-res/pom.xml>
to org.apache.ctakes/ctakes-side-effect-res/4.0.1-SNAPSHOT/ctakes-side-effect-res-4.0.1-SNAPSHOT.pom
[JENKINS] Archiving <https://builds.apache.org/job/ctakes-trunk-package/ws/ctakes-side-effect-res/target/ctakes-side-effect-res-4.0.1-SNAPSHOT.jar>
to org.apache.ctakes/ctakes-side-effect-res/4.0.1-SNAPSHOT/ctakes-side-effect-res-4.0.1-SNAPSHOT.jar
[JENKINS] Archiving <https://builds.apache.org/job/ctakes-trunk-package/ws/ctakes-examples/pom.xml>
to org.apache.ctakes/ctakes-examples/4.0.1-SNAPSHOT/ctakes-examples-4.0.1-SNAPSHOT.pom
[JENKINS] Archiving <https://builds.apache.org/job/ctakes-trunk-package/ws/ctakes-examples/target/ctakes-examples-4.0.1-SNAPSHOT.jar>
to org.apache.ctakes/ctakes-examples/4.0.1-SNAPSHOT/ctakes-examples-4.0.1-SNAPSHOT.jar
[JENKINS] Archiving <https://builds.apache.org/job/ctakes-trunk-package/ws/ctakes-dictionary-lookup-fast-res/pom.xml>
to org.apache.ctakes/ctakes-dictionary-lookup-fast-res/4.0.1-SNAPSHOT/ctakes-dictionary-lookup-fast-res-4.0.1-SNAPSHOT.pom
[JENKINS] Archiving <https://builds.apache.org/job/ctakes-trunk-package/ws/ctakes-dictionary-lookup-fast-res/target/ctakes-dictionary-lookup-fast-res-4.0.1-SNAPSHOT.jar>
to org.apache.ctakes/ctakes-dictionary-lookup-fast-res/4.0.1-SNAPSHOT/ctakes-dictionary-lookup-fast-res-4.0.1-SNAPSHOT.jar
[JENKINS] Archiving <https://builds.apache.org/job/ctakes-trunk-package/ws/ctakes-dictionary-lookup-fast/pom.xml>
to org.apache.ctakes/ctakes-dictionary-lookup-fast/4.0.1-SNAPSHOT/ctakes-dictionary-lookup-fast-4.0.1-SNAPSHOT.pom
[JENKINS] Archiving <https://builds.apache.org/job/ctakes-trunk-package/ws/ctakes-dictionary-lookup-fast/target/ctakes-dictionary-lookup-fast-4.0.1-SNAPSHOT.jar>
to org.apache.ctakes/ctakes-dictionary-lookup-fast/4.0.1-SNAPSHOT/ctakes-dictionary-lookup-fast-4.0.1-SNAPSHOT.jar
[JENKINS] Archiving <https://builds.apache.org/job/ctakes-trunk-package/ws/ctakes-ne-contexts/pom.xml>
to org.apache.ctakes/ctakes-ne-contexts/4.0.1-SNAPSHOT/ctakes-ne-contexts-4.0.1-SNAPSHOT.pom
[JENKINS] Archiving <https://builds.apache.org/job/ctakes-trunk-package/ws/ctakes-ne-contexts/target/ctakes-ne-contexts-4.0.1-SNAPSHOT.jar>
to org.apache.ctakes/ctakes-ne-contexts/4.0.1-SNAPSHOT/ctakes-ne-contexts-4.0.1-SNAPSHOT.jar
[JENKINS] Archiving <https://builds.apache.org/job/ctakes-trunk-package/ws/ctakes-lvg/pom.xml>
to org.apache.ctakes/ctakes-lvg/4.0.1-SNAPSHOT/ctakes-lvg-4.0.1-SNAPSHOT.pom
[JENKINS] Archiving <https://builds.apache.org/job/ctakes-trunk-package/ws/ctakes-lvg/target/ctakes-lvg-4.0.1-SNAPSHOT.jar>
to org.apache.ctakes/ctakes-lvg/4.0.1-SNAPSHOT/ctakes-lvg-4.0.1-SNAPSHOT.jar
[JENKINS] Archiving <https://builds.apache.org/job/ctakes-trunk-package/ws/ctakes-smoking-status-res/pom.xml>
to org.apache.ctakes/ctakes-smoking-status-res/4.0.1-SNAPSHOT/ctakes-smoking-status-res-4.0.1-SNAPSHOT.pom
[JENKINS] Archiving <https://builds.apache.org/job/ctakes-trunk-package/ws/ctakes-smoking-status-res/target/ctakes-smoking-status-res-4.0.1-SNAPSHOT.jar>
to org.apache.ctakes/ctakes-smoking-status-res/4.0.1-SNAPSHOT/ctakes-smoking-status-res-4.0.1-SNAPSHOT.jar
[JENKINS] Archiving <https://builds.apache.org/job/ctakes-trunk-package/ws/ctakes-pos-tagger/pom.xml>
to org.apache.ctakes/ctakes-pos-tagger/4.0.1-SNAPSHOT/ctakes-pos-tagger-4.0.1-SNAPSHOT.pom
[JENKINS] Archiving <https://builds.apache.org/job/ctakes-trunk-package/ws/ctakes-pos-tagger/target/ctakes-pos-tagger-4.0.1-SNAPSHOT.jar>
to org.apache.ctakes/ctakes-pos-tagger/4.0.1-SNAPSHOT/ctakes-pos-tagger-4.0.1-SNAPSHOT.jar
[JENKINS] Archiving <https://builds.apache.org/job/ctakes-trunk-package/ws/ctakes-side-effect/pom.xml>
to org.apache.ctakes/ctakes-side-effect/4.0.1-SNAPSHOT/ctakes-side-effect-4.0.1-SNAPSHOT.pom
[JENKINS] Archiving <https://builds.apache.org/job/ctakes-trunk-package/ws/ctakes-side-effect/target/ctakes-side-effect-4.0.1-SNAPSHOT.jar>
to org.apache.ctakes/ctakes-side-effect/4.0.1-SNAPSHOT/ctakes-side-effect-4.0.1-SNAPSHOT.jar
[JENKINS] Archiving <https://builds.apache.org/job/ctakes-trunk-package/ws/ctakes-template-filler/pom.xml>
to org.apache.ctakes/ctakes-template-filler/4.0.1-SNAPSHOT/ctakes-template-filler-4.0.1-SNAPSHOT.pom
[JENKINS] Archiving <https://builds.apache.org/job/ctakes-trunk-package/ws/ctakes-template-filler/target/ctakes-template-filler-4.0.1-SNAPSHOT.jar>
to org.apache.ctakes/ctakes-template-filler/4.0.1-SNAPSHOT/ctakes-template-filler-4.0.1-SNAPSHOT.jar
[JENKINS] Archiving <https://builds.apache.org/job/ctakes-trunk-package/ws/pom.xml>
to org.apache.ctakes/ctakes/4.0.1-SNAPSHOT/ctakes-4.0.1-SNAPSHOT.pom
[JENKINS] Archiving <https://builds.apache.org/job/ctakes-trunk-package/ws/ctakes-chunker/pom.xml>
to org.apache.ctakes/ctakes-chunker/4.0.1-SNAPSHOT/ctakes-chunker-4.0.1-SNAPSHOT.pom
[JENKINS] Archiving <https://builds.apache.org/job/ctakes-trunk-package/ws/ctakes-chunker/target/ctakes-chunker-4.0.1-SNAPSHOT.jar>
to org.apache.ctakes/ctakes-chunker/4.0.1-SNAPSHOT/ctakes-chunker-4.0.1-SNAPSHOT.jar
[JENKINS] Archiving <https://builds.apache.org/job/ctakes-trunk-package/ws/ctakes-utils/pom.xml>
to org.apache.ctakes/ctakes-utils/4.0.1-SNAPSHOT/ctakes-utils-4.0.1-SNAPSHOT.pom
[JENKINS] Archiving <https://builds.apache.org/job/ctakes-trunk-package/ws/ctakes-utils/target/ctakes-utils-4.0.1-SNAPSHOT.jar>
to org.apache.ctakes/ctakes-utils/4.0.1-SNAPSHOT/ctakes-utils-4.0.1-SNAPSHOT.jar
[JENKINS] Archiving <https://builds.apache.org/job/ctakes-trunk-package/ws/ctakes-drug-ner-res/pom.xml>
to org.apache.ctakes/ctakes-drug-ner-res/4.0.1-SNAPSHOT/ctakes-drug-ner-res-4.0.1-SNAPSHOT.pom
[JENKINS] Archiving <https://builds.apache.org/job/ctakes-trunk-package/ws/ctakes-drug-ner-res/target/ctakes-drug-ner-res-4.0.1-SNAPSHOT.jar>
to org.apache.ctakes/ctakes-drug-ner-res/4.0.1-SNAPSHOT/ctakes-drug-ner-res-4.0.1-SNAPSHOT.jar
[JENKINS] Archiving <https://builds.apache.org/job/ctakes-trunk-package/ws/ctakes-core/pom.xml>
to org.apache.ctakes/ctakes-core/4.0.1-SNAPSHOT/ctakes-core-4.0.1-SNAPSHOT.pom
[JENKINS] Archiving <https://builds.apache.org/job/ctakes-trunk-package/ws/ctakes-core/target/ctakes-core-4.0.1-SNAPSHOT.jar>
to org.apache.ctakes/ctakes-core/4.0.1-SNAPSHOT/ctakes-core-4.0.1-SNAPSHOT.jar
[JENKINS] Archiving <https://builds.apache.org/job/ctakes-trunk-package/ws/ctakes-dependency-parser/pom.xml>
to org.apache.ctakes/ctakes-dependency-parser/4.0.1-SNAPSHOT/ctakes-dependency-parser-4.0.1-SNAPSHOT.pom
[JENKINS] Archiving <https://builds.apache.org/job/ctakes-trunk-package/ws/ctakes-dependency-parser/target/ctakes-dependency-parser-4.0.1-SNAPSHOT.jar>
to org.apache.ctakes/ctakes-dependency-parser/4.0.1-SNAPSHOT/ctakes-dependency-parser-4.0.1-SNAPSHOT.jar
[JENKINS] Archiving <https://builds.apache.org/job/ctakes-trunk-package/ws/ctakes-distribution/pom.xml>
to org.apache.ctakes/ctakes-distribution/4.0.1-SNAPSHOT/ctakes-distribution-4.0.1-SNAPSHOT.pom
[JENKINS] Archiving <https://builds.apache.org/job/ctakes-trunk-package/ws/ctakes-distribution/target/apache-ctakes-4.0.1-SNAPSHOT-bin.tar.gz>
to org.apache.ctakes/ctakes-distribution/4.0.1-SNAPSHOT/ctakes-distribution-4.0.1-SNAPSHOT-bin.tar.gz
[JENKINS] Archiving <https://builds.apache.org/job/ctakes-trunk-package/ws/ctakes-distribution/target/apache-ctakes-4.0.1-SNAPSHOT-bin.zip>
to org.apache.ctakes/ctakes-distribution/4.0.1-SNAPSHOT/ctakes-distribution-4.0.1-SNAPSHOT-bin.zip
[JENKINS] Archiving <https://builds.apache.org/job/ctakes-trunk-package/ws/ctakes-distribution/target/apache-ctakes-4.0.1-SNAPSHOT-src.tar.gz>
to org.apache.ctakes/ctakes-distribution/4.0.1-SNAPSHOT/ctakes-distribution-4.0.1-SNAPSHOT-src.tar.gz
[JENKINS] Archiving <https://builds.apache.org/job/ctakes-trunk-package/ws/ctakes-distribution/target/apache-ctakes-4.0.1-SNAPSHOT-src.zip>
to org.apache.ctakes/ctakes-distribution/4.0.1-SNAPSHOT/ctakes-distribution-4.0.1-SNAPSHOT-src.zip
[Fast Archiver] Compressed 1.93 GB of artifacts by 49.2% relative to #581
[JENKINS] Archiving <https://builds.apache.org/job/ctakes-trunk-package/ws/ctakes-coreference-res/pom.xml>
to org.apache.ctakes/ctakes-coreference-res/4.0.1-SNAPSHOT/ctakes-coreference-res-4.0.1-SNAPSHOT.pom
[JENKINS] Archiving <https://builds.apache.org/job/ctakes-trunk-package/ws/ctakes-coreference-res/target/ctakes-coreference-res-4.0.1-SNAPSHOT.jar>
to org.apache.ctakes/ctakes-coreference-res/4.0.1-SNAPSHOT/ctakes-coreference-res-4.0.1-SNAPSHOT.jar
[Fast Archiver] Compressed 23.90 MB of artifacts by 98.5% relative to #581
[JENKINS] Archiving <https://builds.apache.org/job/ctakes-trunk-package/ws/ctakes-coreference/pom.xml>
to org.apache.ctakes/ctakes-coreference/4.0.1-SNAPSHOT/ctakes-coreference-4.0.1-SNAPSHOT.pom
[JENKINS] Archiving <https://builds.apache.org/job/ctakes-trunk-package/ws/ctakes-coreference/target/ctakes-coreference-4.0.1-SNAPSHOT.jar>
to org.apache.ctakes/ctakes-coreference/4.0.1-SNAPSHOT/ctakes-coreference-4.0.1-SNAPSHOT.jar
[JENKINS] Archiving <https://builds.apache.org/job/ctakes-trunk-package/ws/ctakes-assertion/pom.xml>
to org.apache.ctakes/ctakes-assertion/4.0.1-SNAPSHOT/ctakes-assertion-4.0.1-SNAPSHOT.pom
[JENKINS] Archiving <https://builds.apache.org/job/ctakes-trunk-package/ws/ctakes-assertion/target/ctakes-assertion-4.0.1-SNAPSHOT.jar>
to org.apache.ctakes/ctakes-assertion/4.0.1-SNAPSHOT/ctakes-assertion-4.0.1-SNAPSHOT.jar
[JENKINS] Archiving <https://builds.apache.org/job/ctakes-trunk-package/ws/ctakes-clinical-pipeline-res/pom.xml>
to org.apache.ctakes/ctakes-clinical-pipeline-res/4.0.1-SNAPSHOT/ctakes-clinical-pipeline-res-4.0.1-SNAPSHOT.pom
[JENKINS] Archiving <https://builds.apache.org/job/ctakes-trunk-package/ws/ctakes-clinical-pipeline-res/target/ctakes-clinical-pipeline-res-4.0.1-SNAPSHOT.jar>
to org.apache.ctakes/ctakes-clinical-pipeline-res/4.0.1-SNAPSHOT/ctakes-clinical-pipeline-res-4.0.1-SNAPSHOT.jar
[JENKINS] Archiving <https://builds.apache.org/job/ctakes-trunk-package/ws/ctakes-ytex-res/pom.xml>
to org.apache.ctakes/ctakes-ytex-res/4.0.1-SNAPSHOT/ctakes-ytex-res-4.0.1-SNAPSHOT.pom
[JENKINS] Archiving <https://builds.apache.org/job/ctakes-trunk-package/ws/ctakes-ytex-res/target/ctakes-ytex-res-4.0.1-SNAPSHOT.jar>
to org.apache.ctakes/ctakes-ytex-res/4.0.1-SNAPSHOT/ctakes-ytex-res-4.0.1-SNAPSHOT.jar
[Fast Archiver] Compressed 153.77 KB of artifacts by 20.8% relative to #581
[JENKINS] Archiving <https://builds.apache.org/job/ctakes-trunk-package/ws/ctakes-dictionary-lookup-res/pom.xml>
to org.apache.ctakes/ctakes-dictionary-lookup-res/4.0.1-SNAPSHOT/ctakes-dictionary-lookup-res-4.0.1-SNAPSHOT.pom
[JENKINS] Archiving <https://builds.apache.org/job/ctakes-trunk-package/ws/ctakes-dictionary-lookup-res/target/ctakes-dictionary-lookup-res-4.0.1-SNAPSHOT.jar>
to org.apache.ctakes/ctakes-dictionary-lookup-res/4.0.1-SNAPSHOT/ctakes-dictionary-lookup-res-4.0.1-SNAPSHOT.jar
[JENKINS] Archiving <https://builds.apache.org/job/ctakes-trunk-package/ws/ctakes-temporal-res/pom.xml>
to org.apache.ctakes/ctakes-temporal-res/4.0.1-SNAPSHOT/ctakes-temporal-res-4.0.1-SNAPSHOT.pom
[JENKINS] Archiving <https://builds.apache.org/job/ctakes-trunk-package/ws/ctakes-temporal-res/target/ctakes-temporal-res-4.0.1-SNAPSHOT.jar>
to org.apache.ctakes/ctakes-temporal-res/4.0.1-SNAPSHOT/ctakes-temporal-res-4.0.1-SNAPSHOT.jar
[Fast Archiver] Compressed 6.86 MB of artifacts by 97.1% relative to #581
[JENKINS] Archiving <https://builds.apache.org/job/ctakes-trunk-package/ws/ctakes-gui-res/pom.xml>
to org.apache.ctakes/ctakes-gui-res/4.0.1-SNAPSHOT/ctakes-gui-res-4.0.1-SNAPSHOT.pom
[JENKINS] Archiving <https://builds.apache.org/job/ctakes-trunk-package/ws/ctakes-gui-res/target/ctakes-gui-res-4.0.1-SNAPSHOT.jar>
to org.apache.ctakes/ctakes-gui-res/4.0.1-SNAPSHOT/ctakes-gui-res-4.0.1-SNAPSHOT.jar
[JENKINS] Archiving <https://builds.apache.org/job/ctakes-trunk-package/ws/ctakes-lvg-res/pom.xml>
to org.apache.ctakes/ctakes-lvg-res/4.0.1-SNAPSHOT/ctakes-lvg-res-4.0.1-SNAPSHOT.pom
[JENKINS] Archiving <https://builds.apache.org/job/ctakes-trunk-package/ws/ctakes-lvg-res/target/ctakes-lvg-res-4.0.1-SNAPSHOT.jar>
to org.apache.ctakes/ctakes-lvg-res/4.0.1-SNAPSHOT/ctakes-lvg-res-4.0.1-SNAPSHOT.jar
[JENKINS] Archiving <https://builds.apache.org/job/ctakes-trunk-package/ws/ctakes-ytex/pom.xml>
to org.apache.ctakes/ctakes-ytex/4.0.1-SNAPSHOT/ctakes-ytex-4.0.1-SNAPSHOT.pom
[JENKINS] Archiving <https://builds.apache.org/job/ctakes-trunk-package/ws/ctakes-ytex/target/ctakes-ytex-4.0.1-SNAPSHOT.jar>
to org.apache.ctakes/ctakes-ytex/4.0.1-SNAPSHOT/ctakes-ytex-4.0.1-SNAPSHOT.jar
[JENKINS] Archiving <https://builds.apache.org/job/ctakes-trunk-package/ws/ctakes-relation-extractor-res/pom.xml>
to org.apache.ctakes/ctakes-relation-extractor-res/4.0.1-SNAPSHOT/ctakes-relation-extractor-res-4.0.1-SNAPSHOT.pom
[JENKINS] Archiving <https://builds.apache.org/job/ctakes-trunk-package/ws/ctakes-relation-extractor-res/target/ctakes-relation-extractor-res-4.0.1-SNAPSHOT.jar>
to org.apache.ctakes/ctakes-relation-extractor-res/4.0.1-SNAPSHOT/ctakes-relation-extractor-res-4.0.1-SNAPSHOT.jar
[Fast Archiver] Compressed 1.45 MB of artifacts by 92.7% relative to #581
[JENKINS] Archiving <https://builds.apache.org/job/ctakes-trunk-package/ws/ctakes-constituency-parser-res/pom.xml>
to org.apache.ctakes/ctakes-constituency-parser-res/4.0.1-SNAPSHOT/ctakes-constituency-parser-res-4.0.1-SNAPSHOT.pom
[JENKINS] Archiving <https://builds.apache.org/job/ctakes-trunk-package/ws/ctakes-constituency-parser-res/target/ctakes-constituency-parser-res-4.0.1-SNAPSHOT.jar>
to org.apache.ctakes/ctakes-constituency-parser-res/4.0.1-SNAPSHOT/ctakes-constituency-parser-res-4.0.1-SNAPSHOT.jar
[Fast Archiver] Compressed 32.15 MB of artifacts by 99.6% relative to #581
[JENKINS] Archiving <https://builds.apache.org/job/ctakes-trunk-package/ws/ctakes-core-res/pom.xml>
to org.apache.ctakes/ctakes-core-res/4.0.1-SNAPSHOT/ctakes-core-res-4.0.1-SNAPSHOT.pom
[JENKINS] Archiving <https://builds.apache.org/job/ctakes-trunk-package/ws/ctakes-core-res/target/ctakes-core-res-4.0.1-SNAPSHOT.jar>
to org.apache.ctakes/ctakes-core-res/4.0.1-SNAPSHOT/ctakes-core-res-4.0.1-SNAPSHOT.jar
[Fast Archiver] Compressed 2.10 MB of artifacts by 90.9% relative to #581
[JENKINS] Archiving <https://builds.apache.org/job/ctakes-trunk-package/ws/ctakes-dependency-parser-res/pom.xml>
to org.apache.ctakes/ctakes-dependency-parser-res/4.0.1-SNAPSHOT/ctakes-dependency-parser-res-4.0.1-SNAPSHOT.pom
[JENKINS] Archiving <https://builds.apache.org/job/ctakes-trunk-package/ws/ctakes-dependency-parser-res/target/ctakes-dependency-parser-res-4.0.1-SNAPSHOT.jar>
to org.apache.ctakes/ctakes-dependency-parser-res/4.0.1-SNAPSHOT/ctakes-dependency-parser-res-4.0.1-SNAPSHOT.jar
[Fast Archiver] Compressed 259.20 MB of artifacts by 99.9% relative to #581
[JENKINS] Archiving <https://builds.apache.org/job/ctakes-trunk-package/ws/ctakes-smoking-status/pom.xml>
to org.apache.ctakes/ctakes-smoking-status/4.0.1-SNAPSHOT/ctakes-smoking-status-4.0.1-SNAPSHOT.pom
[JENKINS] Archiving <https://builds.apache.org/job/ctakes-trunk-package/ws/ctakes-smoking-status/target/ctakes-smoking-status-4.0.1-SNAPSHOT.jar>
to org.apache.ctakes/ctakes-smoking-status/4.0.1-SNAPSHOT/ctakes-smoking-status-4.0.1-SNAPSHOT.jar
[JENKINS] Archiving <https://builds.apache.org/job/ctakes-trunk-package/ws/ctakes-pos-tagger-res/pom.xml>
to org.apache.ctakes/ctakes-pos-tagger-res/4.0.1-SNAPSHOT/ctakes-pos-tagger-res-4.0.1-SNAPSHOT.pom
[JENKINS] Archiving <https://builds.apache.org/job/ctakes-trunk-package/ws/ctakes-pos-tagger-res/target/ctakes-pos-tagger-res-4.0.1-SNAPSHOT.jar>
to org.apache.ctakes/ctakes-pos-tagger-res/4.0.1-SNAPSHOT/ctakes-pos-tagger-res-4.0.1-SNAPSHOT.jar
[Fast Archiver] Compressed 11.26 MB of artifacts by 99.4% relative to #581
[JENKINS] Archiving <https://builds.apache.org/job/ctakes-trunk-package/ws/ctakes-ytex-uima/pom.xml>
to org.apache.ctakes/ctakes-ytex-uima/4.0.1-SNAPSHOT/ctakes-ytex-uima-4.0.1-SNAPSHOT.pom
[JENKINS] Archiving <https://builds.apache.org/job/ctakes-trunk-package/ws/ctakes-ytex-uima/target/ctakes-ytex-uima-4.0.1-SNAPSHOT.jar>
to org.apache.ctakes/ctakes-ytex-uima/4.0.1-SNAPSHOT/ctakes-ytex-uima-4.0.1-SNAPSHOT.jar
channel stopped
Maven RedeployPublisher use remote H18 maven settings from : /home/jenkins/.m2/settings.xml
[INFO] Deployment in https://repository.apache.org/content/repositories/snapshots (id=apache.snapshots.https,uniqueVersion=true)
Deploying the main artifact ctakes-4.0.1-SNAPSHOT.pom
Downloading: https://repository.apache.org/content/repositories/snapshots/org/apache/ctakes/ctakes/4.0.1-SNAPSHOT/maven-metadata.xml
Downloaded: https://repository.apache.org/content/repositories/snapshots/org/apache/ctakes/ctakes/4.0.1-SNAPSHOT/maven-metadata.xml
(823 B at 1.1 KB/sec)
Uploading: https://repository.apache.org/content/repositories/snapshots/org/apache/ctakes/ctakes/4.0.1-SNAPSHOT/ctakes-4.0.1-20170731.122158-31.pom
Uploaded: https://repository.apache.org/content/repositories/snapshots/org/apache/ctakes/ctakes/4.0.1-SNAPSHOT/ctakes-4.0.1-20170731.122158-31.pom
(31 KB at 23.3 KB/sec)
Downloading: https://repository.apache.org/content/repositories/snapshots/org/apache/ctakes/ctakes/maven-metadata.xml
Downloaded: https://repository.apache.org/content/repositories/snapshots/org/apache/ctakes/ctakes/maven-metadata.xml
(383 B at 0.6 KB/sec)
Uploading: https://repository.apache.org/content/repositories/snapshots/org/apache/ctakes/ctakes/4.0.1-SNAPSHOT/maven-metadata.xml
Uploaded: https://repository.apache.org/content/repositories/snapshots/org/apache/ctakes/ctakes/4.0.1-SNAPSHOT/maven-metadata.xml
(823 B at 0.6 KB/sec)
Uploading: https://repository.apache.org/content/repositories/snapshots/org/apache/ctakes/ctakes/maven-metadata.xml
Uploaded: https://repository.apache.org/content/repositories/snapshots/org/apache/ctakes/ctakes/maven-metadata.xml
(383 B at 0.3 KB/sec)
[INFO] Deployment in https://repository.apache.org/content/repositories/snapshots (id=apache.snapshots.https,uniqueVersion=true)
Deploying the main artifact ctakes-assertion-4.0.1-SNAPSHOT.jar
Downloading: https://repository.apache.org/content/repositories/snapshots/org/apache/ctakes/ctakes-assertion/4.0.1-SNAPSHOT/maven-metadata.xml
Downloaded: https://repository.apache.org/content/repositories/snapshots/org/apache/ctakes/ctakes-assertion/4.0.1-SNAPSHOT/maven-metadata.xml
(2 KB at 1.9 KB/sec)
Uploading: https://repository.apache.org/content/repositories/snapshots/org/apache/ctakes/ctakes-assertion/4.0.1-SNAPSHOT/ctakes-assertion-4.0.1-20170731.122203-31.jar
Uploaded: https://repository.apache.org/content/repositories/snapshots/org/apache/ctakes/ctakes-assertion/4.0.1-SNAPSHOT/ctakes-assertion-4.0.1-20170731.122203-31.jar
(340 KB at 221.5 KB/sec)
Uploading: https://repository.apache.org/content/repositories/snapshots/org/apache/ctakes/ctakes-assertion/4.0.1-SNAPSHOT/ctakes-assertion-4.0.1-20170731.122203-31.pom
Uploaded: https://repository.apache.org/content/repositories/snapshots/org/apache/ctakes/ctakes-assertion/4.0.1-SNAPSHOT/ctakes-assertion-4.0.1-20170731.122203-31.pom
(7 KB at 5.0 KB/sec)
Downloading: https://repository.apache.org/content/repositories/snapshots/org/apache/ctakes/ctakes-assertion/maven-metadata.xml
Downloaded: https://repository.apache.org/content/repositories/snapshots/org/apache/ctakes/ctakes-assertion/maven-metadata.xml
(433 B at 0.7 KB/sec)
Uploading: https://repository.apache.org/content/repositories/snapshots/org/apache/ctakes/ctakes-assertion/4.0.1-SNAPSHOT/maven-metadata.xml
Uploaded: https://repository.apache.org/content/repositories/snapshots/org/apache/ctakes/ctakes-assertion/4.0.1-SNAPSHOT/maven-metadata.xml
(2 KB at 1.0 KB/sec)
Uploading: https://repository.apache.org/content/repositories/snapshots/org/apache/ctakes/ctakes-assertion/maven-metadata.xml
Uploaded: https://repository.apache.org/content/repositories/snapshots/org/apache/ctakes/ctakes-assertion/maven-metadata.xml
(433 B at 0.4 KB/sec)
[INFO] Deployment in https://repository.apache.org/content/repositories/snapshots (id=apache.snapshots.https,uniqueVersion=true)
Deploying the main artifact ctakes-assertion-res-4.0.1-SNAPSHOT.jar
Downloading: https://repository.apache.org/content/repositories/snapshots/org/apache/ctakes/ctakes-assertion-res/4.0.1-SNAPSHOT/maven-metadata.xml
Downloaded: https://repository.apache.org/content/repositories/snapshots/org/apache/ctakes/ctakes-assertion-res/4.0.1-SNAPSHOT/maven-metadata.xml
(1004 B at 1.6 KB/sec)
Uploading: https://repository.apache.org/content/repositories/snapshots/org/apache/ctakes/ctakes-assertion-res/4.0.1-SNAPSHOT/ctakes-assertion-res-4.0.1-20170731.122210-31.jar
Uploaded: https://repository.apache.org/content/repositories/snapshots/org/apache/ctakes/ctakes-assertion-res/4.0.1-SNAPSHOT/ctakes-assertion-res-4.0.1-20170731.122210-31.jar
(11451 KB at 2456.1 KB/sec)
Uploading: https://repository.apache.org/content/repositories/snapshots/org/apache/ctakes/ctakes-assertion-res/4.0.1-SNAPSHOT/ctakes-assertion-res-4.0.1-20170731.122210-31.pom
Uploaded: https://repository.apache.org/content/repositories/snapshots/org/apache/ctakes/ctakes-assertion-res/4.0.1-SNAPSHOT/ctakes-assertion-res-4.0.1-20170731.122210-31.pom
(2 KB at 1.3 KB/sec)
Downloading: https://repository.apache.org/content/repositories/snapshots/org/apache/ctakes/ctakes-assertion-res/maven-metadata.xml
Downloaded: https://repository.apache.org/content/repositories/snapshots/org/apache/ctakes/ctakes-assertion-res/maven-metadata.xml
(437 B at 0.7 KB/sec)
Uploading: https://repository.apache.org/content/repositories/snapshots/org/apache/ctakes/ctakes-assertion-res/4.0.1-SNAPSHOT/maven-metadata.xml
Uploaded: https://repository.apache.org/content/repositories/snapshots/org/apache/ctakes/ctakes-assertion-res/4.0.1-SNAPSHOT/maven-metadata.xml
(1004 B at 0.9 KB/sec)
Uploading: https://repository.apache.org/content/repositories/snapshots/org/apache/ctakes/ctakes-assertion-res/maven-metadata.xml
Uploaded: https://repository.apache.org/content/repositories/snapshots/org/apache/ctakes/ctakes-assertion-res/maven-metadata.xml
(437 B at 0.3 KB/sec)
[INFO] Deployment in https://repository.apache.org/content/repositories/snapshots (id=apache.snapshots.https,uniqueVersion=true)
Deploying the main artifact ctakes-assertion-zoner-4.0.1-SNAPSHOT.jar
Downloading: https://repository.apache.org/content/repositories/snapshots/org/apache/ctakes/ctakes-assertion-zoner/4.0.1-SNAPSHOT/maven-metadata.xml
Downloaded: https://repository.apache.org/content/repositories/snapshots/org/apache/ctakes/ctakes-assertion-zoner/4.0.1-SNAPSHOT/maven-metadata.xml
(2 KB at 0.9 KB/sec)
Uploading: https://repository.apache.org/content/repositories/snapshots/org/apache/ctakes/ctakes-assertion-zoner/4.0.1-SNAPSHOT/ctakes-assertion-zoner-4.0.1-20170731.122220-31.jar
Uploaded: https://repository.apache.org/content/repositories/snapshots/org/apache/ctakes/ctakes-assertion-zoner/4.0.1-SNAPSHOT/ctakes-assertion-zoner-4.0.1-20170731.122220-31.jar
(27 KB at 20.4 KB/sec)
Uploading: https://repository.apache.org/content/repositories/snapshots/org/apache/ctakes/ctakes-assertion-zoner/4.0.1-SNAPSHOT/ctakes-assertion-zoner-4.0.1-20170731.122220-31.pom
ERROR: Failed to deploy artifacts: Could not transfer artifact org.apache.ctakes:ctakes-assertion-zoner:pom:4.0.1-20170731.122220-31
from/to apache.snapshots.https (https://repository.apache.org/content/repositories/snapshots):
Failed to transfer file: https://repository.apache.org/content/repositories/snapshots/org/apache/ctakes/ctakes-assertion-zoner/4.0.1-SNAPSHOT/ctakes-assertion-zoner-4.0.1-20170731.122220-31.pom.
Return code is: 400, ReasonPhrase: Bad Request.
org.apache.maven.artifact.deployer.ArtifactDeploymentException: Failed to deploy artifacts:
Could not transfer artifact org.apache.ctakes:ctakes-assertion-zoner:pom:4.0.1-20170731.122220-31
from/to apache.snapshots.https (https://repository.apache.org/content/repositories/snapshots):
Failed to transfer file: https://repository.apache.org/content/repositories/snapshots/org/apache/ctakes/ctakes-assertion-zoner/4.0.1-SNAPSHOT/ctakes-assertion-zoner-4.0.1-20170731.122220-31.pom.
Return code is: 400, ReasonPhrase: Bad Request.
	at org.apache.maven.artifact.deployer.DefaultArtifactDeployer.deploy(DefaultArtifactDeployer.java:143)
	at hudson.maven.reporters.MavenArtifactRecord.deploy(MavenArtifactRecord.java:193)
	at hudson.maven.RedeployPublisher.perform(RedeployPublisher.java:176)
	at hudson.tasks.BuildStepMonitor$1.perform(BuildStepMonitor.java:20)
	at hudson.model.AbstractBuild$AbstractBuildExecution.perform(AbstractBuild.java:735)
	at hudson.model.AbstractBuild$AbstractBuildExecution.performAllBuildSteps(AbstractBuild.java:676)
	at hudson.maven.MavenModuleSetBuild$MavenModuleSetBuildExecution.post2(MavenModuleSetBuild.java:1072)
	at hudson.model.AbstractBuild$AbstractBuildExecution.post(AbstractBuild.java:621)
	at hudson.model.Run.execute(Run.java:1760)
	at hudson.maven.MavenModuleSetBuild.run(MavenModuleSetBuild.java:542)
	at hudson.model.ResourceController.execute(ResourceController.java:97)
	at hudson.model.Executor.run(Executor.java:405)
Caused by: org.eclipse.aether.deployment.DeploymentException: Failed to deploy artifacts:
Could not transfer artifact org.apache.ctakes:ctakes-assertion-zoner:pom:4.0.1-20170731.122220-31
from/to apache.snapshots.https (https://repository.apache.org/content/repositories/snapshots):
Failed to transfer file: https://repository.apache.org/content/repositories/snapshots/org/apache/ctakes/ctakes-assertion-zoner/4.0.1-SNAPSHOT/ctakes-assertion-zoner-4.0.1-20170731.122220-31.pom.
Return code is: 400, ReasonPhrase: Bad Request.
	at org.eclipse.aether.internal.impl.DefaultDeployer.deploy(DefaultDeployer.java:317)
	at org.eclipse.aether.internal.impl.DefaultDeployer.deploy(DefaultDeployer.java:245)
	at org.eclipse.aether.internal.impl.DefaultRepositorySystem.deploy(DefaultRepositorySystem.java:420)
	at org.apache.maven.artifact.deployer.DefaultArtifactDeployer.deploy(DefaultArtifactDeployer.java:139)
	... 11 more
Caused by: org.eclipse.aether.transfer.ArtifactTransferException: Could not transfer artifact
org.apache.ctakes:ctakes-assertion-zoner:pom:4.0.1-20170731.122220-31 from/to apache.snapshots.https
(https://repository.apache.org/content/repositories/snapshots): Failed to transfer file: https://repository.apache.org/content/repositories/snapshots/org/apache/ctakes/ctakes-assertion-zoner/4.0.1-SNAPSHOT/ctakes-assertion-zoner-4.0.1-20170731.122220-31.pom.
Return code is: 400, ReasonPhrase: Bad Request.
	at org.eclipse.aether.connector.basic.ArtifactTransportListener.transferFailed(ArtifactTransportListener.java:43)
	at org.eclipse.aether.connector.basic.BasicRepositoryConnector$TaskRunner.run(BasicRepositoryConnector.java:355)
	at org.eclipse.aether.connector.basic.BasicRepositoryConnector.put(BasicRepositoryConnector.java:274)
	at org.eclipse.aether.internal.impl.DefaultDeployer.deploy(DefaultDeployer.java:311)
	... 14 more
Caused by: org.apache.maven.wagon.TransferFailedException: Failed to transfer file: https://repository.apache.org/content/repositories/snapshots/org/apache/ctakes/ctakes-assertion-zoner/4.0.1-SNAPSHOT/ctakes-assertion-zoner-4.0.1-20170731.122220-31.pom.
Return code is: 400, ReasonPhrase: Bad Request.
	at org.apache.maven.wagon.providers.http.AbstractHttpClientWagon.put(AbstractHttpClientWagon.java:631)
	at org.apache.maven.wagon.providers.http.AbstractHttpClientWagon.put(AbstractHttpClientWagon.java:553)
	at org.apache.maven.wagon.providers.http.AbstractHttpClientWagon.put(AbstractHttpClientWagon.java:535)
	at org.apache.maven.wagon.providers.http.AbstractHttpClientWagon.put(AbstractHttpClientWagon.java:529)
	at org.apache.maven.wagon.providers.http.AbstractHttpClientWagon.put(AbstractHttpClientWagon.java:509)
	at org.eclipse.aether.transport.wagon.WagonTransporter$PutTaskRunner.run(WagonTransporter.java:644)
	at org.eclipse.aether.transport.wagon.WagonTransporter.execute(WagonTransporter.java:427)
	at org.eclipse.aether.transport.wagon.WagonTransporter.put(WagonTransporter.java:410)
	at org.eclipse.aether.connector.basic.BasicRepositoryConnector$PutTaskRunner.runTask(BasicRepositoryConnector.java:510)
	at org.eclipse.aether.connector.basic.BasicRepositoryConnector$TaskRunner.run(BasicRepositoryConnector.java:350)
	... 16 more
[INFO] Deployment failed after 38 sec
Build step 'Deploy artifacts to Maven repository' changed build result to FAILURE

Mime
View raw message