ctakes-notifications mailing list archives

Site index · List index
Message view « Date » · « Thread »
Top « Date » · « Thread »
From Apache Jenkins Server <jenk...@builds.apache.org>
Subject Build failed in Jenkins: ctakes-trunk-compiletest #1045
Date Mon, 10 Jul 2017 14:38:08 GMT
See <https://builds.apache.org/job/ctakes-trunk-compiletest/1045/display/redirect?page=changes>

Changes:

[tmill] Updated regression tests to use modern components. Now passes locally.

------------------------------------------
[...truncated 1.03 MB...]
Downloaded: http://repo.maven.apache.org/maven2/org/icefaces/icefaces-compat/2.0.2/icefaces-compat-2.0.2.jar
(2734 KB at 15101.3 KB/sec)
Downloading: http://repo.maven.apache.org/maven2/org/eclipse/jetty/jetty-http/9.1.0.M0/jetty-http-9.1.0.M0.jar
Downloaded: http://repo.maven.apache.org/maven2/org/glassfish/web/el-impl/2.2/el-impl-2.2.jar
(107 KB at 6669.3 KB/sec)
Downloading: http://repo.maven.apache.org/maven2/org/eclipse/jetty/jetty-util/9.1.0.M0/jetty-util-9.1.0.M0.jar
Downloaded: http://repo.maven.apache.org/maven2/org/apache/cxf/cxf-rt-databinding-aegis/2.7.8/cxf-rt-databinding-aegis-2.7.8.jar
(245 KB at 8738.8 KB/sec)
Downloading: http://repo.maven.apache.org/maven2/org/eclipse/jetty/jetty-io/9.1.0.M0/jetty-io-9.1.0.M0.jar
Downloaded: http://repo.maven.apache.org/maven2/org/apache/cxf/cxf-rt-frontend-jaxrs/2.7.8/cxf-rt-frontend-jaxrs-2.7.8.jar
(636 KB at 15492.7 KB/sec)
Downloading: http://repo.maven.apache.org/maven2/org/eclipse/jetty/jetty-runner/9.1.0.M0/jetty-runner-9.1.0.M0.jar
Downloaded: http://repo.maven.apache.org/maven2/org/eclipse/jetty/jetty-http/9.1.0.M0/jetty-http-9.1.0.M0.jar
(103 KB at 7316.4 KB/sec)
Downloading: http://repo.maven.apache.org/maven2/org/eclipse/jetty/jetty-plus/9.1.0.M0/jetty-plus-9.1.0.M0.jar
Downloaded: http://repo.maven.apache.org/maven2/org/eclipse/jetty/jetty-server/9.1.0.M0/jetty-server-9.1.0.M0.jar
(368 KB at 13628.1 KB/sec)
Downloading: http://repo.maven.apache.org/maven2/org/eclipse/jetty/jetty-webapp/9.1.0.M0/jetty-webapp-9.1.0.M0.jar
Downloaded: http://repo.maven.apache.org/maven2/org/eclipse/jetty/jetty-io/9.1.0.M0/jetty-io-9.1.0.M0.jar
(92 KB at 6097.3 KB/sec)
Downloading: http://repo.maven.apache.org/maven2/org/eclipse/jetty/jetty-xml/9.1.0.M0/jetty-xml-9.1.0.M0.jar
Downloaded: http://repo.maven.apache.org/maven2/org/eclipse/jetty/jetty-plus/9.1.0.M0/jetty-plus-9.1.0.M0.jar
(51 KB at 3860.4 KB/sec)
Downloading: http://repo.maven.apache.org/maven2/org/eclipse/jetty/jetty-annotations/9.1.0.M0/jetty-annotations-9.1.0.M0.jar
Downloaded: http://repo.maven.apache.org/maven2/org/eclipse/jetty/jetty-util/9.1.0.M0/jetty-util-9.1.0.M0.jar
(334 KB at 12818.0 KB/sec)
Downloading: http://repo.maven.apache.org/maven2/org/eclipse/jetty/orbit/org.objectweb.asm/3.1.0.v200803061910/org.objectweb.asm-3.1.0.v200803061910.jar
Downloaded: http://repo.maven.apache.org/maven2/org/eclipse/jetty/jetty-webapp/9.1.0.M0/jetty-webapp-9.1.0.M0.jar
(111 KB at 8476.3 KB/sec)
Downloading: http://repo.maven.apache.org/maven2/org/eclipse/jetty/jetty-jaas/9.1.0.M0/jetty-jaas-9.1.0.M0.jar
Downloaded: http://repo.maven.apache.org/maven2/org/eclipse/jetty/jetty-xml/9.1.0.M0/jetty-xml-9.1.0.M0.jar
(41 KB at 3136.0 KB/sec)
Downloading: http://repo.maven.apache.org/maven2/org/eclipse/jetty/jetty-security/9.1.0.M0/jetty-security-9.1.0.M0.jar
Downloaded: http://repo.maven.apache.org/maven2/org/eclipse/jetty/jetty-annotations/9.1.0.M0/jetty-annotations-9.1.0.M0.jar
(75 KB at 5702.5 KB/sec)
Downloading: http://repo.maven.apache.org/maven2/org/eclipse/jetty/websocket/websocket-server/9.1.0.M0/websocket-server-9.1.0.M0.jar
Downloaded: http://repo.maven.apache.org/maven2/org/eclipse/jetty/jetty-security/9.1.0.M0/jetty-security-9.1.0.M0.jar
(94 KB at 6673.6 KB/sec)
Downloaded: http://repo.maven.apache.org/maven2/org/eclipse/jetty/jetty-jaas/9.1.0.M0/jetty-jaas-9.1.0.M0.jar
(37 KB at 2441.1 KB/sec)
Downloading: http://repo.maven.apache.org/maven2/org/eclipse/jetty/websocket/websocket-common/9.1.0.M0/websocket-common-9.1.0.M0.jar
Downloading: http://repo.maven.apache.org/maven2/org/eclipse/jetty/websocket/websocket-api/9.1.0.M0/websocket-api-9.1.0.M0.jar
Downloaded: http://repo.maven.apache.org/maven2/org/eclipse/jetty/orbit/org.objectweb.asm/3.1.0.v200803061910/org.objectweb.asm-3.1.0.v200803061910.jar
(217 KB at 9400.2 KB/sec)
Downloading: http://repo.maven.apache.org/maven2/org/eclipse/jetty/websocket/websocket-client/9.1.0.M0/websocket-client-9.1.0.M0.jar
Downloaded: http://repo.maven.apache.org/maven2/org/eclipse/jetty/websocket/websocket-api/9.1.0.M0/websocket-api-9.1.0.M0.jar
(44 KB at 3313.0 KB/sec)
Downloading: http://repo.maven.apache.org/maven2/org/eclipse/jetty/websocket/websocket-servlet/9.1.0.M0/websocket-servlet-9.1.0.M0.jar
Downloaded: http://repo.maven.apache.org/maven2/org/eclipse/jetty/websocket/websocket-common/9.1.0.M0/websocket-common-9.1.0.M0.jar
(146 KB at 9120.7 KB/sec)
Downloading: http://repo.maven.apache.org/maven2/org/eclipse/jetty/jetty-servlet/9.1.0.M0/jetty-servlet-9.1.0.M0.jar
Downloaded: http://repo.maven.apache.org/maven2/org/eclipse/jetty/websocket/websocket-server/9.1.0.M0/websocket-server-9.1.0.M0.jar
(36 KB at 1370.1 KB/sec)
Downloading: http://repo.maven.apache.org/maven2/org/eclipse/jetty/jetty-jndi/9.1.0.M0/jetty-jndi-9.1.0.M0.jar
Downloaded: http://repo.maven.apache.org/maven2/org/eclipse/jetty/websocket/websocket-client/9.1.0.M0/websocket-client-9.1.0.M0.jar
(34 KB at 1961.2 KB/sec)
Downloading: http://repo.maven.apache.org/maven2/org/eclipse/jetty/jetty-jsp/9.1.0.M0/jetty-jsp-9.1.0.M0.jar
Downloaded: http://repo.maven.apache.org/maven2/org/eclipse/jetty/websocket/websocket-servlet/9.1.0.M0/websocket-servlet-9.1.0.M0.jar
(13 KB at 951.8 KB/sec)
Downloaded: http://repo.maven.apache.org/maven2/org/eclipse/jetty/jetty-jndi/9.1.0.M0/jetty-jndi-9.1.0.M0.jar
(40 KB at 3044.0 KB/sec)
Downloaded: http://repo.maven.apache.org/maven2/org/eclipse/jetty/jetty-servlet/9.1.0.M0/jetty-servlet-9.1.0.M0.jar
(105 KB at 6994.1 KB/sec)
Downloaded: http://repo.maven.apache.org/maven2/org/eclipse/jetty/jetty-jsp/9.1.0.M0/jetty-jsp-9.1.0.M0.jar
(4 KB at 301.4 KB/sec)
Downloaded: http://repo.maven.apache.org/maven2/org/eclipse/jetty/jetty-runner/9.1.0.M0/jetty-runner-9.1.0.M0.jar
(5087 KB at 31790.3 KB/sec)
[INFO] 
[INFO] --- maven-clean-plugin:2.4.1:clean (default-clean) @ ctakes-ytex-web ---
[INFO] 
[INFO] --- maven-remote-resources-plugin:1.4:process (default) @ ctakes-ytex-web ---
[INFO] artifact org.glassfish:javax.el: checking for updates from central
[INFO] artifact org.glassfish:javax.el: checking for updates from sonatype-snapshots
[INFO] 
[INFO] --- maven-resources-plugin:2.5:resources (default-resources) @ ctakes-ytex-web ---
[debug] execute contextualize
[INFO] Using 'UTF-8' encoding to copy filtered resources.
[INFO] Copying 48 resources
[INFO] Copying 0 resource
[INFO] Copying 3 resources
[INFO] 
[INFO] --- maven-compiler-plugin:2.4:compile (default-compile) @ ctakes-ytex-web ---
[INFO] Compiling 19 source files to <https://builds.apache.org/job/ctakes-trunk-compiletest/ws/ctakes-ytex-web/target/classes>
[WARNING] <https://builds.apache.org/job/ctakes-trunk-compiletest/ws/ctakes-ytex-web/src/main/java/org/apache/ctakes/ytex/web/search/ConceptSearchServiceImpl.java>:[35,43]
[deprecation] SimpleJdbcTemplate in org.springframework.jdbc.core.simple has been deprecated
[WARNING] <https://builds.apache.org/job/ctakes-trunk-compiletest/ws/ctakes-ytex-web/src/main/java/org/apache/ctakes/ytex/web/search/DocumentViewBean.java>:[28,43]
[deprecation] SimpleJdbcTemplate in org.springframework.jdbc.core.simple has been deprecated
[WARNING] <https://builds.apache.org/job/ctakes-trunk-compiletest/ws/ctakes-ytex-web/src/main/java/org/apache/ctakes/ytex/web/search/DocumentSearchServiceImpl.java>:[36,43]
[deprecation] SimpleJdbcTemplate in org.springframework.jdbc.core.simple has been deprecated
[WARNING] <https://builds.apache.org/job/ctakes-trunk-compiletest/ws/ctakes-ytex-web/src/main/java/org/apache/ctakes/ytex/web/search/ConceptSearchServiceImpl.java>:[58,9]
[deprecation] SimpleJdbcTemplate in org.springframework.jdbc.core.simple has been deprecated
[WARNING] <https://builds.apache.org/job/ctakes-trunk-compiletest/ws/ctakes-ytex-web/src/main/java/org/apache/ctakes/ytex/web/search/ConceptSearchServiceImpl.java>:[160,26]
[deprecation] SimpleJdbcTemplate in org.springframework.jdbc.core.simple has been deprecated
[WARNING] <https://builds.apache.org/job/ctakes-trunk-compiletest/ws/ctakes-ytex-web/src/main/java/org/apache/ctakes/ytex/web/search/DocumentViewBean.java>:[46,19]
[deprecation] SimpleJdbcTemplate in org.springframework.jdbc.core.simple has been deprecated
[WARNING] <https://builds.apache.org/job/ctakes-trunk-compiletest/ws/ctakes-ytex-web/src/main/java/org/apache/ctakes/ytex/web/search/DocumentViewBean.java>:[110,26]
[deprecation] SimpleJdbcTemplate in org.springframework.jdbc.core.simple has been deprecated
[WARNING] <https://builds.apache.org/job/ctakes-trunk-compiletest/ws/ctakes-ytex-web/src/main/java/org/apache/ctakes/ytex/web/search/DocumentSearchServiceImpl.java>:[58,9]
[deprecation] SimpleJdbcTemplate in org.springframework.jdbc.core.simple has been deprecated
[WARNING] <https://builds.apache.org/job/ctakes-trunk-compiletest/ws/ctakes-ytex-web/src/main/java/org/apache/ctakes/ytex/web/search/DocumentSearchServiceImpl.java>:[189,26]
[deprecation] SimpleJdbcTemplate in org.springframework.jdbc.core.simple has been deprecated
[INFO] 
[INFO] --- maven-remote-resources-plugin:1.4:process (default) @ ctakes-ytex-web ---
[INFO] 
[INFO] --- maven-resources-plugin:2.5:resources (default-resources) @ ctakes-ytex-web ---
[debug] execute contextualize
[INFO] Using 'UTF-8' encoding to copy filtered resources.
[INFO] Copying 48 resources
[INFO] Copying 0 resource
[INFO] Copying 3 resources
[INFO] Copying 3 resources
[INFO] 
[INFO] --- maven-compiler-plugin:2.4:compile (default-compile) @ ctakes-ytex-web ---
[INFO] Nothing to compile - all classes are up to date
[INFO] 
[INFO] --- maven-resources-plugin:2.5:testResources (default-testResources) @ ctakes-ytex-web
---
[debug] execute contextualize
[INFO] Using 'UTF-8' encoding to copy filtered resources.
[INFO] Copying 19 resources
[INFO] Copying 3 resources
[INFO] Copying 3 resources
[INFO] 
[INFO] --- maven-compiler-plugin:2.4:testCompile (default-testCompile) @ ctakes-ytex-web ---
[INFO] No sources to compile
[INFO] 
[INFO] --- maven-surefire-plugin:2.12.1:test (default-test) @ ctakes-ytex-web ---
[INFO] Surefire report directory: <https://builds.apache.org/job/ctakes-trunk-compiletest/ws/ctakes-ytex-web/target/surefire-reports>

-------------------------------------------------------
 T E S T S
-------------------------------------------------------

Results :

Tests run: 0, Failures: 0, Errors: 0, Skipped: 0

[JENKINS] Recording test results
[JENKINS] Archiving disabled
[INFO]                                                                         
[INFO] ------------------------------------------------------------------------
[INFO] Building Apache cTAKES Distribution 4.0.1-SNAPSHOT
[INFO] ------------------------------------------------------------------------
[INFO] 
[INFO] --- maven-clean-plugin:2.4.1:clean (default-clean) @ ctakes-distribution ---
[INFO] 
[INFO] --- maven-remote-resources-plugin:1.4:process (default) @ ctakes-distribution ---
[INFO] 
[INFO] --- maven-remote-resources-plugin:1.4:process (default) @ ctakes-distribution ---
[JENKINS] Archiving disabled
[INFO]                                                                         
[INFO] ------------------------------------------------------------------------
[INFO] Building Apache cTAKES Regression-test 4.0.1-SNAPSHOT
[INFO] ------------------------------------------------------------------------
Downloading: http://repo.maven.apache.org/maven2/org/apache/uima/uimaj-parent/2.9.0/uimaj-parent-2.9.0.jar
[JENKINS] Archiving disabled
[INFO] ------------------------------------------------------------------------
[INFO] Reactor Summary:
[INFO] 
[INFO] Apache cTAKES ..................................... SUCCESS [3.098s]
[INFO] ctakes-gui-res .................................... SUCCESS [2.797s]
[INFO] Apache cTAKES Resources core ...................... SUCCESS [2.648s]
[INFO] Apache cTAKES common type system .................. SUCCESS [9.920s]
[INFO] Apache cTAKES utils ............................... SUCCESS [3.598s]
[INFO] Apache cTAKES core ................................ SUCCESS [19.540s]
[INFO] ctakes-gui ........................................ SUCCESS [6.125s]
[INFO] Apache cTAKES Resources pos-tagger ................ SUCCESS [2.016s]
[INFO] Apache cTAKES part-of-speech tagger ............... SUCCESS [6.469s]
[INFO] Apache cTAKES Resources ctakes-chunker-res ........ SUCCESS [2.063s]
[INFO] Apache cTAKES chunker ............................. SUCCESS [1.917s]
[INFO] Apache cTAKES document preprocessor ............... SUCCESS [2.577s]
[INFO] Apache cTAKES Resources dictionary-lookup ......... SUCCESS [12.708s]
[INFO] Apache cTAKES dictionary lookup ................... SUCCESS [3.068s]
[INFO] Apache cTAKES context dependent tokenizer ......... SUCCESS [5.042s]
[INFO] Apache cTAKES Resources lvg ....................... SUCCESS [34.721s]
[INFO] Apache cTAKES LVG lexical tools ................... SUCCESS [4.638s]
[INFO] Apache cTAKES Resources ne-contexts ............... SUCCESS [4.081s]
[INFO] Apache cTAKES named entity contexts ............... SUCCESS [5.447s]
[INFO] Apache cTAKES Resources constituency-parser ....... SUCCESS [1.437s]
[INFO] Apache cTAKES Constituency Parser ................. SUCCESS [2.852s]
[INFO] Apache cTAKES Resources coreference ............... SUCCESS [1.407s]
[INFO] Apache cTAKES Resources temporal .................. SUCCESS [1.006s]
[INFO] Apache cTAKES Resources relation-extractor ........ SUCCESS [1.691s]
[INFO] Apache cTAKES Resources dictionary-lookup-fast-res  SUCCESS [3.614s]
[INFO] Apache cTAKES dictionary lookup fast .............. SUCCESS [3.545s]
[INFO] Apache cTAKES Resources assertion ................. SUCCESS [0.942s]
[INFO] Apache cTAKES Resources dependency-parser ......... SUCCESS [2.156s]
[INFO] Apache cTAKES Dependency Parser ................... SUCCESS [29.363s]
[INFO] Apache cTAKES Assertion ........................... SUCCESS [7.066s]
[INFO] ctakes-clinical-pipeline-res ...................... SUCCESS [1.751s]
[INFO] Apache cTAKES ctakes-clinical-pipeline ............ SUCCESS [19.655s]
[INFO] Apache cTAKES Relation Extractor .................. SUCCESS [8.933s]
[INFO] Apache cTAKES Temporal Information Extraction ..... SUCCESS [1:51.716s]
[INFO] Apache cTAKES CoReference Resolver ................ SUCCESS [5.873s]
[INFO] Apache cTAKES Resources drug-ner .................. SUCCESS [4.437s]
[INFO] Apache cTAKES Drug NER ............................ SUCCESS [9.816s]
[INFO] Apache cTAKES Resources side-effect ............... SUCCESS [2.593s]
[INFO] Apache cTAKES Side Effects ........................ SUCCESS [5.170s]
[INFO] Apache cTAKES Resources smoking-status ............ SUCCESS [2.968s]
[INFO] Apache cTAKES Smoking Status ...................... SUCCESS [5.478s]
[INFO] Apache cTAKES Resources assertion-zoner ........... SUCCESS [1.342s]
[INFO] Apache cTAKES Assertion's zoner ................... SUCCESS [3.684s]
[INFO] ctakes-examples-res ............................... SUCCESS [1.637s]
[INFO] ctakes-examples ................................... SUCCESS [6.007s]
[INFO] Apache cTAKES Resources ctakes-ytex-res ........... SUCCESS [3.051s]
[INFO] Apache cTAKES YTEX ................................ SUCCESS [12.087s]
[INFO] Apache cTAKES YTEX UIMA ........................... SUCCESS [8.180s]
[INFO] Apache cTAKES YTEX Web ............................ SUCCESS [22.030s]
[INFO] Apache cTAKES Distribution ........................ SUCCESS [2.457s]
[INFO] Apache cTAKES Regression-test ..................... FAILURE [1.861s]
[INFO] Apache cTAKES template filler ..................... SKIPPED
[INFO] ------------------------------------------------------------------------
[INFO] BUILD FAILURE
[INFO] ------------------------------------------------------------------------
[INFO] Total time: 8:55.662s
[INFO] Finished at: Mon Jul 10 14:35:32 UTC 2017
[INFO] Final Memory: 132M/1538M
[INFO] ------------------------------------------------------------------------
[JENKINS] Archiving disabled
[JENKINS] Archiving disabled
[JENKINS] Archiving disabled
[JENKINS] Archiving disabled
[JENKINS] Archiving disabled
[JENKINS] Archiving disabled
[JENKINS] Archiving disabled
[JENKINS] Archiving disabled
[JENKINS] Archiving disabled
[JENKINS] Archiving disabled
[JENKINS] Archiving disabled
[JENKINS] Archiving disabled
[JENKINS] Archiving disabled
[JENKINS] Archiving disabled
[JENKINS] Archiving disabled
[JENKINS] Archiving disabled
[JENKINS] Archiving disabled
[JENKINS] Archiving disabled
[JENKINS] Archiving disabled
[JENKINS] Archiving disabled
[JENKINS] Archiving disabled
[JENKINS] Archiving disabled
[JENKINS] Archiving disabled
[JENKINS] Archiving disabled
[JENKINS] Archiving disabled
[JENKINS] Archiving disabled
[JENKINS] Archiving disabled
[JENKINS] Archiving disabled
[JENKINS] Archiving disabled
[JENKINS] Archiving disabled
[JENKINS] Archiving disabled
[JENKINS] Archiving disabled
[JENKINS] Archiving disabled
[JENKINS] Archiving disabled
[JENKINS] Archiving disabled
[JENKINS] Archiving disabled
[JENKINS] Archiving disabled
[JENKINS] Archiving disabled
[JENKINS] Archiving disabled
[JENKINS] Archiving disabled
[JENKINS] Archiving disabled
[JENKINS] Archiving disabled
[JENKINS] Archiving disabled
[JENKINS] Archiving disabled
[JENKINS] Archiving disabled
[JENKINS] Archiving disabled
[JENKINS] Archiving disabled
[JENKINS] Archiving disabled
[JENKINS] Archiving disabled
[JENKINS] Archiving disabled
[JENKINS] Archiving disabled
[JENKINS] Archiving disabled
Waiting for Jenkins to finish collecting data
[ERROR] Failed to execute goal on project ctakes-regression-test: Could not resolve dependencies
for project org.apache.ctakes:ctakes-regression-test:jar:4.0.1-SNAPSHOT: Could not find artifact
org.apache.uima:uimaj-parent:jar:2.9.0 in central (http://repo.maven.apache.org/maven2) ->
[Help 1]
[ERROR] 
[ERROR] To see the full stack trace of the errors, re-run Maven with the -e switch.
[ERROR] Re-run Maven using the -X switch to enable full debug logging.
[ERROR] 
[ERROR] For more information about the errors and possible solutions, please read the following
articles:
[ERROR] [Help 1] http://cwiki.apache.org/confluence/display/MAVEN/DependencyResolutionException
[ERROR] 
[ERROR] After correcting the problems, you can resume the build with the command
[ERROR]   mvn <goals> -rf :ctakes-regression-test
Sending e-mails to: notifications@ctakes.apache.org timothy.miller@childrens.harvard.edu
channel stopped

Mime
View raw message