ctakes-notifications mailing list archives

Site index · List index
Message view « Date » · « Thread »
Top « Date » · « Thread »
From Apache Jenkins Server <jenk...@builds.apache.org>
Subject Build failed in Jenkins: ctakes-trunk-package #569
Date Thu, 29 Jun 2017 12:08:45 GMT
See <https://builds.apache.org/job/ctakes-trunk-package/569/display/redirect?page=changes>

Changes:

[seanfinan] Removing old unnecessary model file

[seanfinan] CTAKES-443 : stop rebuilding the type system for every module
CTAKES-448 : dependency tree is a mess

------------------------------------------
[...truncated 278.36 KB...]
[INFO] 
[INFO] --- maven-remote-resources-plugin:1.4:process (default) @ ctakes-clinical-pipeline-res
---
[INFO] 
[INFO] --- maven-resources-plugin:2.5:resources (default-resources) @ ctakes-clinical-pipeline-res
---
[debug] execute contextualize
[INFO] Using 'UTF-8' encoding to copy filtered resources.
[INFO] Copying 1 resource
[INFO] Copying 3 resources
[INFO] 
[INFO] --- maven-compiler-plugin:2.4:compile (default-compile) @ ctakes-clinical-pipeline-res
---
[INFO] No sources to compile
[INFO] 
[INFO] --- maven-resources-plugin:2.5:testResources (default-testResources) @ ctakes-clinical-pipeline-res
---
[debug] execute contextualize
[INFO] Using 'UTF-8' encoding to copy filtered resources.
[INFO] skip non existing resourceDirectory <https://builds.apache.org/job/ctakes-trunk-package/ws/ctakes-clinical-pipeline-res/src/test/resources>
[INFO] Copying 3 resources
[INFO] 
[INFO] --- maven-compiler-plugin:2.4:testCompile (default-testCompile) @ ctakes-clinical-pipeline-res
---
[INFO] No sources to compile
[INFO] 
[INFO] --- maven-surefire-plugin:2.12.1:test (default-test) @ ctakes-clinical-pipeline-res
---
[INFO] Tests are skipped.
[INFO] 
[INFO] --- maven-jar-plugin:2.4:jar (default-jar) @ ctakes-clinical-pipeline-res ---
[INFO] Building jar: <https://builds.apache.org/job/ctakes-trunk-package/ws/ctakes-clinical-pipeline-res/target/ctakes-clinical-pipeline-res-4.0.1-SNAPSHOT.jar>
[INFO] 
[INFO] --- maven-site-plugin:3.1:attach-descriptor (attach-descriptor) @ ctakes-clinical-pipeline-res
---
[INFO] 
[INFO] --- maven-install-plugin:2.3.1:install (default-install) @ ctakes-clinical-pipeline-res
---
[INFO] Installing <https://builds.apache.org/job/ctakes-trunk-package/ws/ctakes-clinical-pipeline-res/target/ctakes-clinical-pipeline-res-4.0.1-SNAPSHOT.jar>
to /home/jenkins/jenkins-slave/maven-repositories/0/org/apache/ctakes/ctakes-clinical-pipeline-res/4.0.1-SNAPSHOT/ctakes-clinical-pipeline-res-4.0.1-SNAPSHOT.jar
[INFO] Installing <https://builds.apache.org/job/ctakes-trunk-package/ws/ctakes-clinical-pipeline-res/pom.xml>
to /home/jenkins/jenkins-slave/maven-repositories/0/org/apache/ctakes/ctakes-clinical-pipeline-res/4.0.1-SNAPSHOT/ctakes-clinical-pipeline-res-4.0.1-SNAPSHOT.pom
[INFO]                                                                         
[INFO] ------------------------------------------------------------------------
[INFO] Building Apache cTAKES ctakes-clinical-pipeline 4.0.1-SNAPSHOT
[INFO] ------------------------------------------------------------------------
[INFO] 
[INFO] --- maven-clean-plugin:2.4.1:clean (default-clean) @ ctakes-clinical-pipeline ---
[INFO] 
[INFO] --- maven-remote-resources-plugin:1.4:process (default) @ ctakes-clinical-pipeline
---
[INFO] 
[INFO] --- maven-resources-plugin:2.5:resources (default-resources) @ ctakes-clinical-pipeline
---
[debug] execute contextualize
[INFO] Using 'UTF-8' encoding to copy filtered resources.
[INFO] skip non existing resourceDirectory <https://builds.apache.org/job/ctakes-trunk-package/ws/ctakes-clinical-pipeline/src/main/resources>
[INFO] Copying 3 resources
[INFO] 
[INFO] --- maven-compiler-plugin:2.4:compile (default-compile) @ ctakes-clinical-pipeline
---
[INFO] Compiling 5 source files to <https://builds.apache.org/job/ctakes-trunk-package/ws/ctakes-clinical-pipeline/target/classes>
[INFO] -------------------------------------------------------------
[ERROR] COMPILATION ERROR : 
[INFO] -------------------------------------------------------------
[ERROR] <https://builds.apache.org/job/ctakes-trunk-package/ws/ctakes-clinical-pipeline/src/main/java/org/apache/ctakes/clinicalpipeline/ClinicalPipelineFactory.java>:[30,44]
error: package org.apache.ctakes.coreference.factory does not exist
[ERROR] <https://builds.apache.org/job/ctakes-trunk-package/ws/ctakes-clinical-pipeline/src/main/java/org/apache/ctakes/clinicalpipeline/ClinicalPipelineFactory.java>:[32,45]
error: package org.apache.ctakes.dictionary.lookup.ae does not exist
[ERROR] <https://builds.apache.org/job/ctakes-trunk-package/ws/ctakes-clinical-pipeline/src/main/java/org/apache/ctakes/clinicalpipeline/runtime/BagOfAnnotationsGenerator.java>:[92,55]
[unchecked] unchecked cast
[ERROR]   required: Class<T>
  found:    Type
  where T is a type-variable:
    T extends Annotation declared in class BagOfAnnotationsGenerator
<https://builds.apache.org/job/ctakes-trunk-package/ws/ctakes-clinical-pipeline/src/main/java/org/apache/ctakes/clinicalpipeline/ClinicalPipelineFactory.java>:[71,19]
error: cannot find symbol
[ERROR]   symbol:   variable UmlsDictionaryLookupAnnotator
  location: class ClinicalPipelineFactory
<https://builds.apache.org/job/ctakes-trunk-package/ws/ctakes-clinical-pipeline/src/main/java/org/apache/ctakes/clinicalpipeline/ClinicalPipelineFactory.java>:[139,17]
error: cannot find symbol
[ERROR]   symbol:   variable CoreferenceAnnotatorFactory
  location: class ClinicalPipelineFactory
<https://builds.apache.org/job/ctakes-trunk-package/ws/ctakes-clinical-pipeline/src/main/java/org/apache/ctakes/clinicalpipeline/ae/ExtractionPrepAnnotator.java>:[158,23]
[unchecked] unchecked call to add(E) as a member of the raw type Set
[INFO] 6 errors 
[INFO] -------------------------------------------------------------
[INFO] ------------------------------------------------------------------------
[INFO] Reactor Summary:
[INFO] 
[INFO] Apache cTAKES ..................................... SUCCESS [7.596s]
[INFO] ctakes-gui-res .................................... SUCCESS [3.755s]
[INFO] Apache cTAKES Resources core ...................... SUCCESS [4.121s]
[INFO] Apache cTAKES common type system .................. SUCCESS [11.425s]
[INFO] Apache cTAKES utils ............................... SUCCESS [3.868s]
[INFO] Apache cTAKES core ................................ SUCCESS [7.763s]
[INFO] ctakes-gui ........................................ SUCCESS [4.844s]
[INFO] Apache cTAKES Resources pos-tagger ................ SUCCESS [3.626s]
[INFO] Apache cTAKES part-of-speech tagger ............... SUCCESS [5.941s]
[INFO] Apache cTAKES Resources ctakes-chunker-res ........ SUCCESS [4.120s]
[INFO] Apache cTAKES chunker ............................. SUCCESS [2.973s]
[INFO] Apache cTAKES document preprocessor ............... SUCCESS [2.999s]
[INFO] Apache cTAKES Resources dictionary-lookup ......... SUCCESS [13.967s]
[INFO] Apache cTAKES dictionary lookup ................... SUCCESS [5.862s]
[INFO] Apache cTAKES context dependent tokenizer ......... SUCCESS [2.729s]
[INFO] Apache cTAKES Resources lvg ....................... SUCCESS [31.330s]
[INFO] Apache cTAKES LVG lexical tools ................... SUCCESS [7.694s]
[INFO] Apache cTAKES Resources ne-contexts ............... SUCCESS [4.845s]
[INFO] Apache cTAKES named entity contexts ............... SUCCESS [3.125s]
[INFO] Apache cTAKES Resources constituency-parser ....... SUCCESS [4.882s]
[INFO] Apache cTAKES Constituency Parser ................. SUCCESS [3.140s]
[INFO] Apache cTAKES Resources coreference ............... SUCCESS [7.968s]
[INFO] Apache cTAKES Resources temporal .................. SUCCESS [6.382s]
[INFO] Apache cTAKES Resources relation-extractor ........ SUCCESS [2.608s]
[INFO] Apache cTAKES Resources dictionary-lookup-fast-res  SUCCESS [3.400s]
[INFO] Apache cTAKES dictionary lookup fast .............. SUCCESS [3.259s]
[INFO] Apache cTAKES Resources assertion ................. SUCCESS [5.017s]
[INFO] Apache cTAKES Resources dependency-parser ......... SUCCESS [23.326s]
[INFO] Apache cTAKES Dependency Parser ................... SUCCESS [6.820s]
[INFO] Apache cTAKES Assertion ........................... SUCCESS [8.957s]
[INFO] ctakes-clinical-pipeline-res ...................... SUCCESS [2.553s]
[INFO] Apache cTAKES ctakes-clinical-pipeline ............ FAILURE [5.484s]
[INFO] Apache cTAKES Relation Extractor .................. SKIPPED
[INFO] Apache cTAKES Temporal Information Extraction ..... SKIPPED
[INFO] Apache cTAKES CoReference Resolver ................ SKIPPED
[INFO] Apache cTAKES Resources drug-ner .................. SKIPPED
[INFO] Apache cTAKES Drug NER ............................ SKIPPED
[INFO] Apache cTAKES Resources side-effect ............... SKIPPED
[INFO] Apache cTAKES Side Effects ........................ SKIPPED
[INFO] Apache cTAKES Resources smoking-status ............ SKIPPED
[INFO] Apache cTAKES Smoking Status ...................... SKIPPED
[INFO] Apache cTAKES Resources assertion-zoner ........... SKIPPED
[INFO] Apache cTAKES Assertion's zoner ................... SKIPPED
[INFO] ctakes-examples-res ............................... SKIPPED
[INFO] ctakes-examples ................................... SKIPPED
[INFO] Apache cTAKES Resources ctakes-ytex-res ........... SKIPPED
[INFO] Apache cTAKES YTEX ................................ SKIPPED
[INFO] Apache cTAKES YTEX UIMA ........................... SKIPPED
[INFO] Apache cTAKES YTEX Web ............................ SKIPPED
[INFO] Apache cTAKES Distribution ........................ SKIPPED
[INFO] Apache cTAKES Regression-test ..................... SKIPPED
[INFO] Apache cTAKES template filler ..................... SKIPPED
[INFO] ------------------------------------------------------------------------
[INFO] BUILD FAILURE
[INFO] ------------------------------------------------------------------------
[INFO] Total time: 4:48.123s
[INFO] Finished at: Thu Jun 29 12:02:35 UTC 2017
[INFO] Final Memory: 67M/581M
[INFO] ------------------------------------------------------------------------
Waiting for Jenkins to finish collecting data
[ERROR] Failed to execute goal org.apache.maven.plugins:maven-compiler-plugin:2.4:compile
(default-compile) on project ctakes-clinical-pipeline: Compilation failure: Compilation failure:
[ERROR] <https://builds.apache.org/job/ctakes-trunk-package/ws/ctakes-clinical-pipeline/src/main/java/org/apache/ctakes/clinicalpipeline/ClinicalPipelineFactory.java>:[30,44]
error: package org.apache.ctakes.coreference.factory does not exist
[ERROR] <https://builds.apache.org/job/ctakes-trunk-package/ws/ctakes-clinical-pipeline/src/main/java/org/apache/ctakes/clinicalpipeline/ClinicalPipelineFactory.java>:[32,45]
error: package org.apache.ctakes.dictionary.lookup.ae does not exist
[ERROR] <https://builds.apache.org/job/ctakes-trunk-package/ws/ctakes-clinical-pipeline/src/main/java/org/apache/ctakes/clinicalpipeline/runtime/BagOfAnnotationsGenerator.java>:[92,55]
[unchecked] unchecked cast
[ERROR] required: Class<T>
[ERROR] found:    Type
[ERROR] where T is a type-variable:
[ERROR] T extends Annotation declared in class BagOfAnnotationsGenerator
[ERROR] <https://builds.apache.org/job/ctakes-trunk-package/ws/ctakes-clinical-pipeline/src/main/java/org/apache/ctakes/clinicalpipeline/ClinicalPipelineFactory.java>:[71,19]
error: cannot find symbol
[ERROR] symbol:   variable UmlsDictionaryLookupAnnotator
[ERROR] location: class ClinicalPipelineFactory
[ERROR] <https://builds.apache.org/job/ctakes-trunk-package/ws/ctakes-clinical-pipeline/src/main/java/org/apache/ctakes/clinicalpipeline/ClinicalPipelineFactory.java>:[139,17]
error: cannot find symbol
[ERROR] symbol:   variable CoreferenceAnnotatorFactory
[ERROR] location: class ClinicalPipelineFactory
[ERROR] <https://builds.apache.org/job/ctakes-trunk-package/ws/ctakes-clinical-pipeline/src/main/java/org/apache/ctakes/clinicalpipeline/ae/ExtractionPrepAnnotator.java>:[158,23]
[unchecked] unchecked call to add(E) as a member of the raw type Set
[ERROR] -> [Help 1]
[ERROR] 
[ERROR] To see the full stack trace of the errors, re-run Maven with the -e switch.
[ERROR] Re-run Maven using the -X switch to enable full debug logging.
[ERROR] 
[ERROR] For more information about the errors and possible solutions, please read the following
articles:
[ERROR] [Help 1] http://cwiki.apache.org/confluence/display/MAVEN/MojoFailureException
[ERROR] 
[ERROR] After correcting the problems, you can resume the build with the command
[ERROR]   mvn <goals> -rf :ctakes-clinical-pipeline
[JENKINS] Archiving <https://builds.apache.org/job/ctakes-trunk-package/ws/ctakes-clinical-pipeline/pom.xml>
to org.apache.ctakes/ctakes-clinical-pipeline/4.0.1-SNAPSHOT/ctakes-clinical-pipeline-4.0.1-SNAPSHOT.pom
[JENKINS] Archiving <https://builds.apache.org/job/ctakes-trunk-package/ws/ctakes-type-system/pom.xml>
to org.apache.ctakes/ctakes-type-system/4.0.1-SNAPSHOT/ctakes-type-system-4.0.1-SNAPSHOT.pom
[JENKINS] Archiving <https://builds.apache.org/job/ctakes-trunk-package/ws/ctakes-type-system/target/ctakes-type-system-4.0.1-SNAPSHOT.jar>
to org.apache.ctakes/ctakes-type-system/4.0.1-SNAPSHOT/ctakes-type-system-4.0.1-SNAPSHOT.jar
[JENKINS] Archiving <https://builds.apache.org/job/ctakes-trunk-package/ws/ctakes-dictionary-lookup/pom.xml>
to org.apache.ctakes/ctakes-dictionary-lookup/4.0.1-SNAPSHOT/ctakes-dictionary-lookup-4.0.1-SNAPSHOT.pom
[JENKINS] Archiving <https://builds.apache.org/job/ctakes-trunk-package/ws/ctakes-dictionary-lookup/target/ctakes-dictionary-lookup-4.0.1-SNAPSHOT.jar>
to org.apache.ctakes/ctakes-dictionary-lookup/4.0.1-SNAPSHOT/ctakes-dictionary-lookup-4.0.1-SNAPSHOT.jar
[JENKINS] Archiving <https://builds.apache.org/job/ctakes-trunk-package/ws/ctakes-constituency-parser/pom.xml>
to org.apache.ctakes/ctakes-constituency-parser/4.0.1-SNAPSHOT/ctakes-constituency-parser-4.0.1-SNAPSHOT.pom
[JENKINS] Archiving <https://builds.apache.org/job/ctakes-trunk-package/ws/ctakes-constituency-parser/target/ctakes-constituency-parser-4.0.1-SNAPSHOT.jar>
to org.apache.ctakes/ctakes-constituency-parser/4.0.1-SNAPSHOT/ctakes-constituency-parser-4.0.1-SNAPSHOT.jar
[JENKINS] Archiving <https://builds.apache.org/job/ctakes-trunk-package/ws/ctakes-examples-res/pom.xml>
to org.apache.ctakes/ctakes-examples-res/4.0.1-SNAPSHOT/ctakes-examples-res-4.0.1-SNAPSHOT.pom
[JENKINS] Archiving <https://builds.apache.org/job/ctakes-trunk-package/ws/ctakes-temporal/pom.xml>
to org.apache.ctakes/ctakes-temporal/4.0.1-SNAPSHOT/ctakes-temporal-4.0.1-SNAPSHOT.pom
[JENKINS] Archiving <https://builds.apache.org/job/ctakes-trunk-package/ws/ctakes-chunker-res/pom.xml>
to org.apache.ctakes/ctakes-chunker-res/4.0.1-SNAPSHOT/ctakes-chunker-res-4.0.1-SNAPSHOT.pom
[JENKINS] Archiving <https://builds.apache.org/job/ctakes-trunk-package/ws/ctakes-chunker-res/target/ctakes-chunker-res-4.0.1-SNAPSHOT.jar>
to org.apache.ctakes/ctakes-chunker-res/4.0.1-SNAPSHOT/ctakes-chunker-res-4.0.1-SNAPSHOT.jar
Compressed 12.16 MB of artifacts by 99.7% relative to #568
[JENKINS] Archiving <https://builds.apache.org/job/ctakes-trunk-package/ws/ctakes-regression-test/pom.xml>
to org.apache.ctakes/ctakes-regression-test/4.0.1-SNAPSHOT/ctakes-regression-test-4.0.1-SNAPSHOT.pom
[JENKINS] Archiving <https://builds.apache.org/job/ctakes-trunk-package/ws/ctakes-relation-extractor/pom.xml>
to org.apache.ctakes/ctakes-relation-extractor/4.0.1-SNAPSHOT/ctakes-relation-extractor-4.0.1-SNAPSHOT.pom
[JENKINS] Archiving <https://builds.apache.org/job/ctakes-trunk-package/ws/ctakes-gui/pom.xml>
to org.apache.ctakes/ctakes-gui/4.0.1-SNAPSHOT/ctakes-gui-4.0.1-SNAPSHOT.pom
[JENKINS] Archiving <https://builds.apache.org/job/ctakes-trunk-package/ws/ctakes-gui/target/ctakes-gui-4.0.1-SNAPSHOT.jar>
to org.apache.ctakes/ctakes-gui/4.0.1-SNAPSHOT/ctakes-gui-4.0.1-SNAPSHOT.jar
[JENKINS] Archiving <https://builds.apache.org/job/ctakes-trunk-package/ws/ctakes-preprocessor/pom.xml>
to org.apache.ctakes/ctakes-preprocessor/4.0.1-SNAPSHOT/ctakes-preprocessor-4.0.1-SNAPSHOT.pom
[JENKINS] Archiving <https://builds.apache.org/job/ctakes-trunk-package/ws/ctakes-preprocessor/target/ctakes-preprocessor-4.0.1-SNAPSHOT.jar>
to org.apache.ctakes/ctakes-preprocessor/4.0.1-SNAPSHOT/ctakes-preprocessor-4.0.1-SNAPSHOT.jar
[JENKINS] Archiving <https://builds.apache.org/job/ctakes-trunk-package/ws/ctakes-assertion-res/pom.xml>
to org.apache.ctakes/ctakes-assertion-res/4.0.1-SNAPSHOT/ctakes-assertion-res-4.0.1-SNAPSHOT.pom
[JENKINS] Archiving <https://builds.apache.org/job/ctakes-trunk-package/ws/ctakes-assertion-res/target/ctakes-assertion-res-4.0.1-SNAPSHOT.jar>
to org.apache.ctakes/ctakes-assertion-res/4.0.1-SNAPSHOT/ctakes-assertion-res-4.0.1-SNAPSHOT.jar
Compressed 11.18 MB of artifacts by 95.8% relative to #568
[JENKINS] Archiving <https://builds.apache.org/job/ctakes-trunk-package/ws/ctakes-assertion-zoner-res/pom.xml>
to org.apache.ctakes/ctakes-assertion-zoner-res/4.0.1-SNAPSHOT/ctakes-assertion-zoner-res-4.0.1-SNAPSHOT.pom
[JENKINS] Archiving <https://builds.apache.org/job/ctakes-trunk-package/ws/ctakes-assertion-zoner/pom.xml>
to org.apache.ctakes/ctakes-assertion-zoner/4.0.1-SNAPSHOT/ctakes-assertion-zoner-4.0.1-SNAPSHOT.pom
[JENKINS] Archiving <https://builds.apache.org/job/ctakes-trunk-package/ws/ctakes-ne-contexts-res/pom.xml>
to org.apache.ctakes/ctakes-ne-contexts-res/4.0.1-SNAPSHOT/ctakes-ne-contexts-res-4.0.1-SNAPSHOT.pom
[JENKINS] Archiving <https://builds.apache.org/job/ctakes-trunk-package/ws/ctakes-ne-contexts-res/target/ctakes-ne-contexts-res-4.0.1-SNAPSHOT.jar>
to org.apache.ctakes/ctakes-ne-contexts-res/4.0.1-SNAPSHOT/ctakes-ne-contexts-res-4.0.1-SNAPSHOT.jar
[JENKINS] Archiving <https://builds.apache.org/job/ctakes-trunk-package/ws/ctakes-drug-ner/pom.xml>
to org.apache.ctakes/ctakes-drug-ner/4.0.1-SNAPSHOT/ctakes-drug-ner-4.0.1-SNAPSHOT.pom
[JENKINS] Archiving <https://builds.apache.org/job/ctakes-trunk-package/ws/ctakes-ytex-web/pom.xml>
to org.apache.ctakes/ctakes-ytex-web/4.0.1-SNAPSHOT/ctakes-ytex-web-4.0.1-SNAPSHOT.pom
[JENKINS] Archiving <https://builds.apache.org/job/ctakes-trunk-package/ws/ctakes-context-tokenizer/pom.xml>
to org.apache.ctakes/ctakes-context-tokenizer/4.0.1-SNAPSHOT/ctakes-context-tokenizer-4.0.1-SNAPSHOT.pom
[JENKINS] Archiving <https://builds.apache.org/job/ctakes-trunk-package/ws/ctakes-context-tokenizer/target/ctakes-context-tokenizer-4.0.1-SNAPSHOT.jar>
to org.apache.ctakes/ctakes-context-tokenizer/4.0.1-SNAPSHOT/ctakes-context-tokenizer-4.0.1-SNAPSHOT.jar
[JENKINS] Archiving <https://builds.apache.org/job/ctakes-trunk-package/ws/ctakes-side-effect-res/pom.xml>
to org.apache.ctakes/ctakes-side-effect-res/4.0.1-SNAPSHOT/ctakes-side-effect-res-4.0.1-SNAPSHOT.pom
[JENKINS] Archiving <https://builds.apache.org/job/ctakes-trunk-package/ws/ctakes-examples/pom.xml>
to org.apache.ctakes/ctakes-examples/4.0.1-SNAPSHOT/ctakes-examples-4.0.1-SNAPSHOT.pom
[JENKINS] Archiving <https://builds.apache.org/job/ctakes-trunk-package/ws/ctakes-dictionary-lookup-fast-res/pom.xml>
to org.apache.ctakes/ctakes-dictionary-lookup-fast-res/4.0.1-SNAPSHOT/ctakes-dictionary-lookup-fast-res-4.0.1-SNAPSHOT.pom
[JENKINS] Archiving <https://builds.apache.org/job/ctakes-trunk-package/ws/ctakes-dictionary-lookup-fast-res/target/ctakes-dictionary-lookup-fast-res-4.0.1-SNAPSHOT.jar>
to org.apache.ctakes/ctakes-dictionary-lookup-fast-res/4.0.1-SNAPSHOT/ctakes-dictionary-lookup-fast-res-4.0.1-SNAPSHOT.jar
[JENKINS] Archiving <https://builds.apache.org/job/ctakes-trunk-package/ws/ctakes-dictionary-lookup-fast/pom.xml>
to org.apache.ctakes/ctakes-dictionary-lookup-fast/4.0.1-SNAPSHOT/ctakes-dictionary-lookup-fast-4.0.1-SNAPSHOT.pom
[JENKINS] Archiving <https://builds.apache.org/job/ctakes-trunk-package/ws/ctakes-dictionary-lookup-fast/target/ctakes-dictionary-lookup-fast-4.0.1-SNAPSHOT.jar>
to org.apache.ctakes/ctakes-dictionary-lookup-fast/4.0.1-SNAPSHOT/ctakes-dictionary-lookup-fast-4.0.1-SNAPSHOT.jar
[JENKINS] Archiving <https://builds.apache.org/job/ctakes-trunk-package/ws/ctakes-ne-contexts/pom.xml>
to org.apache.ctakes/ctakes-ne-contexts/4.0.1-SNAPSHOT/ctakes-ne-contexts-4.0.1-SNAPSHOT.pom
[JENKINS] Archiving <https://builds.apache.org/job/ctakes-trunk-package/ws/ctakes-ne-contexts/target/ctakes-ne-contexts-4.0.1-SNAPSHOT.jar>
to org.apache.ctakes/ctakes-ne-contexts/4.0.1-SNAPSHOT/ctakes-ne-contexts-4.0.1-SNAPSHOT.jar
[JENKINS] Archiving <https://builds.apache.org/job/ctakes-trunk-package/ws/ctakes-lvg/pom.xml>
to org.apache.ctakes/ctakes-lvg/4.0.1-SNAPSHOT/ctakes-lvg-4.0.1-SNAPSHOT.pom
[JENKINS] Archiving <https://builds.apache.org/job/ctakes-trunk-package/ws/ctakes-lvg/target/ctakes-lvg-4.0.1-SNAPSHOT.jar>
to org.apache.ctakes/ctakes-lvg/4.0.1-SNAPSHOT/ctakes-lvg-4.0.1-SNAPSHOT.jar
[JENKINS] Archiving <https://builds.apache.org/job/ctakes-trunk-package/ws/ctakes-smoking-status-res/pom.xml>
to org.apache.ctakes/ctakes-smoking-status-res/4.0.1-SNAPSHOT/ctakes-smoking-status-res-4.0.1-SNAPSHOT.pom
[JENKINS] Archiving <https://builds.apache.org/job/ctakes-trunk-package/ws/ctakes-pos-tagger/pom.xml>
to org.apache.ctakes/ctakes-pos-tagger/4.0.1-SNAPSHOT/ctakes-pos-tagger-4.0.1-SNAPSHOT.pom
[JENKINS] Archiving <https://builds.apache.org/job/ctakes-trunk-package/ws/ctakes-pos-tagger/target/ctakes-pos-tagger-4.0.1-SNAPSHOT.jar>
to org.apache.ctakes/ctakes-pos-tagger/4.0.1-SNAPSHOT/ctakes-pos-tagger-4.0.1-SNAPSHOT.jar
[JENKINS] Archiving <https://builds.apache.org/job/ctakes-trunk-package/ws/ctakes-side-effect/pom.xml>
to org.apache.ctakes/ctakes-side-effect/4.0.1-SNAPSHOT/ctakes-side-effect-4.0.1-SNAPSHOT.pom
[JENKINS] Archiving <https://builds.apache.org/job/ctakes-trunk-package/ws/ctakes-template-filler/pom.xml>
to org.apache.ctakes/ctakes-template-filler/4.0.1-SNAPSHOT/ctakes-template-filler-4.0.1-SNAPSHOT.pom
[JENKINS] Archiving <https://builds.apache.org/job/ctakes-trunk-package/ws/pom.xml>
to org.apache.ctakes/ctakes/4.0.1-SNAPSHOT/ctakes-4.0.1-SNAPSHOT.pom
[JENKINS] Archiving <https://builds.apache.org/job/ctakes-trunk-package/ws/ctakes-chunker/pom.xml>
to org.apache.ctakes/ctakes-chunker/4.0.1-SNAPSHOT/ctakes-chunker-4.0.1-SNAPSHOT.pom
[JENKINS] Archiving <https://builds.apache.org/job/ctakes-trunk-package/ws/ctakes-chunker/target/ctakes-chunker-4.0.1-SNAPSHOT.jar>
to org.apache.ctakes/ctakes-chunker/4.0.1-SNAPSHOT/ctakes-chunker-4.0.1-SNAPSHOT.jar
[JENKINS] Archiving <https://builds.apache.org/job/ctakes-trunk-package/ws/ctakes-utils/pom.xml>
to org.apache.ctakes/ctakes-utils/4.0.1-SNAPSHOT/ctakes-utils-4.0.1-SNAPSHOT.pom
[JENKINS] Archiving <https://builds.apache.org/job/ctakes-trunk-package/ws/ctakes-utils/target/ctakes-utils-4.0.1-SNAPSHOT.jar>
to org.apache.ctakes/ctakes-utils/4.0.1-SNAPSHOT/ctakes-utils-4.0.1-SNAPSHOT.jar
[JENKINS] Archiving <https://builds.apache.org/job/ctakes-trunk-package/ws/ctakes-drug-ner-res/pom.xml>
to org.apache.ctakes/ctakes-drug-ner-res/4.0.1-SNAPSHOT/ctakes-drug-ner-res-4.0.1-SNAPSHOT.pom
[JENKINS] Archiving <https://builds.apache.org/job/ctakes-trunk-package/ws/ctakes-core/pom.xml>
to org.apache.ctakes/ctakes-core/4.0.1-SNAPSHOT/ctakes-core-4.0.1-SNAPSHOT.pom
[JENKINS] Archiving <https://builds.apache.org/job/ctakes-trunk-package/ws/ctakes-core/target/ctakes-core-4.0.1-SNAPSHOT.jar>
to org.apache.ctakes/ctakes-core/4.0.1-SNAPSHOT/ctakes-core-4.0.1-SNAPSHOT.jar
[JENKINS] Archiving <https://builds.apache.org/job/ctakes-trunk-package/ws/ctakes-dependency-parser/pom.xml>
to org.apache.ctakes/ctakes-dependency-parser/4.0.1-SNAPSHOT/ctakes-dependency-parser-4.0.1-SNAPSHOT.pom
[JENKINS] Archiving <https://builds.apache.org/job/ctakes-trunk-package/ws/ctakes-dependency-parser/target/ctakes-dependency-parser-4.0.1-SNAPSHOT.jar>
to org.apache.ctakes/ctakes-dependency-parser/4.0.1-SNAPSHOT/ctakes-dependency-parser-4.0.1-SNAPSHOT.jar
[JENKINS] Archiving <https://builds.apache.org/job/ctakes-trunk-package/ws/ctakes-distribution/pom.xml>
to org.apache.ctakes/ctakes-distribution/4.0.1-SNAPSHOT/ctakes-distribution-4.0.1-SNAPSHOT.pom
[JENKINS] Archiving <https://builds.apache.org/job/ctakes-trunk-package/ws/ctakes-coreference-res/pom.xml>
to org.apache.ctakes/ctakes-coreference-res/4.0.1-SNAPSHOT/ctakes-coreference-res-4.0.1-SNAPSHOT.pom
[JENKINS] Archiving <https://builds.apache.org/job/ctakes-trunk-package/ws/ctakes-coreference-res/target/ctakes-coreference-res-4.0.1-SNAPSHOT.jar>
to org.apache.ctakes/ctakes-coreference-res/4.0.1-SNAPSHOT/ctakes-coreference-res-4.0.1-SNAPSHOT.jar
Compressed 23.90 MB of artifacts by 98.3% relative to #568
[JENKINS] Archiving <https://builds.apache.org/job/ctakes-trunk-package/ws/ctakes-coreference/pom.xml>
to org.apache.ctakes/ctakes-coreference/4.0.1-SNAPSHOT/ctakes-coreference-4.0.1-SNAPSHOT.pom
[JENKINS] Archiving <https://builds.apache.org/job/ctakes-trunk-package/ws/ctakes-assertion/pom.xml>
to org.apache.ctakes/ctakes-assertion/4.0.1-SNAPSHOT/ctakes-assertion-4.0.1-SNAPSHOT.pom
[JENKINS] Archiving <https://builds.apache.org/job/ctakes-trunk-package/ws/ctakes-assertion/target/ctakes-assertion-4.0.1-SNAPSHOT.jar>
to org.apache.ctakes/ctakes-assertion/4.0.1-SNAPSHOT/ctakes-assertion-4.0.1-SNAPSHOT.jar
[JENKINS] Archiving <https://builds.apache.org/job/ctakes-trunk-package/ws/ctakes-clinical-pipeline-res/pom.xml>
to org.apache.ctakes/ctakes-clinical-pipeline-res/4.0.1-SNAPSHOT/ctakes-clinical-pipeline-res-4.0.1-SNAPSHOT.pom
[JENKINS] Archiving <https://builds.apache.org/job/ctakes-trunk-package/ws/ctakes-clinical-pipeline-res/target/ctakes-clinical-pipeline-res-4.0.1-SNAPSHOT.jar>
to org.apache.ctakes/ctakes-clinical-pipeline-res/4.0.1-SNAPSHOT/ctakes-clinical-pipeline-res-4.0.1-SNAPSHOT.jar
[JENKINS] Archiving <https://builds.apache.org/job/ctakes-trunk-package/ws/ctakes-ytex-res/pom.xml>
to org.apache.ctakes/ctakes-ytex-res/4.0.1-SNAPSHOT/ctakes-ytex-res-4.0.1-SNAPSHOT.pom
[JENKINS] Archiving <https://builds.apache.org/job/ctakes-trunk-package/ws/ctakes-dictionary-lookup-res/pom.xml>
to org.apache.ctakes/ctakes-dictionary-lookup-res/4.0.1-SNAPSHOT/ctakes-dictionary-lookup-res-4.0.1-SNAPSHOT.pom
[JENKINS] Archiving <https://builds.apache.org/job/ctakes-trunk-package/ws/ctakes-dictionary-lookup-res/target/ctakes-dictionary-lookup-res-4.0.1-SNAPSHOT.jar>
to org.apache.ctakes/ctakes-dictionary-lookup-res/4.0.1-SNAPSHOT/ctakes-dictionary-lookup-res-4.0.1-SNAPSHOT.jar
[JENKINS] Archiving <https://builds.apache.org/job/ctakes-trunk-package/ws/ctakes-temporal-res/pom.xml>
to org.apache.ctakes/ctakes-temporal-res/4.0.1-SNAPSHOT/ctakes-temporal-res-4.0.1-SNAPSHOT.pom
[JENKINS] Archiving <https://builds.apache.org/job/ctakes-trunk-package/ws/ctakes-temporal-res/target/ctakes-temporal-res-4.0.1-SNAPSHOT.jar>
to org.apache.ctakes/ctakes-temporal-res/4.0.1-SNAPSHOT/ctakes-temporal-res-4.0.1-SNAPSHOT.jar
Compressed 6.86 MB of artifacts by 97.1% relative to #568
[JENKINS] Archiving <https://builds.apache.org/job/ctakes-trunk-package/ws/ctakes-gui-res/pom.xml>
to org.apache.ctakes/ctakes-gui-res/4.0.1-SNAPSHOT/ctakes-gui-res-4.0.1-SNAPSHOT.pom
[JENKINS] Archiving <https://builds.apache.org/job/ctakes-trunk-package/ws/ctakes-gui-res/target/ctakes-gui-res-4.0.1-SNAPSHOT.jar>
to org.apache.ctakes/ctakes-gui-res/4.0.1-SNAPSHOT/ctakes-gui-res-4.0.1-SNAPSHOT.jar
[JENKINS] Archiving <https://builds.apache.org/job/ctakes-trunk-package/ws/ctakes-lvg-res/pom.xml>
to org.apache.ctakes/ctakes-lvg-res/4.0.1-SNAPSHOT/ctakes-lvg-res-4.0.1-SNAPSHOT.pom
[JENKINS] Archiving <https://builds.apache.org/job/ctakes-trunk-package/ws/ctakes-lvg-res/target/ctakes-lvg-res-4.0.1-SNAPSHOT.jar>
to org.apache.ctakes/ctakes-lvg-res/4.0.1-SNAPSHOT/ctakes-lvg-res-4.0.1-SNAPSHOT.jar
[JENKINS] Archiving <https://builds.apache.org/job/ctakes-trunk-package/ws/ctakes-ytex/pom.xml>
to org.apache.ctakes/ctakes-ytex/4.0.1-SNAPSHOT/ctakes-ytex-4.0.1-SNAPSHOT.pom
[JENKINS] Archiving <https://builds.apache.org/job/ctakes-trunk-package/ws/ctakes-relation-extractor-res/pom.xml>
to org.apache.ctakes/ctakes-relation-extractor-res/4.0.1-SNAPSHOT/ctakes-relation-extractor-res-4.0.1-SNAPSHOT.pom
[JENKINS] Archiving <https://builds.apache.org/job/ctakes-trunk-package/ws/ctakes-relation-extractor-res/target/ctakes-relation-extractor-res-4.0.1-SNAPSHOT.jar>
to org.apache.ctakes/ctakes-relation-extractor-res/4.0.1-SNAPSHOT/ctakes-relation-extractor-res-4.0.1-SNAPSHOT.jar
Compressed 1.45 MB of artifacts by 92.7% relative to #568
[JENKINS] Archiving <https://builds.apache.org/job/ctakes-trunk-package/ws/ctakes-constituency-parser-res/pom.xml>
to org.apache.ctakes/ctakes-constituency-parser-res/4.0.1-SNAPSHOT/ctakes-constituency-parser-res-4.0.1-SNAPSHOT.pom
[JENKINS] Archiving <https://builds.apache.org/job/ctakes-trunk-package/ws/ctakes-constituency-parser-res/target/ctakes-constituency-parser-res-4.0.1-SNAPSHOT.jar>
to org.apache.ctakes/ctakes-constituency-parser-res/4.0.1-SNAPSHOT/ctakes-constituency-parser-res-4.0.1-SNAPSHOT.jar
Compressed 32.15 MB of artifacts by 99.6% relative to #568
[JENKINS] Archiving <https://builds.apache.org/job/ctakes-trunk-package/ws/ctakes-core-res/pom.xml>
to org.apache.ctakes/ctakes-core-res/4.0.1-SNAPSHOT/ctakes-core-res-4.0.1-SNAPSHOT.pom
[JENKINS] Archiving <https://builds.apache.org/job/ctakes-trunk-package/ws/ctakes-core-res/target/ctakes-core-res-4.0.1-SNAPSHOT.jar>
to org.apache.ctakes/ctakes-core-res/4.0.1-SNAPSHOT/ctakes-core-res-4.0.1-SNAPSHOT.jar
Compressed 2.09 MB of artifacts by 91.0% relative to #568
[JENKINS] Archiving <https://builds.apache.org/job/ctakes-trunk-package/ws/ctakes-dependency-parser-res/pom.xml>
to org.apache.ctakes/ctakes-dependency-parser-res/4.0.1-SNAPSHOT/ctakes-dependency-parser-res-4.0.1-SNAPSHOT.pom
[JENKINS] Archiving <https://builds.apache.org/job/ctakes-trunk-package/ws/ctakes-dependency-parser-res/target/ctakes-dependency-parser-res-4.0.1-SNAPSHOT.jar>
to org.apache.ctakes/ctakes-dependency-parser-res/4.0.1-SNAPSHOT/ctakes-dependency-parser-res-4.0.1-SNAPSHOT.jar
Compressed 259.20 MB of artifacts by 99.9% relative to #568
[JENKINS] Archiving <https://builds.apache.org/job/ctakes-trunk-package/ws/ctakes-smoking-status/pom.xml>
to org.apache.ctakes/ctakes-smoking-status/4.0.1-SNAPSHOT/ctakes-smoking-status-4.0.1-SNAPSHOT.pom
[JENKINS] Archiving <https://builds.apache.org/job/ctakes-trunk-package/ws/ctakes-pos-tagger-res/pom.xml>
to org.apache.ctakes/ctakes-pos-tagger-res/4.0.1-SNAPSHOT/ctakes-pos-tagger-res-4.0.1-SNAPSHOT.pom
[JENKINS] Archiving <https://builds.apache.org/job/ctakes-trunk-package/ws/ctakes-pos-tagger-res/target/ctakes-pos-tagger-res-4.0.1-SNAPSHOT.jar>
to org.apache.ctakes/ctakes-pos-tagger-res/4.0.1-SNAPSHOT/ctakes-pos-tagger-res-4.0.1-SNAPSHOT.jar
Compressed 11.26 MB of artifacts by 99.4% relative to #568
[JENKINS] Archiving <https://builds.apache.org/job/ctakes-trunk-package/ws/ctakes-ytex-uima/pom.xml>
to org.apache.ctakes/ctakes-ytex-uima/4.0.1-SNAPSHOT/ctakes-ytex-uima-4.0.1-SNAPSHOT.pom
Sending e-mails to: notifications@ctakes.apache.org sean.finan@tch.harvard.edu
channel stopped

Mime
View raw message