ctakes-notifications mailing list archives

Site index · List index
Message view « Date » · « Thread »
Top « Date » · « Thread »
From Apache Jenkins Server <jenk...@builds.apache.org>
Subject Build failed in Jenkins: ctakes-trunk-package #537
Date Fri, 31 Mar 2017 11:56:17 GMT
See <https://builds.apache.org/job/ctakes-trunk-package/537/display/redirect?page=changes>

Changes:

[seanfinan] javadoc description for class

[seanfinan] minor abstraction

[seanfinan] Simple negation for list entries

[seanfinan] set default regex bsv file path

[seanfinan] Fixed parameter description

[seanfinan] new list entry types

------------------------------------------
[...truncated 989.44 KB...]
      [sql] 1 of 1 SQL statements executed successfully
     [echo] mrconso.out = 0
     [echo] 
   [delete] Deleting: /tmp/mrconso-check.txt
     [echo] mrconso.exists = ${mrconso.exists}

umls.all:
     [echo] mrconso.exists = ${mrconso.exists}

init:

umls.drop.view:
     [echo] drop v_snomed_fword_lookup table

jdbc.sqlcmd:
     [echo] db.schemaPUBLIC
     [echo] umls.schema ${db.schema}
     [echo] umls.catalog 
     [echo] execute ./hsql/./umls/drop_view.sql
     [copy] Copying 1 file to /tmp
     [echo] executing /tmp/ytex1772015629.sql
      [sql] Executing resource: /tmp/ytex1772015629.sql
      [sql] 3 of 3 SQL statements executed successfully
   [delete] Deleting: /tmp/ytex1772015629.sql
   [delete] Deleting: /tmp/ytex1223990462use.sql

init.conn:
     [copy] Copying 1 file to /tmp

umls.create.view:
     [echo] create the v_snomed_fword_lookup table

jdbc.sqlcmd:
     [echo] db.schemaPUBLIC
     [echo] umls.schema ${db.schema}
     [echo] umls.catalog 
     [echo] execute ./hsql/./umls/create_view.sql
     [copy] Copying 1 file to /tmp
     [echo] executing /tmp/ytex25844121.sql
      [sql] Executing resource: /tmp/ytex25844121.sql
      [sql] 2 of 2 SQL statements executed successfully
   [delete] Deleting: /tmp/ytex25844121.sql
   [delete] Deleting: /tmp/ytex161742421use.sql

umls.import.view:
     [echo] import v_snomed_fword_lookup from <https://builds.apache.org/job/ctakes-trunk-package/ws/ctakes-ytex/scripts/data/umls/v_snomed_fword_lookup.txt.>
 Be patient, this can take a while.

jdl:
     [echo] jdl.format <https://builds.apache.org/job/ctakes-trunk-package/ws/ctakes-ytex/scripts/data/umls/v_snomed_fword_lookup.xml>
     [echo] jdl.data <https://builds.apache.org/job/ctakes-trunk-package/ws/ctakes-ytex/scripts/data/umls/v_snomed_fword_lookup.txt>
     [echo] umls.prefix 
     [copy] Copying 1 file to /tmp
     [java] 2017-03-31 11:52:38,371 INFO  org.apache.ctakes.jdl.data.loader.CsvLoader  - delimiter
9 encapsulator 65534
     [java] 2017-03-31 11:52:38,380 INFO  org.apache.ctakes.jdl.data.loader.CsvLoader  - insert
into PUBLIC.v_snomed_fword_lookup (cui,tui,fword,fstem,tok_str,stem_str) values (?,?,?,?,?,?)
     [java] Exception in thread "main" java.lang.NoSuchMethodError: org.hsqldb.DatabaseURL.parseURL(Ljava/lang/String;ZZ)Lorg/hsqldb/persist/HsqlProperties;
     [java] 	at org.hsqldb.jdbc.JDBCDriver.getConnection(Unknown Source)
     [java] 	at org.hsqldb.jdbc.JDBCDriver.connect(Unknown Source)
     [java] 	at java.sql.DriverManager.getConnection(DriverManager.java:664)
     [java] 	at java.sql.DriverManager.getConnection(DriverManager.java:247)
     [java] 	at org.apache.ctakes.jdl.data.base.JdlConnection.openConnection(JdlConnection.java:77)
     [java] 	at org.apache.ctakes.jdl.data.base.JdlConnection.getOpenConnection(JdlConnection.java:93)
     [java] 	at org.apache.ctakes.jdl.data.loader.CsvLoader.dataInsert(CsvLoader.java:133)
     [java] 	at org.apache.ctakes.jdl.AppJdl.execute(AppJdl.java:90)
     [java] 	at org.apache.ctakes.jdl.AppMain.main(AppMain.java:88)
[INFO] ------------------------------------------------------------------------
[INFO] Reactor Summary:
[INFO] 
[INFO] Apache cTAKES ..................................... SUCCESS [2.852s]
[INFO] ctakes-gui-res .................................... SUCCESS [1.814s]
[INFO] Apache cTAKES Resources core ...................... SUCCESS [1.138s]
[INFO] Apache cTAKES common type system .................. SUCCESS [5.355s]
[INFO] Apache cTAKES utils ............................... SUCCESS [3.202s]
[INFO] Apache cTAKES core ................................ SUCCESS [4.973s]
[INFO] ctakes-gui ........................................ SUCCESS [2.857s]
[INFO] Apache cTAKES Resources pos-tagger ................ SUCCESS [2.207s]
[INFO] Apache cTAKES part-of-speech tagger ............... SUCCESS [2.782s]
[INFO] Apache cTAKES Resources ctakes-chunker-res ........ SUCCESS [2.435s]
[INFO] Apache cTAKES chunker ............................. SUCCESS [2.415s]
[INFO] Apache cTAKES document preprocessor ............... SUCCESS [1.622s]
[INFO] Apache cTAKES Resources dictionary-lookup ......... SUCCESS [10.596s]
[INFO] Apache cTAKES dictionary lookup ................... SUCCESS [3.435s]
[INFO] Apache cTAKES context dependent tokenizer ......... SUCCESS [0.852s]
[INFO] Apache cTAKES Resources lvg ....................... SUCCESS [18.003s]
[INFO] Apache cTAKES LVG lexical tools ................... SUCCESS [6.043s]
[INFO] Apache cTAKES Resources ne-contexts ............... SUCCESS [4.977s]
[INFO] Apache cTAKES named entity contexts ............... SUCCESS [2.200s]
[INFO] Apache cTAKES Resources constituency-parser ....... SUCCESS [6.844s]
[INFO] Apache cTAKES Constituency Parser ................. SUCCESS [2.298s]
[INFO] Apache cTAKES Resources coreference ............... SUCCESS [8.417s]
[INFO] Apache cTAKES Resources relation-extractor ........ SUCCESS [2.006s]
[INFO] Apache cTAKES Resources dependency-parser ......... SUCCESS [24.154s]
[INFO] Apache cTAKES Dependency Parser ................... SUCCESS [4.907s]
[INFO] Apache cTAKES Relation Extractor .................. SUCCESS [10.038s]
[INFO] Apache cTAKES Resources assertion ................. SUCCESS [2.936s]
[INFO] Apache cTAKES Assertion ........................... SUCCESS [9.594s]
[INFO] Apache cTAKES Resources temporal .................. SUCCESS [4.007s]
[INFO] Apache cTAKES Resources dictionary-lookup-fast-res  SUCCESS [2.975s]
[INFO] Apache cTAKES dictionary lookup fast .............. SUCCESS [2.803s]
[INFO] Apache cTAKES Temporal Information Extraction ..... SUCCESS [1:12.268s]
[INFO] Apache cTAKES CoReference Resolver ................ SUCCESS [8.314s]
[INFO] Apache cTAKES Resources drug-ner .................. SUCCESS [1.105s]
[INFO] Apache cTAKES Drug NER ............................ SUCCESS [5.290s]
[INFO] Apache cTAKES Resources side-effect ............... SUCCESS [0.616s]
[INFO] Apache cTAKES Side Effects ........................ SUCCESS [6.264s]
[INFO] Apache cTAKES Resources smoking-status ............ SUCCESS [1.444s]
[INFO] Apache cTAKES Smoking Status ...................... SUCCESS [5.643s]
[INFO] Apache cTAKES Resources assertion-zoner ........... SUCCESS [1.492s]
[INFO] Apache cTAKES Assertion's zoner ................... SUCCESS [0.999s]
[INFO] Apache cTAKES Resources ctakes-ytex-res ........... SUCCESS [0.891s]
[INFO] Apache cTAKES YTEX ................................ SUCCESS [43.707s]
[INFO] Apache cTAKES YTEX UIMA ........................... FAILURE [18.230s]
[INFO] ctakes-clinical-pipeline-res ...................... SKIPPED
[INFO] Apache cTAKES ctakes-clinical-pipeline ............ SKIPPED
[INFO] ctakes-examples-res ............................... SKIPPED
[INFO] ctakes-examples ................................... SKIPPED
[INFO] Apache cTAKES YTEX Web ............................ SKIPPED
[INFO] Apache cTAKES Distribution ........................ SKIPPED
[INFO] Apache cTAKES Regression-test ..................... SKIPPED
[INFO] Apache cTAKES template filler ..................... SKIPPED
[INFO] ------------------------------------------------------------------------
[INFO] BUILD FAILURE
[INFO] ------------------------------------------------------------------------
[INFO] Total time: 6:31.504s
[INFO] Finished at: Fri Mar 31 11:52:39 UTC 2017
[INFO] Final Memory: 110M/936M
[INFO] ------------------------------------------------------------------------
Waiting for Jenkins to finish collecting data
[ERROR] Failed to execute goal org.apache.maven.plugins:maven-antrun-plugin:1.6:run (generate-test-config)
on project ctakes-ytex-uima: An Ant BuildException has occured: The following error occurred
while executing this line:
[ERROR] <https://builds.apache.org/job/ctakes-trunk-package/ws/ctakes-ytex/scripts/build-setup.xml>:149:
The following error occurred while executing this line:
[ERROR] <https://builds.apache.org/job/ctakes-trunk-package/ws/ctakes-ytex/scripts/data/build.xml>:148:
The following error occurred while executing this line:
[ERROR] <https://builds.apache.org/job/ctakes-trunk-package/ws/ctakes-ytex/scripts/data/build.xml>:295:
The following error occurred while executing this line:
[ERROR] <https://builds.apache.org/job/ctakes-trunk-package/ws/ctakes-ytex/scripts/data/build.xml>:456:
Java returned: 1
[ERROR] -> [Help 1]
[ERROR] 
[ERROR] To see the full stack trace of the errors, re-run Maven with the -e switch.
[ERROR] Re-run Maven using the -X switch to enable full debug logging.
[ERROR] 
[ERROR] For more information about the errors and possible solutions, please read the following
articles:
[ERROR] [Help 1] http://cwiki.apache.org/confluence/display/MAVEN/MojoExecutionException
[ERROR] 
[ERROR] After correcting the problems, you can resume the build with the command
[ERROR]   mvn <goals> -rf :ctakes-ytex-uima
[JENKINS] Archiving <https://builds.apache.org/job/ctakes-trunk-package/ws/ctakes-clinical-pipeline/pom.xml>
to org.apache.ctakes/ctakes-clinical-pipeline/3.2.3-SNAPSHOT/ctakes-clinical-pipeline-3.2.3-SNAPSHOT.pom
[JENKINS] Archiving <https://builds.apache.org/job/ctakes-trunk-package/ws/ctakes-type-system/pom.xml>
to org.apache.ctakes/ctakes-type-system/3.2.3-SNAPSHOT/ctakes-type-system-3.2.3-SNAPSHOT.pom
[JENKINS] Archiving <https://builds.apache.org/job/ctakes-trunk-package/ws/ctakes-type-system/target/ctakes-type-system-3.2.3-SNAPSHOT.jar>
to org.apache.ctakes/ctakes-type-system/3.2.3-SNAPSHOT/ctakes-type-system-3.2.3-SNAPSHOT.jar
[JENKINS] Archiving <https://builds.apache.org/job/ctakes-trunk-package/ws/ctakes-dictionary-lookup/pom.xml>
to org.apache.ctakes/ctakes-dictionary-lookup/3.2.3-SNAPSHOT/ctakes-dictionary-lookup-3.2.3-SNAPSHOT.pom
[JENKINS] Archiving <https://builds.apache.org/job/ctakes-trunk-package/ws/ctakes-dictionary-lookup/target/ctakes-dictionary-lookup-3.2.3-SNAPSHOT.jar>
to org.apache.ctakes/ctakes-dictionary-lookup/3.2.3-SNAPSHOT/ctakes-dictionary-lookup-3.2.3-SNAPSHOT.jar
[JENKINS] Archiving <https://builds.apache.org/job/ctakes-trunk-package/ws/ctakes-constituency-parser/pom.xml>
to org.apache.ctakes/ctakes-constituency-parser/3.2.3-SNAPSHOT/ctakes-constituency-parser-3.2.3-SNAPSHOT.pom
[JENKINS] Archiving <https://builds.apache.org/job/ctakes-trunk-package/ws/ctakes-constituency-parser/target/ctakes-constituency-parser-3.2.3-SNAPSHOT.jar>
to org.apache.ctakes/ctakes-constituency-parser/3.2.3-SNAPSHOT/ctakes-constituency-parser-3.2.3-SNAPSHOT.jar
[JENKINS] Archiving <https://builds.apache.org/job/ctakes-trunk-package/ws/ctakes-examples-res/pom.xml>
to org.apache.ctakes/ctakes-examples-res/3.2.3-SNAPSHOT/ctakes-examples-res-3.2.3-SNAPSHOT.pom
[JENKINS] Archiving <https://builds.apache.org/job/ctakes-trunk-package/ws/ctakes-temporal/pom.xml>
to org.apache.ctakes/ctakes-temporal/3.2.3-SNAPSHOT/ctakes-temporal-3.2.3-SNAPSHOT.pom
[JENKINS] Archiving <https://builds.apache.org/job/ctakes-trunk-package/ws/ctakes-temporal/target/ctakes-temporal-3.2.3-SNAPSHOT.jar>
to org.apache.ctakes/ctakes-temporal/3.2.3-SNAPSHOT/ctakes-temporal-3.2.3-SNAPSHOT.jar
Compressed 123.84 MB of artifacts by 99.0% relative to #536
[JENKINS] Archiving <https://builds.apache.org/job/ctakes-trunk-package/ws/ctakes-chunker-res/pom.xml>
to org.apache.ctakes/ctakes-chunker-res/3.2.3-SNAPSHOT/ctakes-chunker-res-3.2.3-SNAPSHOT.pom
[JENKINS] Archiving <https://builds.apache.org/job/ctakes-trunk-package/ws/ctakes-chunker-res/target/ctakes-chunker-res-3.2.3-SNAPSHOT.jar>
to org.apache.ctakes/ctakes-chunker-res/3.2.3-SNAPSHOT/ctakes-chunker-res-3.2.3-SNAPSHOT.jar
Compressed 12.16 MB of artifacts by 99.7% relative to #536
[JENKINS] Archiving <https://builds.apache.org/job/ctakes-trunk-package/ws/ctakes-regression-test/pom.xml>
to org.apache.ctakes/ctakes-regression-test/3.2.3-SNAPSHOT/ctakes-regression-test-3.2.3-SNAPSHOT.pom
[JENKINS] Archiving <https://builds.apache.org/job/ctakes-trunk-package/ws/ctakes-relation-extractor/pom.xml>
to org.apache.ctakes/ctakes-relation-extractor/3.2.3-SNAPSHOT/ctakes-relation-extractor-3.2.3-SNAPSHOT.pom
[JENKINS] Archiving <https://builds.apache.org/job/ctakes-trunk-package/ws/ctakes-relation-extractor/target/ctakes-relation-extractor-3.2.3-SNAPSHOT.jar>
to org.apache.ctakes/ctakes-relation-extractor/3.2.3-SNAPSHOT/ctakes-relation-extractor-3.2.3-SNAPSHOT.jar
[JENKINS] Archiving <https://builds.apache.org/job/ctakes-trunk-package/ws/ctakes-gui/pom.xml>
to org.apache.ctakes/ctakes-gui/3.2.3-SNAPSHOT/ctakes-gui-3.2.3-SNAPSHOT.pom
[JENKINS] Archiving <https://builds.apache.org/job/ctakes-trunk-package/ws/ctakes-gui/target/ctakes-gui-3.2.3-SNAPSHOT.jar>
to org.apache.ctakes/ctakes-gui/3.2.3-SNAPSHOT/ctakes-gui-3.2.3-SNAPSHOT.jar
[JENKINS] Archiving <https://builds.apache.org/job/ctakes-trunk-package/ws/ctakes-preprocessor/pom.xml>
to org.apache.ctakes/ctakes-preprocessor/3.2.3-SNAPSHOT/ctakes-preprocessor-3.2.3-SNAPSHOT.pom
[JENKINS] Archiving <https://builds.apache.org/job/ctakes-trunk-package/ws/ctakes-preprocessor/target/ctakes-preprocessor-3.2.3-SNAPSHOT.jar>
to org.apache.ctakes/ctakes-preprocessor/3.2.3-SNAPSHOT/ctakes-preprocessor-3.2.3-SNAPSHOT.jar
[JENKINS] Archiving <https://builds.apache.org/job/ctakes-trunk-package/ws/ctakes-assertion-res/pom.xml>
to org.apache.ctakes/ctakes-assertion-res/3.2.3-SNAPSHOT/ctakes-assertion-res-3.2.3-SNAPSHOT.pom
[JENKINS] Archiving <https://builds.apache.org/job/ctakes-trunk-package/ws/ctakes-assertion-res/target/ctakes-assertion-res-3.2.3-SNAPSHOT.jar>
to org.apache.ctakes/ctakes-assertion-res/3.2.3-SNAPSHOT/ctakes-assertion-res-3.2.3-SNAPSHOT.jar
Compressed 11.18 MB of artifacts by 95.6% relative to #536
[JENKINS] Archiving <https://builds.apache.org/job/ctakes-trunk-package/ws/ctakes-assertion-zoner-res/pom.xml>
to org.apache.ctakes/ctakes-assertion-zoner-res/3.2.3-SNAPSHOT/ctakes-assertion-zoner-res-3.2.3-SNAPSHOT.pom
[JENKINS] Archiving <https://builds.apache.org/job/ctakes-trunk-package/ws/ctakes-assertion-zoner-res/target/ctakes-assertion-zoner-res-3.2.3-SNAPSHOT.jar>
to org.apache.ctakes/ctakes-assertion-zoner-res/3.2.3-SNAPSHOT/ctakes-assertion-zoner-res-3.2.3-SNAPSHOT.jar
[JENKINS] Archiving <https://builds.apache.org/job/ctakes-trunk-package/ws/ctakes-assertion-zoner/pom.xml>
to org.apache.ctakes/ctakes-assertion-zoner/3.2.3-SNAPSHOT/ctakes-assertion-zoner-3.2.3-SNAPSHOT.pom
[JENKINS] Archiving <https://builds.apache.org/job/ctakes-trunk-package/ws/ctakes-assertion-zoner/target/ctakes-assertion-zoner-3.2.3-SNAPSHOT.jar>
to org.apache.ctakes/ctakes-assertion-zoner/3.2.3-SNAPSHOT/ctakes-assertion-zoner-3.2.3-SNAPSHOT.jar
[JENKINS] Archiving <https://builds.apache.org/job/ctakes-trunk-package/ws/ctakes-ne-contexts-res/pom.xml>
to org.apache.ctakes/ctakes-ne-contexts-res/3.2.3-SNAPSHOT/ctakes-ne-contexts-res-3.2.3-SNAPSHOT.pom
[JENKINS] Archiving <https://builds.apache.org/job/ctakes-trunk-package/ws/ctakes-ne-contexts-res/target/ctakes-ne-contexts-res-3.2.3-SNAPSHOT.jar>
to org.apache.ctakes/ctakes-ne-contexts-res/3.2.3-SNAPSHOT/ctakes-ne-contexts-res-3.2.3-SNAPSHOT.jar
[JENKINS] Archiving <https://builds.apache.org/job/ctakes-trunk-package/ws/ctakes-drug-ner/pom.xml>
to org.apache.ctakes/ctakes-drug-ner/3.2.3-SNAPSHOT/ctakes-drug-ner-3.2.3-SNAPSHOT.pom
[JENKINS] Archiving <https://builds.apache.org/job/ctakes-trunk-package/ws/ctakes-drug-ner/target/ctakes-drug-ner-3.2.3-SNAPSHOT.jar>
to org.apache.ctakes/ctakes-drug-ner/3.2.3-SNAPSHOT/ctakes-drug-ner-3.2.3-SNAPSHOT.jar
[JENKINS] Archiving <https://builds.apache.org/job/ctakes-trunk-package/ws/ctakes-ytex-web/pom.xml>
to org.apache.ctakes/ctakes-ytex-web/3.2.3-SNAPSHOT/ctakes-ytex-web-3.2.3-SNAPSHOT.pom
[JENKINS] Archiving <https://builds.apache.org/job/ctakes-trunk-package/ws/ctakes-context-tokenizer/pom.xml>
to org.apache.ctakes/ctakes-context-tokenizer/3.2.3-SNAPSHOT/ctakes-context-tokenizer-3.2.3-SNAPSHOT.pom
[JENKINS] Archiving <https://builds.apache.org/job/ctakes-trunk-package/ws/ctakes-context-tokenizer/target/ctakes-context-tokenizer-3.2.3-SNAPSHOT.jar>
to org.apache.ctakes/ctakes-context-tokenizer/3.2.3-SNAPSHOT/ctakes-context-tokenizer-3.2.3-SNAPSHOT.jar
[JENKINS] Archiving <https://builds.apache.org/job/ctakes-trunk-package/ws/ctakes-side-effect-res/pom.xml>
to org.apache.ctakes/ctakes-side-effect-res/3.2.3-SNAPSHOT/ctakes-side-effect-res-3.2.3-SNAPSHOT.pom
[JENKINS] Archiving <https://builds.apache.org/job/ctakes-trunk-package/ws/ctakes-side-effect-res/target/ctakes-side-effect-res-3.2.3-SNAPSHOT.jar>
to org.apache.ctakes/ctakes-side-effect-res/3.2.3-SNAPSHOT/ctakes-side-effect-res-3.2.3-SNAPSHOT.jar
[JENKINS] Archiving <https://builds.apache.org/job/ctakes-trunk-package/ws/ctakes-examples/pom.xml>
to org.apache.ctakes/ctakes-examples/3.2.3-SNAPSHOT/ctakes-examples-3.2.3-SNAPSHOT.pom
[JENKINS] Archiving <https://builds.apache.org/job/ctakes-trunk-package/ws/ctakes-dictionary-lookup-fast-res/pom.xml>
to org.apache.ctakes/ctakes-dictionary-lookup-fast-res/3.2.3-SNAPSHOT/ctakes-dictionary-lookup-fast-res-3.2.3-SNAPSHOT.pom
[JENKINS] Archiving <https://builds.apache.org/job/ctakes-trunk-package/ws/ctakes-dictionary-lookup-fast-res/target/ctakes-dictionary-lookup-fast-res-3.2.3-SNAPSHOT.jar>
to org.apache.ctakes/ctakes-dictionary-lookup-fast-res/3.2.3-SNAPSHOT/ctakes-dictionary-lookup-fast-res-3.2.3-SNAPSHOT.jar
[JENKINS] Archiving <https://builds.apache.org/job/ctakes-trunk-package/ws/ctakes-dictionary-lookup-fast/pom.xml>
to org.apache.ctakes/ctakes-dictionary-lookup-fast/3.2.3-SNAPSHOT/ctakes-dictionary-lookup-fast-3.2.3-SNAPSHOT.pom
[JENKINS] Archiving <https://builds.apache.org/job/ctakes-trunk-package/ws/ctakes-dictionary-lookup-fast/target/ctakes-dictionary-lookup-fast-3.2.3-SNAPSHOT.jar>
to org.apache.ctakes/ctakes-dictionary-lookup-fast/3.2.3-SNAPSHOT/ctakes-dictionary-lookup-fast-3.2.3-SNAPSHOT.jar
[JENKINS] Archiving <https://builds.apache.org/job/ctakes-trunk-package/ws/ctakes-ne-contexts/pom.xml>
to org.apache.ctakes/ctakes-ne-contexts/3.2.3-SNAPSHOT/ctakes-ne-contexts-3.2.3-SNAPSHOT.pom
[JENKINS] Archiving <https://builds.apache.org/job/ctakes-trunk-package/ws/ctakes-ne-contexts/target/ctakes-ne-contexts-3.2.3-SNAPSHOT.jar>
to org.apache.ctakes/ctakes-ne-contexts/3.2.3-SNAPSHOT/ctakes-ne-contexts-3.2.3-SNAPSHOT.jar
[JENKINS] Archiving <https://builds.apache.org/job/ctakes-trunk-package/ws/ctakes-lvg/pom.xml>
to org.apache.ctakes/ctakes-lvg/3.2.3-SNAPSHOT/ctakes-lvg-3.2.3-SNAPSHOT.pom
[JENKINS] Archiving <https://builds.apache.org/job/ctakes-trunk-package/ws/ctakes-lvg/target/ctakes-lvg-3.2.3-SNAPSHOT.jar>
to org.apache.ctakes/ctakes-lvg/3.2.3-SNAPSHOT/ctakes-lvg-3.2.3-SNAPSHOT.jar
[JENKINS] Archiving <https://builds.apache.org/job/ctakes-trunk-package/ws/ctakes-smoking-status-res/pom.xml>
to org.apache.ctakes/ctakes-smoking-status-res/3.2.3-SNAPSHOT/ctakes-smoking-status-res-3.2.3-SNAPSHOT.pom
[JENKINS] Archiving <https://builds.apache.org/job/ctakes-trunk-package/ws/ctakes-smoking-status-res/target/ctakes-smoking-status-res-3.2.3-SNAPSHOT.jar>
to org.apache.ctakes/ctakes-smoking-status-res/3.2.3-SNAPSHOT/ctakes-smoking-status-res-3.2.3-SNAPSHOT.jar
[JENKINS] Archiving <https://builds.apache.org/job/ctakes-trunk-package/ws/ctakes-pos-tagger/pom.xml>
to org.apache.ctakes/ctakes-pos-tagger/3.2.3-SNAPSHOT/ctakes-pos-tagger-3.2.3-SNAPSHOT.pom
[JENKINS] Archiving <https://builds.apache.org/job/ctakes-trunk-package/ws/ctakes-pos-tagger/target/ctakes-pos-tagger-3.2.3-SNAPSHOT.jar>
to org.apache.ctakes/ctakes-pos-tagger/3.2.3-SNAPSHOT/ctakes-pos-tagger-3.2.3-SNAPSHOT.jar
[JENKINS] Archiving <https://builds.apache.org/job/ctakes-trunk-package/ws/ctakes-side-effect/pom.xml>
to org.apache.ctakes/ctakes-side-effect/3.2.3-SNAPSHOT/ctakes-side-effect-3.2.3-SNAPSHOT.pom
[JENKINS] Archiving <https://builds.apache.org/job/ctakes-trunk-package/ws/ctakes-side-effect/target/ctakes-side-effect-3.2.3-SNAPSHOT.jar>
to org.apache.ctakes/ctakes-side-effect/3.2.3-SNAPSHOT/ctakes-side-effect-3.2.3-SNAPSHOT.jar
[JENKINS] Archiving <https://builds.apache.org/job/ctakes-trunk-package/ws/ctakes-template-filler/pom.xml>
to org.apache.ctakes/ctakes-template-filler/3.2.3-SNAPSHOT/ctakes-template-filler-3.2.3-SNAPSHOT.pom
[JENKINS] Archiving <https://builds.apache.org/job/ctakes-trunk-package/ws/pom.xml>
to org.apache.ctakes/ctakes/3.2.3-SNAPSHOT/ctakes-3.2.3-SNAPSHOT.pom
[JENKINS] Archiving <https://builds.apache.org/job/ctakes-trunk-package/ws/ctakes-chunker/pom.xml>
to org.apache.ctakes/ctakes-chunker/3.2.3-SNAPSHOT/ctakes-chunker-3.2.3-SNAPSHOT.pom
[JENKINS] Archiving <https://builds.apache.org/job/ctakes-trunk-package/ws/ctakes-chunker/target/ctakes-chunker-3.2.3-SNAPSHOT.jar>
to org.apache.ctakes/ctakes-chunker/3.2.3-SNAPSHOT/ctakes-chunker-3.2.3-SNAPSHOT.jar
[JENKINS] Archiving <https://builds.apache.org/job/ctakes-trunk-package/ws/ctakes-utils/pom.xml>
to org.apache.ctakes/ctakes-utils/3.2.3-SNAPSHOT/ctakes-utils-3.2.3-SNAPSHOT.pom
[JENKINS] Archiving <https://builds.apache.org/job/ctakes-trunk-package/ws/ctakes-utils/target/ctakes-utils-3.2.3-SNAPSHOT.jar>
to org.apache.ctakes/ctakes-utils/3.2.3-SNAPSHOT/ctakes-utils-3.2.3-SNAPSHOT.jar
[JENKINS] Archiving <https://builds.apache.org/job/ctakes-trunk-package/ws/ctakes-drug-ner-res/pom.xml>
to org.apache.ctakes/ctakes-drug-ner-res/3.2.3-SNAPSHOT/ctakes-drug-ner-res-3.2.3-SNAPSHOT.pom
[JENKINS] Archiving <https://builds.apache.org/job/ctakes-trunk-package/ws/ctakes-drug-ner-res/target/ctakes-drug-ner-res-3.2.3-SNAPSHOT.jar>
to org.apache.ctakes/ctakes-drug-ner-res/3.2.3-SNAPSHOT/ctakes-drug-ner-res-3.2.3-SNAPSHOT.jar
[JENKINS] Archiving <https://builds.apache.org/job/ctakes-trunk-package/ws/ctakes-core/pom.xml>
to org.apache.ctakes/ctakes-core/3.2.3-SNAPSHOT/ctakes-core-3.2.3-SNAPSHOT.pom
[JENKINS] Archiving <https://builds.apache.org/job/ctakes-trunk-package/ws/ctakes-core/target/ctakes-core-3.2.3-SNAPSHOT.jar>
to org.apache.ctakes/ctakes-core/3.2.3-SNAPSHOT/ctakes-core-3.2.3-SNAPSHOT.jar
[JENKINS] Archiving <https://builds.apache.org/job/ctakes-trunk-package/ws/ctakes-dependency-parser/pom.xml>
to org.apache.ctakes/ctakes-dependency-parser/3.2.3-SNAPSHOT/ctakes-dependency-parser-3.2.3-SNAPSHOT.pom
[JENKINS] Archiving <https://builds.apache.org/job/ctakes-trunk-package/ws/ctakes-dependency-parser/target/ctakes-dependency-parser-3.2.3-SNAPSHOT.jar>
to org.apache.ctakes/ctakes-dependency-parser/3.2.3-SNAPSHOT/ctakes-dependency-parser-3.2.3-SNAPSHOT.jar
[JENKINS] Archiving <https://builds.apache.org/job/ctakes-trunk-package/ws/ctakes-distribution/pom.xml>
to org.apache.ctakes/ctakes-distribution/3.2.3-SNAPSHOT/ctakes-distribution-3.2.3-SNAPSHOT.pom
[JENKINS] Archiving <https://builds.apache.org/job/ctakes-trunk-package/ws/ctakes-coreference-res/pom.xml>
to org.apache.ctakes/ctakes-coreference-res/3.2.3-SNAPSHOT/ctakes-coreference-res-3.2.3-SNAPSHOT.pom
[JENKINS] Archiving <https://builds.apache.org/job/ctakes-trunk-package/ws/ctakes-coreference-res/target/ctakes-coreference-res-3.2.3-SNAPSHOT.jar>
to org.apache.ctakes/ctakes-coreference-res/3.2.3-SNAPSHOT/ctakes-coreference-res-3.2.3-SNAPSHOT.jar
Compressed 23.90 MB of artifacts by 98.5% relative to #536
[JENKINS] Archiving <https://builds.apache.org/job/ctakes-trunk-package/ws/ctakes-coreference/pom.xml>
to org.apache.ctakes/ctakes-coreference/3.2.3-SNAPSHOT/ctakes-coreference-3.2.3-SNAPSHOT.pom
[JENKINS] Archiving <https://builds.apache.org/job/ctakes-trunk-package/ws/ctakes-coreference/target/ctakes-coreference-3.2.3-SNAPSHOT.jar>
to org.apache.ctakes/ctakes-coreference/3.2.3-SNAPSHOT/ctakes-coreference-3.2.3-SNAPSHOT.jar
[JENKINS] Archiving <https://builds.apache.org/job/ctakes-trunk-package/ws/ctakes-assertion/pom.xml>
to org.apache.ctakes/ctakes-assertion/3.2.3-SNAPSHOT/ctakes-assertion-3.2.3-SNAPSHOT.pom
[JENKINS] Archiving <https://builds.apache.org/job/ctakes-trunk-package/ws/ctakes-assertion/target/ctakes-assertion-3.2.3-SNAPSHOT.jar>
to org.apache.ctakes/ctakes-assertion/3.2.3-SNAPSHOT/ctakes-assertion-3.2.3-SNAPSHOT.jar
[JENKINS] Archiving <https://builds.apache.org/job/ctakes-trunk-package/ws/ctakes-clinical-pipeline-res/pom.xml>
to org.apache.ctakes/ctakes-clinical-pipeline-res/3.2.3-SNAPSHOT/ctakes-clinical-pipeline-res-3.2.3-SNAPSHOT.pom
[JENKINS] Archiving <https://builds.apache.org/job/ctakes-trunk-package/ws/ctakes-ytex-res/pom.xml>
to org.apache.ctakes/ctakes-ytex-res/3.2.3-SNAPSHOT/ctakes-ytex-res-3.2.3-SNAPSHOT.pom
[JENKINS] Archiving <https://builds.apache.org/job/ctakes-trunk-package/ws/ctakes-ytex-res/target/ctakes-ytex-res-3.2.3-SNAPSHOT.jar>
to org.apache.ctakes/ctakes-ytex-res/3.2.3-SNAPSHOT/ctakes-ytex-res-3.2.3-SNAPSHOT.jar
[JENKINS] Archiving <https://builds.apache.org/job/ctakes-trunk-package/ws/ctakes-dictionary-lookup-res/pom.xml>
to org.apache.ctakes/ctakes-dictionary-lookup-res/3.2.3-SNAPSHOT/ctakes-dictionary-lookup-res-3.2.3-SNAPSHOT.pom
[JENKINS] Archiving <https://builds.apache.org/job/ctakes-trunk-package/ws/ctakes-dictionary-lookup-res/target/ctakes-dictionary-lookup-res-3.2.3-SNAPSHOT.jar>
to org.apache.ctakes/ctakes-dictionary-lookup-res/3.2.3-SNAPSHOT/ctakes-dictionary-lookup-res-3.2.3-SNAPSHOT.jar
[JENKINS] Archiving <https://builds.apache.org/job/ctakes-trunk-package/ws/ctakes-temporal-res/pom.xml>
to org.apache.ctakes/ctakes-temporal-res/3.2.3-SNAPSHOT/ctakes-temporal-res-3.2.3-SNAPSHOT.pom
[JENKINS] Archiving <https://builds.apache.org/job/ctakes-trunk-package/ws/ctakes-temporal-res/target/ctakes-temporal-res-3.2.3-SNAPSHOT.jar>
to org.apache.ctakes/ctakes-temporal-res/3.2.3-SNAPSHOT/ctakes-temporal-res-3.2.3-SNAPSHOT.jar
Compressed 6.86 MB of artifacts by 97.1% relative to #536
[JENKINS] Archiving <https://builds.apache.org/job/ctakes-trunk-package/ws/ctakes-gui-res/pom.xml>
to org.apache.ctakes/ctakes-gui-res/3.2.3-SNAPSHOT/ctakes-gui-res-3.2.3-SNAPSHOT.pom
[JENKINS] Archiving <https://builds.apache.org/job/ctakes-trunk-package/ws/ctakes-gui-res/target/ctakes-gui-res-3.2.3-SNAPSHOT.jar>
to org.apache.ctakes/ctakes-gui-res/3.2.3-SNAPSHOT/ctakes-gui-res-3.2.3-SNAPSHOT.jar
[JENKINS] Archiving <https://builds.apache.org/job/ctakes-trunk-package/ws/ctakes-lvg-res/pom.xml>
to org.apache.ctakes/ctakes-lvg-res/3.2.3-SNAPSHOT/ctakes-lvg-res-3.2.3-SNAPSHOT.pom
[JENKINS] Archiving <https://builds.apache.org/job/ctakes-trunk-package/ws/ctakes-lvg-res/target/ctakes-lvg-res-3.2.3-SNAPSHOT.jar>
to org.apache.ctakes/ctakes-lvg-res/3.2.3-SNAPSHOT/ctakes-lvg-res-3.2.3-SNAPSHOT.jar
[JENKINS] Archiving <https://builds.apache.org/job/ctakes-trunk-package/ws/ctakes-ytex/pom.xml>
to org.apache.ctakes/ctakes-ytex/3.2.3-SNAPSHOT/ctakes-ytex-3.2.3-SNAPSHOT.pom
[JENKINS] Archiving <https://builds.apache.org/job/ctakes-trunk-package/ws/ctakes-ytex/target/ctakes-ytex-3.2.3-SNAPSHOT.jar>
to org.apache.ctakes/ctakes-ytex/3.2.3-SNAPSHOT/ctakes-ytex-3.2.3-SNAPSHOT.jar
[JENKINS] Archiving <https://builds.apache.org/job/ctakes-trunk-package/ws/ctakes-relation-extractor-res/pom.xml>
to org.apache.ctakes/ctakes-relation-extractor-res/3.2.3-SNAPSHOT/ctakes-relation-extractor-res-3.2.3-SNAPSHOT.pom
[JENKINS] Archiving <https://builds.apache.org/job/ctakes-trunk-package/ws/ctakes-relation-extractor-res/target/ctakes-relation-extractor-res-3.2.3-SNAPSHOT.jar>
to org.apache.ctakes/ctakes-relation-extractor-res/3.2.3-SNAPSHOT/ctakes-relation-extractor-res-3.2.3-SNAPSHOT.jar
Compressed 1.45 MB of artifacts by 92.7% relative to #536
[JENKINS] Archiving <https://builds.apache.org/job/ctakes-trunk-package/ws/ctakes-constituency-parser-res/pom.xml>
to org.apache.ctakes/ctakes-constituency-parser-res/3.2.3-SNAPSHOT/ctakes-constituency-parser-res-3.2.3-SNAPSHOT.pom
[JENKINS] Archiving <https://builds.apache.org/job/ctakes-trunk-package/ws/ctakes-constituency-parser-res/target/ctakes-constituency-parser-res-3.2.3-SNAPSHOT.jar>
to org.apache.ctakes/ctakes-constituency-parser-res/3.2.3-SNAPSHOT/ctakes-constituency-parser-res-3.2.3-SNAPSHOT.jar
Compressed 32.15 MB of artifacts by 99.6% relative to #536
[JENKINS] Archiving <https://builds.apache.org/job/ctakes-trunk-package/ws/ctakes-core-res/pom.xml>
to org.apache.ctakes/ctakes-core-res/3.2.3-SNAPSHOT/ctakes-core-res-3.2.3-SNAPSHOT.pom
[JENKINS] Archiving <https://builds.apache.org/job/ctakes-trunk-package/ws/ctakes-core-res/target/ctakes-core-res-3.2.3-SNAPSHOT.jar>
to org.apache.ctakes/ctakes-core-res/3.2.3-SNAPSHOT/ctakes-core-res-3.2.3-SNAPSHOT.jar
Compressed 2.09 MB of artifacts by 91.0% relative to #536
[JENKINS] Archiving <https://builds.apache.org/job/ctakes-trunk-package/ws/ctakes-dependency-parser-res/pom.xml>
to org.apache.ctakes/ctakes-dependency-parser-res/3.2.3-SNAPSHOT/ctakes-dependency-parser-res-3.2.3-SNAPSHOT.pom
[JENKINS] Archiving <https://builds.apache.org/job/ctakes-trunk-package/ws/ctakes-dependency-parser-res/target/ctakes-dependency-parser-res-3.2.3-SNAPSHOT.jar>
to org.apache.ctakes/ctakes-dependency-parser-res/3.2.3-SNAPSHOT/ctakes-dependency-parser-res-3.2.3-SNAPSHOT.jar
Compressed 259.20 MB of artifacts by 99.9% relative to #536
[JENKINS] Archiving <https://builds.apache.org/job/ctakes-trunk-package/ws/ctakes-smoking-status/pom.xml>
to org.apache.ctakes/ctakes-smoking-status/3.2.3-SNAPSHOT/ctakes-smoking-status-3.2.3-SNAPSHOT.pom
[JENKINS] Archiving <https://builds.apache.org/job/ctakes-trunk-package/ws/ctakes-smoking-status/target/ctakes-smoking-status-3.2.3-SNAPSHOT.jar>
to org.apache.ctakes/ctakes-smoking-status/3.2.3-SNAPSHOT/ctakes-smoking-status-3.2.3-SNAPSHOT.jar
[JENKINS] Archiving <https://builds.apache.org/job/ctakes-trunk-package/ws/ctakes-pos-tagger-res/pom.xml>
to org.apache.ctakes/ctakes-pos-tagger-res/3.2.3-SNAPSHOT/ctakes-pos-tagger-res-3.2.3-SNAPSHOT.pom
[JENKINS] Archiving <https://builds.apache.org/job/ctakes-trunk-package/ws/ctakes-pos-tagger-res/target/ctakes-pos-tagger-res-3.2.3-SNAPSHOT.jar>
to org.apache.ctakes/ctakes-pos-tagger-res/3.2.3-SNAPSHOT/ctakes-pos-tagger-res-3.2.3-SNAPSHOT.jar
Compressed 11.26 MB of artifacts by 99.1% relative to #536
[JENKINS] Archiving <https://builds.apache.org/job/ctakes-trunk-package/ws/ctakes-ytex-uima/pom.xml>
to org.apache.ctakes/ctakes-ytex-uima/3.2.3-SNAPSHOT/ctakes-ytex-uima-3.2.3-SNAPSHOT.pom
[JENKINS] Archiving <https://builds.apache.org/job/ctakes-trunk-package/ws/ctakes-ytex-uima/target/ctakes-ytex-uima-3.2.3-SNAPSHOT.jar>
to org.apache.ctakes/ctakes-ytex-uima/3.2.3-SNAPSHOT/ctakes-ytex-uima-3.2.3-SNAPSHOT.jar
Sending e-mails to: notifications@ctakes.apache.org
channel stopped

Mime
View raw message