ctakes-notifications mailing list archives

Site index · List index
Message view « Date » · « Thread »
Top « Date » · « Thread »
From Apache Jenkins Server <jenk...@builds.apache.org>
Subject Build failed in Jenkins: ctakes-trunk-package #525
Date Tue, 14 Mar 2017 11:45:22 GMT
See <https://builds.apache.org/job/ctakes-trunk-package/525/display/redirect?page=changes>

Changes:

[james-masanz] CTAKES-322 Update this script (to 4.0.0)

[seanfinan] AbstractOutputFileWriter : create subdirectory if not present
ConfigParameterConstants : add SubDirectory
CliOptionals : removed -s
PiperFileRunner : auto-parse -s
StandardOptions : add -s

[seanfinan] StandardOptions : add -l for cli dictionary lookup configuration xml file, default
""
DefaultFastPipeline.piper : add Chunker sub pipe, remove directory paths

------------------------------------------
[...truncated 55.29 KB...]
[INFO] ------------------------------------------------------------------------
[INFO] Building Apache cTAKES Resources core 3.2.3-SNAPSHOT
[INFO] ------------------------------------------------------------------------
[INFO] 
[INFO] --- maven-clean-plugin:2.4.1:clean (default-clean) @ ctakes-core-res ---
[INFO] 
[INFO] --- maven-remote-resources-plugin:1.4:process (default) @ ctakes-core-res ---
[INFO] 
[INFO] --- maven-resources-plugin:2.5:resources (default-resources) @ ctakes-core-res ---
[debug] execute contextualize
[INFO] Using 'UTF-8' encoding to copy filtered resources.
[INFO] Copying 18 resources
[INFO] Copying 3 resources
[INFO] 
[INFO] --- maven-compiler-plugin:2.4:compile (default-compile) @ ctakes-core-res ---
[INFO] No sources to compile
[INFO] 
[INFO] --- maven-resources-plugin:2.5:testResources (default-testResources) @ ctakes-core-res
---
[debug] execute contextualize
[INFO] Using 'UTF-8' encoding to copy filtered resources.
[INFO] skip non existing resourceDirectory <https://builds.apache.org/job/ctakes-trunk-package/ws/ctakes-core-res/src/test/resources>
[INFO] Copying 3 resources
[INFO] 
[INFO] --- maven-compiler-plugin:2.4:testCompile (default-testCompile) @ ctakes-core-res ---
[INFO] No sources to compile
[INFO] 
[INFO] --- maven-surefire-plugin:2.12.1:test (default-test) @ ctakes-core-res ---
[INFO] Tests are skipped.
[INFO] 
[INFO] --- maven-jar-plugin:2.4:jar (default-jar) @ ctakes-core-res ---
[INFO] Building jar: <https://builds.apache.org/job/ctakes-trunk-package/ws/ctakes-core-res/target/ctakes-core-res-3.2.3-SNAPSHOT.jar>
[INFO] 
[INFO] --- maven-site-plugin:3.1:attach-descriptor (attach-descriptor) @ ctakes-core-res ---
[INFO] 
[INFO] --- maven-install-plugin:2.3.1:install (default-install) @ ctakes-core-res ---
[INFO] Installing <https://builds.apache.org/job/ctakes-trunk-package/ws/ctakes-core-res/target/ctakes-core-res-3.2.3-SNAPSHOT.jar>
to /home/jenkins/jenkins-slave/maven-repositories/0/org/apache/ctakes/ctakes-core-res/3.2.3-SNAPSHOT/ctakes-core-res-3.2.3-SNAPSHOT.jar
[INFO] Installing <https://builds.apache.org/job/ctakes-trunk-package/ws/ctakes-core-res/pom.xml>
to /home/jenkins/jenkins-slave/maven-repositories/0/org/apache/ctakes/ctakes-core-res/3.2.3-SNAPSHOT/ctakes-core-res-3.2.3-SNAPSHOT.pom
[INFO]                                                                         
[INFO] ------------------------------------------------------------------------
[INFO] Building Apache cTAKES core 3.2.3-SNAPSHOT
[INFO] ------------------------------------------------------------------------
[INFO] 
[INFO] --- maven-clean-plugin:2.4.1:clean (default-clean) @ ctakes-core ---
[INFO] 
[INFO] --- maven-remote-resources-plugin:1.4:process (default) @ ctakes-core ---
[INFO] 
[INFO] --- maven-resources-plugin:2.5:resources (default-resources) @ ctakes-core ---
[debug] execute contextualize
[INFO] Using 'UTF-8' encoding to copy filtered resources.
[INFO] skip non existing resourceDirectory <https://builds.apache.org/job/ctakes-trunk-package/ws/ctakes-core/src/main/resources>
[INFO] Copying 3 resources
[INFO] 
[INFO] --- maven-compiler-plugin:2.4:compile (default-compile) @ ctakes-core ---
[INFO] Compiling 214 source files to <https://builds.apache.org/job/ctakes-trunk-package/ws/ctakes-core/target/classes>
[INFO] -------------------------------------------------------------
[ERROR] COMPILATION ERROR : 
[INFO] -------------------------------------------------------------
[ERROR] <https://builds.apache.org/job/ctakes-trunk-package/ws/ctakes-core/src/main/java/org/apache/ctakes/core/sentence/SentenceDetectorCtakes.java>:[45,25]
[deprecation] HashSumEventStream in opennlp.tools.util has been deprecated
[ERROR] <https://builds.apache.org/job/ctakes-trunk-package/ws/ctakes-core/src/main/java/org/apache/ctakes/core/cr/TextReader.java>:[24,33]
[deprecation] CasInitializer in org.apache.uima.collection has been deprecated
[ERROR] <https://builds.apache.org/job/ctakes-trunk-package/ws/ctakes-core/src/main/java/org/apache/ctakes/core/resource/LuceneIndexReaderResourceImpl.java>:[70,44]
[deprecation] open(Directory) in IndexReader has been deprecated
[ERROR] <https://builds.apache.org/job/ctakes-trunk-package/ws/ctakes-core/src/main/java/org/apache/ctakes/core/resource/LuceneIndexReaderResourceImpl.java>:[75,44]
[deprecation] open(Directory) in IndexReader has been deprecated
[ERROR] <https://builds.apache.org/job/ctakes-trunk-package/ws/ctakes-core/src/main/java/org/apache/ctakes/core/cr/JdbcCollectionReader.java>:[173,25]
[unchecked] unchecked conversion
[ERROR] <https://builds.apache.org/job/ctakes-trunk-package/ws/ctakes-core/src/main/java/org/apache/ctakes/core/cr/JdbcCollectionReader.java>:[270,20]
[deprecation] getCasInitializer() in CollectionReader_ImplBase has been deprecated
[ERROR] <https://builds.apache.org/job/ctakes-trunk-package/ws/ctakes-core/src/main/java/org/apache/ctakes/core/cr/JdbcCollectionReader.java>:[273,20]
[deprecation] getCasInitializer() in CollectionReader_ImplBase has been deprecated
[ERROR] <https://builds.apache.org/job/ctakes-trunk-package/ws/ctakes-core/src/main/java/org/apache/ctakes/core/cr/XmiCollectionReaderCtakes.java>:[88,18]
[unchecked] unchecked call to add(E) as a member of the raw type ArrayList
[ERROR]   where E is a type-variable:
    E extends Object declared in class ArrayList
<https://builds.apache.org/job/ctakes-trunk-package/ws/ctakes-core/src/main/java/org/apache/ctakes/core/sentence/SentenceDetectorCtakes.java>:[251,5]
[deprecation] HashSumEventStream in opennlp.tools.util has been deprecated
[ERROR] <https://builds.apache.org/job/ctakes-trunk-package/ws/ctakes-core/src/main/java/org/apache/ctakes/core/sentence/SentenceDetectorCtakes.java>:[251,35]
[deprecation] HashSumEventStream in opennlp.tools.util has been deprecated
[ERROR] <https://builds.apache.org/job/ctakes-trunk-package/ws/ctakes-core/src/main/java/org/apache/ctakes/core/cr/FilesInDirectoryCollectionReader.java>:[231,7]
[deprecation] getCasInitializer() in CollectionReader_ImplBase has been deprecated
[ERROR] <https://builds.apache.org/job/ctakes-trunk-package/ws/ctakes-core/src/main/java/org/apache/ctakes/core/cr/FilesInDirectoryCollectionReader.java>:[233,4]
[deprecation] getCasInitializer() in CollectionReader_ImplBase has been deprecated
[ERROR] <https://builds.apache.org/job/ctakes-trunk-package/ws/ctakes-core/src/main/java/org/apache/ctakes/core/util/ListIterable.java>:[34,50]
[unchecked] unchecked cast
[ERROR]   required: T
  found:    TOP
  where T is a type-variable:
    T extends Object declared in class FSListIterator
<https://builds.apache.org/job/ctakes-trunk-package/ws/ctakes-core/src/main/java/org/apache/ctakes/core/ae/SentenceDetector.java>:[309,30]
[deprecation] train(String,ObjectStream<SentenceSample>,boolean,Dictionary,TrainingParameters)
in SentenceDetectorME has been deprecated
[ERROR] <https://builds.apache.org/job/ctakes-trunk-package/ws/ctakes-core/src/main/java/org/apache/ctakes/core/pipeline/CliOptionalsHandler.java>:[55,28]
error: cannot find symbol
[ERROR]   symbol:   method getOption_s()
  location: variable optionals of type CliOptionals
<https://builds.apache.org/job/ctakes-trunk-package/ws/ctakes-core/src/main/java/org/apache/ctakes/core/pipeline/CliOptionalsHandler.java>:[119,28]
error: cannot find symbol
[ERROR]   symbol:   method getOption_S()
  location: variable optionals of type CliOptionals
<https://builds.apache.org/job/ctakes-trunk-package/ws/ctakes-core/src/main/java/org/apache/ctakes/core/cr/LinesFromFileCollectionReader.java>:[177,7]
[deprecation] getCasInitializer() in CollectionReader_ImplBase has been deprecated
[ERROR] <https://builds.apache.org/job/ctakes-trunk-package/ws/ctakes-core/src/main/java/org/apache/ctakes/core/cr/LinesFromFileCollectionReader.java>:[180,4]
[deprecation] getCasInitializer() in CollectionReader_ImplBase has been deprecated
[ERROR] <https://builds.apache.org/job/ctakes-trunk-package/ws/ctakes-core/src/main/java/org/apache/ctakes/core/cr/TextReader.java>:[85,4]
[deprecation] CasInitializer in org.apache.uima.collection has been deprecated
[ERROR] <https://builds.apache.org/job/ctakes-trunk-package/ws/ctakes-core/src/main/java/org/apache/ctakes/core/cr/TextReader.java>:[85,36]
[deprecation] getCasInitializer() in CollectionReader_ImplBase has been deprecated
[ERROR] <https://builds.apache.org/job/ctakes-trunk-package/ws/ctakes-core/src/main/java/org/apache/ctakes/core/resource/StringIntegerMapResourceImpl.java>:[101,15]
[unchecked] getMap() in StringIntegerMapResourceImpl implements getMap() in StringIntegerMapResource
[INFO] 21 errors 
[INFO] -------------------------------------------------------------
[INFO] ------------------------------------------------------------------------
[INFO] Reactor Summary:
[INFO] 
[INFO] Apache cTAKES ..................................... SUCCESS [1.848s]
[INFO] Apache cTAKES common type system .................. SUCCESS [4.694s]
[INFO] Apache cTAKES utils ............................... SUCCESS [1.957s]
[INFO] Apache cTAKES Resources core ...................... SUCCESS [0.721s]
[INFO] Apache cTAKES core ................................ FAILURE [2.564s]
[INFO] Apache cTAKES Resources pos-tagger ................ SKIPPED
[INFO] Apache cTAKES part-of-speech tagger ............... SKIPPED
[INFO] Apache cTAKES Resources ctakes-chunker-res ........ SKIPPED
[INFO] Apache cTAKES chunker ............................. SKIPPED
[INFO] Apache cTAKES document preprocessor ............... SKIPPED
[INFO] Apache cTAKES Resources dictionary-lookup ......... SKIPPED
[INFO] Apache cTAKES dictionary lookup ................... SKIPPED
[INFO] Apache cTAKES context dependent tokenizer ......... SKIPPED
[INFO] Apache cTAKES Resources lvg ....................... SKIPPED
[INFO] Apache cTAKES LVG lexical tools ................... SKIPPED
[INFO] Apache cTAKES Resources ne-contexts ............... SKIPPED
[INFO] Apache cTAKES named entity contexts ............... SKIPPED
[INFO] Apache cTAKES Resources constituency-parser ....... SKIPPED
[INFO] Apache cTAKES Constituency Parser ................. SKIPPED
[INFO] Apache cTAKES Resources coreference ............... SKIPPED
[INFO] Apache cTAKES Resources relation-extractor ........ SKIPPED
[INFO] Apache cTAKES Resources dependency-parser ......... SKIPPED
[INFO] Apache cTAKES Dependency Parser ................... SKIPPED
[INFO] Apache cTAKES Relation Extractor .................. SKIPPED
[INFO] Apache cTAKES Resources assertion ................. SKIPPED
[INFO] Apache cTAKES Assertion ........................... SKIPPED
[INFO] Apache cTAKES Resources temporal .................. SKIPPED
[INFO] Apache cTAKES Resources dictionary-lookup-fast-res  SKIPPED
[INFO] Apache cTAKES dictionary lookup fast .............. SKIPPED
[INFO] Apache cTAKES Temporal Information Extraction ..... SKIPPED
[INFO] Apache cTAKES CoReference Resolver ................ SKIPPED
[INFO] Apache cTAKES Resources drug-ner .................. SKIPPED
[INFO] Apache cTAKES Drug NER ............................ SKIPPED
[INFO] Apache cTAKES Resources side-effect ............... SKIPPED
[INFO] Apache cTAKES Side Effects ........................ SKIPPED
[INFO] Apache cTAKES Resources smoking-status ............ SKIPPED
[INFO] Apache cTAKES Smoking Status ...................... SKIPPED
[INFO] Apache cTAKES Resources assertion-zoner ........... SKIPPED
[INFO] Apache cTAKES Assertion's zoner ................... SKIPPED
[INFO] Apache cTAKES Resources ctakes-ytex-res ........... SKIPPED
[INFO] Apache cTAKES YTEX ................................ SKIPPED
[INFO] Apache cTAKES YTEX UIMA ........................... SKIPPED
[INFO] ctakes-clinical-pipeline-res ...................... SKIPPED
[INFO] Apache cTAKES ctakes-clinical-pipeline ............ SKIPPED
[INFO] ctakes-examples-res ............................... SKIPPED
[INFO] ctakes-examples ................................... SKIPPED
[INFO] Apache cTAKES YTEX Web ............................ SKIPPED
[INFO] Apache cTAKES Distribution ........................ SKIPPED
[INFO] Apache cTAKES Regression-test ..................... SKIPPED
[INFO] Apache cTAKES template filler ..................... SKIPPED
[INFO] ------------------------------------------------------------------------
[INFO] BUILD FAILURE
[INFO] ------------------------------------------------------------------------
[INFO] Total time: 14.869s
[INFO] Finished at: Tue Mar 14 11:43:50 UTC 2017
[INFO] Final Memory: 41M/519M
[INFO] ------------------------------------------------------------------------
Waiting for Jenkins to finish collecting data
[ERROR] Failed to execute goal org.apache.maven.plugins:maven-compiler-plugin:2.4:compile
(default-compile) on project ctakes-core: Compilation failure: Compilation failure:
[ERROR] <https://builds.apache.org/job/ctakes-trunk-package/ws/ctakes-core/src/main/java/org/apache/ctakes/core/sentence/SentenceDetectorCtakes.java>:[45,25]
[deprecation] HashSumEventStream in opennlp.tools.util has been deprecated
[ERROR] <https://builds.apache.org/job/ctakes-trunk-package/ws/ctakes-core/src/main/java/org/apache/ctakes/core/cr/TextReader.java>:[24,33]
[deprecation] CasInitializer in org.apache.uima.collection has been deprecated
[ERROR] <https://builds.apache.org/job/ctakes-trunk-package/ws/ctakes-core/src/main/java/org/apache/ctakes/core/resource/LuceneIndexReaderResourceImpl.java>:[70,44]
[deprecation] open(Directory) in IndexReader has been deprecated
[ERROR] <https://builds.apache.org/job/ctakes-trunk-package/ws/ctakes-core/src/main/java/org/apache/ctakes/core/resource/LuceneIndexReaderResourceImpl.java>:[75,44]
[deprecation] open(Directory) in IndexReader has been deprecated
[ERROR] <https://builds.apache.org/job/ctakes-trunk-package/ws/ctakes-core/src/main/java/org/apache/ctakes/core/cr/JdbcCollectionReader.java>:[173,25]
[unchecked] unchecked conversion
[ERROR] <https://builds.apache.org/job/ctakes-trunk-package/ws/ctakes-core/src/main/java/org/apache/ctakes/core/cr/JdbcCollectionReader.java>:[270,20]
[deprecation] getCasInitializer() in CollectionReader_ImplBase has been deprecated
[ERROR] <https://builds.apache.org/job/ctakes-trunk-package/ws/ctakes-core/src/main/java/org/apache/ctakes/core/cr/JdbcCollectionReader.java>:[273,20]
[deprecation] getCasInitializer() in CollectionReader_ImplBase has been deprecated
[ERROR] <https://builds.apache.org/job/ctakes-trunk-package/ws/ctakes-core/src/main/java/org/apache/ctakes/core/cr/XmiCollectionReaderCtakes.java>:[88,18]
[unchecked] unchecked call to add(E) as a member of the raw type ArrayList
[ERROR] where E is a type-variable:
[ERROR] E extends Object declared in class ArrayList
[ERROR] <https://builds.apache.org/job/ctakes-trunk-package/ws/ctakes-core/src/main/java/org/apache/ctakes/core/sentence/SentenceDetectorCtakes.java>:[251,5]
[deprecation] HashSumEventStream in opennlp.tools.util has been deprecated
[ERROR] <https://builds.apache.org/job/ctakes-trunk-package/ws/ctakes-core/src/main/java/org/apache/ctakes/core/sentence/SentenceDetectorCtakes.java>:[251,35]
[deprecation] HashSumEventStream in opennlp.tools.util has been deprecated
[ERROR] <https://builds.apache.org/job/ctakes-trunk-package/ws/ctakes-core/src/main/java/org/apache/ctakes/core/cr/FilesInDirectoryCollectionReader.java>:[231,7]
[deprecation] getCasInitializer() in CollectionReader_ImplBase has been deprecated
[ERROR] <https://builds.apache.org/job/ctakes-trunk-package/ws/ctakes-core/src/main/java/org/apache/ctakes/core/cr/FilesInDirectoryCollectionReader.java>:[233,4]
[deprecation] getCasInitializer() in CollectionReader_ImplBase has been deprecated
[ERROR] <https://builds.apache.org/job/ctakes-trunk-package/ws/ctakes-core/src/main/java/org/apache/ctakes/core/util/ListIterable.java>:[34,50]
[unchecked] unchecked cast
[ERROR] required: T
[ERROR] found:    TOP
[ERROR] where T is a type-variable:
[ERROR] T extends Object declared in class FSListIterator
[ERROR] <https://builds.apache.org/job/ctakes-trunk-package/ws/ctakes-core/src/main/java/org/apache/ctakes/core/ae/SentenceDetector.java>:[309,30]
[deprecation] train(String,ObjectStream<SentenceSample>,boolean,Dictionary,TrainingParameters)
in SentenceDetectorME has been deprecated
[ERROR] <https://builds.apache.org/job/ctakes-trunk-package/ws/ctakes-core/src/main/java/org/apache/ctakes/core/pipeline/CliOptionalsHandler.java>:[55,28]
error: cannot find symbol
[ERROR] symbol:   method getOption_s()
[ERROR] location: variable optionals of type CliOptionals
[ERROR] <https://builds.apache.org/job/ctakes-trunk-package/ws/ctakes-core/src/main/java/org/apache/ctakes/core/pipeline/CliOptionalsHandler.java>:[119,28]
error: cannot find symbol
[ERROR] symbol:   method getOption_S()
[ERROR] location: variable optionals of type CliOptionals
[ERROR] <https://builds.apache.org/job/ctakes-trunk-package/ws/ctakes-core/src/main/java/org/apache/ctakes/core/cr/LinesFromFileCollectionReader.java>:[177,7]
[deprecation] getCasInitializer() in CollectionReader_ImplBase has been deprecated
[ERROR] <https://builds.apache.org/job/ctakes-trunk-package/ws/ctakes-core/src/main/java/org/apache/ctakes/core/cr/LinesFromFileCollectionReader.java>:[180,4]
[deprecation] getCasInitializer() in CollectionReader_ImplBase has been deprecated
[ERROR] <https://builds.apache.org/job/ctakes-trunk-package/ws/ctakes-core/src/main/java/org/apache/ctakes/core/cr/TextReader.java>:[85,4]
[deprecation] CasInitializer in org.apache.uima.collection has been deprecated
[ERROR] <https://builds.apache.org/job/ctakes-trunk-package/ws/ctakes-core/src/main/java/org/apache/ctakes/core/cr/TextReader.java>:[85,36]
[deprecation] getCasInitializer() in CollectionReader_ImplBase has been deprecated
[ERROR] <https://builds.apache.org/job/ctakes-trunk-package/ws/ctakes-core/src/main/java/org/apache/ctakes/core/resource/StringIntegerMapResourceImpl.java>:[101,15]
[unchecked] getMap() in StringIntegerMapResourceImpl implements getMap() in StringIntegerMapResource
[ERROR] -> [Help 1]
[ERROR] 
[ERROR] To see the full stack trace of the errors, re-run Maven with the -e switch.
[ERROR] Re-run Maven using the -X switch to enable full debug logging.
[ERROR] 
[ERROR] For more information about the errors and possible solutions, please read the following
articles:
[ERROR] [Help 1] http://cwiki.apache.org/confluence/display/MAVEN/MojoFailureException
[ERROR] 
[ERROR] After correcting the problems, you can resume the build with the command
[ERROR]   mvn <goals> -rf :ctakes-core
[JENKINS] Archiving <https://builds.apache.org/job/ctakes-trunk-package/ws/ctakes-clinical-pipeline/pom.xml>
to org.apache.ctakes/ctakes-clinical-pipeline/3.2.3-SNAPSHOT/ctakes-clinical-pipeline-3.2.3-SNAPSHOT.pom
[JENKINS] Archiving <https://builds.apache.org/job/ctakes-trunk-package/ws/ctakes-type-system/pom.xml>
to org.apache.ctakes/ctakes-type-system/3.2.3-SNAPSHOT/ctakes-type-system-3.2.3-SNAPSHOT.pom
[JENKINS] Archiving <https://builds.apache.org/job/ctakes-trunk-package/ws/ctakes-type-system/target/ctakes-type-system-3.2.3-SNAPSHOT.jar>
to org.apache.ctakes/ctakes-type-system/3.2.3-SNAPSHOT/ctakes-type-system-3.2.3-SNAPSHOT.jar
[JENKINS] Archiving <https://builds.apache.org/job/ctakes-trunk-package/ws/ctakes-dictionary-lookup/pom.xml>
to org.apache.ctakes/ctakes-dictionary-lookup/3.2.3-SNAPSHOT/ctakes-dictionary-lookup-3.2.3-SNAPSHOT.pom
[JENKINS] Archiving <https://builds.apache.org/job/ctakes-trunk-package/ws/ctakes-constituency-parser/pom.xml>
to org.apache.ctakes/ctakes-constituency-parser/3.2.3-SNAPSHOT/ctakes-constituency-parser-3.2.3-SNAPSHOT.pom
[JENKINS] Archiving <https://builds.apache.org/job/ctakes-trunk-package/ws/ctakes-examples-res/pom.xml>
to org.apache.ctakes/ctakes-examples-res/3.2.3-SNAPSHOT/ctakes-examples-res-3.2.3-SNAPSHOT.pom
[JENKINS] Archiving <https://builds.apache.org/job/ctakes-trunk-package/ws/ctakes-temporal/pom.xml>
to org.apache.ctakes/ctakes-temporal/3.2.3-SNAPSHOT/ctakes-temporal-3.2.3-SNAPSHOT.pom
[JENKINS] Archiving <https://builds.apache.org/job/ctakes-trunk-package/ws/ctakes-chunker-res/pom.xml>
to org.apache.ctakes/ctakes-chunker-res/3.2.3-SNAPSHOT/ctakes-chunker-res-3.2.3-SNAPSHOT.pom
[JENKINS] Archiving <https://builds.apache.org/job/ctakes-trunk-package/ws/ctakes-regression-test/pom.xml>
to org.apache.ctakes/ctakes-regression-test/3.2.3-SNAPSHOT/ctakes-regression-test-3.2.3-SNAPSHOT.pom
[JENKINS] Archiving <https://builds.apache.org/job/ctakes-trunk-package/ws/ctakes-relation-extractor/pom.xml>
to org.apache.ctakes/ctakes-relation-extractor/3.2.3-SNAPSHOT/ctakes-relation-extractor-3.2.3-SNAPSHOT.pom
[JENKINS] Archiving <https://builds.apache.org/job/ctakes-trunk-package/ws/ctakes-preprocessor/pom.xml>
to org.apache.ctakes/ctakes-preprocessor/3.2.3-SNAPSHOT/ctakes-preprocessor-3.2.3-SNAPSHOT.pom
[JENKINS] Archiving <https://builds.apache.org/job/ctakes-trunk-package/ws/ctakes-assertion-res/pom.xml>
to org.apache.ctakes/ctakes-assertion-res/3.2.3-SNAPSHOT/ctakes-assertion-res-3.2.3-SNAPSHOT.pom
[JENKINS] Archiving <https://builds.apache.org/job/ctakes-trunk-package/ws/ctakes-assertion-zoner-res/pom.xml>
to org.apache.ctakes/ctakes-assertion-zoner-res/3.2.3-SNAPSHOT/ctakes-assertion-zoner-res-3.2.3-SNAPSHOT.pom
[JENKINS] Archiving <https://builds.apache.org/job/ctakes-trunk-package/ws/ctakes-assertion-zoner/pom.xml>
to org.apache.ctakes/ctakes-assertion-zoner/3.2.3-SNAPSHOT/ctakes-assertion-zoner-3.2.3-SNAPSHOT.pom
[JENKINS] Archiving <https://builds.apache.org/job/ctakes-trunk-package/ws/ctakes-ne-contexts-res/pom.xml>
to org.apache.ctakes/ctakes-ne-contexts-res/3.2.3-SNAPSHOT/ctakes-ne-contexts-res-3.2.3-SNAPSHOT.pom
[JENKINS] Archiving <https://builds.apache.org/job/ctakes-trunk-package/ws/ctakes-drug-ner/pom.xml>
to org.apache.ctakes/ctakes-drug-ner/3.2.3-SNAPSHOT/ctakes-drug-ner-3.2.3-SNAPSHOT.pom
[JENKINS] Archiving <https://builds.apache.org/job/ctakes-trunk-package/ws/ctakes-ytex-web/pom.xml>
to org.apache.ctakes/ctakes-ytex-web/3.2.3-SNAPSHOT/ctakes-ytex-web-3.2.3-SNAPSHOT.pom
[JENKINS] Archiving <https://builds.apache.org/job/ctakes-trunk-package/ws/ctakes-context-tokenizer/pom.xml>
to org.apache.ctakes/ctakes-context-tokenizer/3.2.3-SNAPSHOT/ctakes-context-tokenizer-3.2.3-SNAPSHOT.pom
[JENKINS] Archiving <https://builds.apache.org/job/ctakes-trunk-package/ws/ctakes-side-effect-res/pom.xml>
to org.apache.ctakes/ctakes-side-effect-res/3.2.3-SNAPSHOT/ctakes-side-effect-res-3.2.3-SNAPSHOT.pom
[JENKINS] Archiving <https://builds.apache.org/job/ctakes-trunk-package/ws/ctakes-examples/pom.xml>
to org.apache.ctakes/ctakes-examples/3.2.3-SNAPSHOT/ctakes-examples-3.2.3-SNAPSHOT.pom
[JENKINS] Archiving <https://builds.apache.org/job/ctakes-trunk-package/ws/ctakes-dictionary-lookup-fast-res/pom.xml>
to org.apache.ctakes/ctakes-dictionary-lookup-fast-res/3.2.3-SNAPSHOT/ctakes-dictionary-lookup-fast-res-3.2.3-SNAPSHOT.pom
[JENKINS] Archiving <https://builds.apache.org/job/ctakes-trunk-package/ws/ctakes-dictionary-lookup-fast/pom.xml>
to org.apache.ctakes/ctakes-dictionary-lookup-fast/3.2.3-SNAPSHOT/ctakes-dictionary-lookup-fast-3.2.3-SNAPSHOT.pom
[JENKINS] Archiving <https://builds.apache.org/job/ctakes-trunk-package/ws/ctakes-ne-contexts/pom.xml>
to org.apache.ctakes/ctakes-ne-contexts/3.2.3-SNAPSHOT/ctakes-ne-contexts-3.2.3-SNAPSHOT.pom
[JENKINS] Archiving <https://builds.apache.org/job/ctakes-trunk-package/ws/ctakes-lvg/pom.xml>
to org.apache.ctakes/ctakes-lvg/3.2.3-SNAPSHOT/ctakes-lvg-3.2.3-SNAPSHOT.pom
[JENKINS] Archiving <https://builds.apache.org/job/ctakes-trunk-package/ws/ctakes-smoking-status-res/pom.xml>
to org.apache.ctakes/ctakes-smoking-status-res/3.2.3-SNAPSHOT/ctakes-smoking-status-res-3.2.3-SNAPSHOT.pom
[JENKINS] Archiving <https://builds.apache.org/job/ctakes-trunk-package/ws/ctakes-pos-tagger/pom.xml>
to org.apache.ctakes/ctakes-pos-tagger/3.2.3-SNAPSHOT/ctakes-pos-tagger-3.2.3-SNAPSHOT.pom
[JENKINS] Archiving <https://builds.apache.org/job/ctakes-trunk-package/ws/ctakes-side-effect/pom.xml>
to org.apache.ctakes/ctakes-side-effect/3.2.3-SNAPSHOT/ctakes-side-effect-3.2.3-SNAPSHOT.pom
[JENKINS] Archiving <https://builds.apache.org/job/ctakes-trunk-package/ws/ctakes-template-filler/pom.xml>
to org.apache.ctakes/ctakes-template-filler/3.2.3-SNAPSHOT/ctakes-template-filler-3.2.3-SNAPSHOT.pom
[JENKINS] Archiving <https://builds.apache.org/job/ctakes-trunk-package/ws/pom.xml>
to org.apache.ctakes/ctakes/3.2.3-SNAPSHOT/ctakes-3.2.3-SNAPSHOT.pom
[JENKINS] Archiving <https://builds.apache.org/job/ctakes-trunk-package/ws/ctakes-chunker/pom.xml>
to org.apache.ctakes/ctakes-chunker/3.2.3-SNAPSHOT/ctakes-chunker-3.2.3-SNAPSHOT.pom
[JENKINS] Archiving <https://builds.apache.org/job/ctakes-trunk-package/ws/ctakes-utils/pom.xml>
to org.apache.ctakes/ctakes-utils/3.2.3-SNAPSHOT/ctakes-utils-3.2.3-SNAPSHOT.pom
[JENKINS] Archiving <https://builds.apache.org/job/ctakes-trunk-package/ws/ctakes-utils/target/ctakes-utils-3.2.3-SNAPSHOT.jar>
to org.apache.ctakes/ctakes-utils/3.2.3-SNAPSHOT/ctakes-utils-3.2.3-SNAPSHOT.jar
[JENKINS] Archiving <https://builds.apache.org/job/ctakes-trunk-package/ws/ctakes-drug-ner-res/pom.xml>
to org.apache.ctakes/ctakes-drug-ner-res/3.2.3-SNAPSHOT/ctakes-drug-ner-res-3.2.3-SNAPSHOT.pom
[JENKINS] Archiving <https://builds.apache.org/job/ctakes-trunk-package/ws/ctakes-core/pom.xml>
to org.apache.ctakes/ctakes-core/3.2.3-SNAPSHOT/ctakes-core-3.2.3-SNAPSHOT.pom
[JENKINS] Archiving <https://builds.apache.org/job/ctakes-trunk-package/ws/ctakes-dependency-parser/pom.xml>
to org.apache.ctakes/ctakes-dependency-parser/3.2.3-SNAPSHOT/ctakes-dependency-parser-3.2.3-SNAPSHOT.pom
[JENKINS] Archiving <https://builds.apache.org/job/ctakes-trunk-package/ws/ctakes-distribution/pom.xml>
to org.apache.ctakes/ctakes-distribution/3.2.3-SNAPSHOT/ctakes-distribution-3.2.3-SNAPSHOT.pom
[JENKINS] Archiving <https://builds.apache.org/job/ctakes-trunk-package/ws/ctakes-coreference-res/pom.xml>
to org.apache.ctakes/ctakes-coreference-res/3.2.3-SNAPSHOT/ctakes-coreference-res-3.2.3-SNAPSHOT.pom
[JENKINS] Archiving <https://builds.apache.org/job/ctakes-trunk-package/ws/ctakes-coreference/pom.xml>
to org.apache.ctakes/ctakes-coreference/3.2.3-SNAPSHOT/ctakes-coreference-3.2.3-SNAPSHOT.pom
[JENKINS] Archiving <https://builds.apache.org/job/ctakes-trunk-package/ws/ctakes-assertion/pom.xml>
to org.apache.ctakes/ctakes-assertion/3.2.3-SNAPSHOT/ctakes-assertion-3.2.3-SNAPSHOT.pom
[JENKINS] Archiving <https://builds.apache.org/job/ctakes-trunk-package/ws/ctakes-clinical-pipeline-res/pom.xml>
to org.apache.ctakes/ctakes-clinical-pipeline-res/3.2.3-SNAPSHOT/ctakes-clinical-pipeline-res-3.2.3-SNAPSHOT.pom
[JENKINS] Archiving <https://builds.apache.org/job/ctakes-trunk-package/ws/ctakes-ytex-res/pom.xml>
to org.apache.ctakes/ctakes-ytex-res/3.2.3-SNAPSHOT/ctakes-ytex-res-3.2.3-SNAPSHOT.pom
[JENKINS] Archiving <https://builds.apache.org/job/ctakes-trunk-package/ws/ctakes-dictionary-lookup-res/pom.xml>
to org.apache.ctakes/ctakes-dictionary-lookup-res/3.2.3-SNAPSHOT/ctakes-dictionary-lookup-res-3.2.3-SNAPSHOT.pom
[JENKINS] Archiving <https://builds.apache.org/job/ctakes-trunk-package/ws/ctakes-temporal-res/pom.xml>
to org.apache.ctakes/ctakes-temporal-res/3.2.3-SNAPSHOT/ctakes-temporal-res-3.2.3-SNAPSHOT.pom
[JENKINS] Archiving <https://builds.apache.org/job/ctakes-trunk-package/ws/ctakes-lvg-res/pom.xml>
to org.apache.ctakes/ctakes-lvg-res/3.2.3-SNAPSHOT/ctakes-lvg-res-3.2.3-SNAPSHOT.pom
[JENKINS] Archiving <https://builds.apache.org/job/ctakes-trunk-package/ws/ctakes-ytex/pom.xml>
to org.apache.ctakes/ctakes-ytex/3.2.3-SNAPSHOT/ctakes-ytex-3.2.3-SNAPSHOT.pom
[JENKINS] Archiving <https://builds.apache.org/job/ctakes-trunk-package/ws/ctakes-relation-extractor-res/pom.xml>
to org.apache.ctakes/ctakes-relation-extractor-res/3.2.3-SNAPSHOT/ctakes-relation-extractor-res-3.2.3-SNAPSHOT.pom
[JENKINS] Archiving <https://builds.apache.org/job/ctakes-trunk-package/ws/ctakes-constituency-parser-res/pom.xml>
to org.apache.ctakes/ctakes-constituency-parser-res/3.2.3-SNAPSHOT/ctakes-constituency-parser-res-3.2.3-SNAPSHOT.pom
[JENKINS] Archiving <https://builds.apache.org/job/ctakes-trunk-package/ws/ctakes-core-res/pom.xml>
to org.apache.ctakes/ctakes-core-res/3.2.3-SNAPSHOT/ctakes-core-res-3.2.3-SNAPSHOT.pom
[JENKINS] Archiving <https://builds.apache.org/job/ctakes-trunk-package/ws/ctakes-core-res/target/ctakes-core-res-3.2.3-SNAPSHOT.jar>
to org.apache.ctakes/ctakes-core-res/3.2.3-SNAPSHOT/ctakes-core-res-3.2.3-SNAPSHOT.jar
Compressed 645.59 KB of artifacts by 79.3% relative to #524
[JENKINS] Archiving <https://builds.apache.org/job/ctakes-trunk-package/ws/ctakes-dependency-parser-res/pom.xml>
to org.apache.ctakes/ctakes-dependency-parser-res/3.2.3-SNAPSHOT/ctakes-dependency-parser-res-3.2.3-SNAPSHOT.pom
[JENKINS] Archiving <https://builds.apache.org/job/ctakes-trunk-package/ws/ctakes-smoking-status/pom.xml>
to org.apache.ctakes/ctakes-smoking-status/3.2.3-SNAPSHOT/ctakes-smoking-status-3.2.3-SNAPSHOT.pom
[JENKINS] Archiving <https://builds.apache.org/job/ctakes-trunk-package/ws/ctakes-pos-tagger-res/pom.xml>
to org.apache.ctakes/ctakes-pos-tagger-res/3.2.3-SNAPSHOT/ctakes-pos-tagger-res-3.2.3-SNAPSHOT.pom
[JENKINS] Archiving <https://builds.apache.org/job/ctakes-trunk-package/ws/ctakes-ytex-uima/pom.xml>
to org.apache.ctakes/ctakes-ytex-uima/3.2.3-SNAPSHOT/ctakes-ytex-uima-3.2.3-SNAPSHOT.pom
Sending e-mails to: notifications@ctakes.apache.org sean.finan@tch.harvard.edu James.Masanz@childrens.harvard.edu
channel stopped

Mime
View raw message