ctakes-notifications mailing list archives

Site index · List index
Message view « Date » · « Thread »
Top « Date » · « Thread »
From Apache Jenkins Server <jenk...@builds.apache.org>
Subject Build failed in Jenkins: ctakes-trunk-compiletest #931
Date Tue, 14 Feb 2017 18:30:53 GMT
See <https://builds.apache.org/job/ctakes-trunk-compiletest/931/changes>

Changes:

[seanfinan] Required change is the use of collectionreader desc instead of instance in core.pipeline.*
Refactoring changes are an update for sync
BagOfAnnotationsGenerator refactor to use ConfigParameterConst
AbstractOutputFileWriter refactor to use ConfigParameterConst
FileTreeXmiWriter refactor to use ConfigParameterConst
ConfigParameterConstants add description constants, javadoc
FilesInDirectoryCollectionReader refactor to use ConfigParameterConst
FileTreeReader refactored to UimaFit
PipelineBuilder use collection reader descriptor instead of instance
PiperFileReader use collection reader descriptor instead of instance
PiperFileRunner refactor to use ConfigParameterConst
ProcessLinesClinicalRunner use collection reader class instead of instance
RelationExtractorPipeline refactor to use ConfigParameterConst

------------------------------------------
[...truncated 8423 lines...]
[ERROR] where T is a type-variable:
[ERROR] T extends Annotation declared in class CombinedExtractor1
[ERROR] <https://builds.apache.org/job/ctakes-trunk-compiletest/ws/ctakes-temporal/src/main/java/org/apache/ctakes/temporal/ae/feature/MultiTokenFeaturesExtractor.java>:[87,55]
[unchecked] unchecked call to NamingExtractor1(String,FeatureExtractor1<T>) as a member
of the raw type NamingExtractor1
[ERROR] where T is a type-variable:
[ERROR] T extends Annotation declared in class NamingExtractor1
[ERROR] <https://builds.apache.org/job/ctakes-trunk-compiletest/ws/ctakes-temporal/src/main/java/org/apache/ctakes/temporal/ae/feature/MultiTokenFeaturesExtractor.java>:[96,3]
[unchecked] unchecked call to NamingExtractor1(String,FeatureExtractor1<T>) as a member
of the raw type NamingExtractor1
[ERROR] where T is a type-variable:
[ERROR] T extends Annotation declared in class NamingExtractor1
[ERROR] <https://builds.apache.org/job/ctakes-trunk-compiletest/ws/ctakes-temporal/src/main/java/org/apache/ctakes/temporal/ae/feature/MultiTokenFeaturesExtractor.java>:[94,42]
[unchecked] unchecked call to CleartkExtractor(Class<SEARCH_T>,FeatureExtractor1<SEARCH_T>,Context...)
as a member of the raw type CleartkExtractor
[ERROR] where SEARCH_T is a type-variable:
[ERROR] SEARCH_T extends Annotation declared in class CleartkExtractor
[ERROR] <https://builds.apache.org/job/ctakes-trunk-compiletest/ws/ctakes-temporal/src/main/java/org/apache/ctakes/temporal/ae/feature/MultiTokenFeaturesExtractor.java>:[107,44]
[unchecked] unchecked call to DistanceExtractor(String,Class<? extends Annotation>)
as a member of the raw type DistanceExtractor
[ERROR] <https://builds.apache.org/job/ctakes-trunk-compiletest/ws/ctakes-temporal/src/main/java/org/apache/ctakes/temporal/ae/feature/MultiTokenFeaturesExtractor.java>:[154,57]
[unchecked] unchecked call to extract(JCas,T) as a member of the raw type FeatureExtractor1
[ERROR] where T is a type-variable:
[ERROR] T extends Annotation declared in interface FeatureExtractor1
[ERROR] <https://builds.apache.org/job/ctakes-trunk-compiletest/ws/ctakes-temporal/src/main/java/org/apache/ctakes/temporal/ae/feature/MultiTokenFeaturesExtractor.java>:[154,18]
[unchecked] unchecked method invocation: method addAll in interface List is applied to given
types
[ERROR] required: Collection<? extends E>
[ERROR] found: List
[ERROR] where E is a type-variable:
[ERROR] E extends Object declared in interface List
[ERROR] <https://builds.apache.org/job/ctakes-trunk-compiletest/ws/ctakes-temporal/src/main/java/org/apache/ctakes/temporal/ae/feature/MultiTokenFeaturesExtractor.java>:[154,57]
[unchecked] unchecked conversion
[ERROR] required: Collection<? extends E>
[ERROR] found:    List
[ERROR] where E is a type-variable:
[ERROR] E extends Object declared in interface List
[ERROR] <https://builds.apache.org/job/ctakes-trunk-compiletest/ws/ctakes-temporal/src/main/java/org/apache/ctakes/temporal/ae/feature/MultiTokenFeaturesExtractor.java>:[156,53]
[unchecked] unchecked call to extractBetween(JCas,FOCUS_T,FOCUS_T) as a member of the raw
type CleartkExtractor
[ERROR] where FOCUS_T is a type-variable:
[ERROR] FOCUS_T extends Annotation declared in class CleartkExtractor
[ERROR] <https://builds.apache.org/job/ctakes-trunk-compiletest/ws/ctakes-temporal/src/main/java/org/apache/ctakes/temporal/ae/feature/MultiTokenFeaturesExtractor.java>:[156,19]
[unchecked] unchecked method invocation: method addAll in interface List is applied to given
types
[ERROR] required: Collection<? extends E>
[ERROR] found: List
[ERROR] where E is a type-variable:
[ERROR] E extends Object declared in interface List
[ERROR] <https://builds.apache.org/job/ctakes-trunk-compiletest/ws/ctakes-temporal/src/main/java/org/apache/ctakes/temporal/ae/feature/MultiTokenFeaturesExtractor.java>:[156,53]
[unchecked] unchecked conversion
[ERROR] required: Collection<? extends E>
[ERROR] found:    List
[ERROR] where E is a type-variable:
[ERROR] E extends Object declared in interface List
[ERROR] <https://builds.apache.org/job/ctakes-trunk-compiletest/ws/ctakes-temporal/src/main/java/org/apache/ctakes/temporal/ae/feature/MultiTokenFeaturesExtractor.java>:[157,19]
[unchecked] unchecked method invocation: method addAll in interface List is applied to given
types
[ERROR] required: Collection<? extends E>
[ERROR] found: List
[ERROR] where E is a type-variable:
[ERROR] E extends Object declared in interface List
[ERROR] <https://builds.apache.org/job/ctakes-trunk-compiletest/ws/ctakes-temporal/src/main/java/org/apache/ctakes/temporal/ae/feature/MultiTokenFeaturesExtractor.java>:[157,47]
[unchecked] unchecked conversion
[ERROR] required: Collection<? extends E>
[ERROR] found:    List
[ERROR] where E is a type-variable:
[ERROR] E extends Object declared in interface List
[ERROR] <https://builds.apache.org/job/ctakes-trunk-compiletest/ws/ctakes-temporal/src/main/java/org/apache/ctakes/temporal/ae/feature/MultiTokenFeaturesExtractor.java>:[161,57]
[unchecked] unchecked call to extract(JCas,T) as a member of the raw type FeatureExtractor1
[ERROR] where T is a type-variable:
[ERROR] T extends Annotation declared in interface FeatureExtractor1
[ERROR] <https://builds.apache.org/job/ctakes-trunk-compiletest/ws/ctakes-temporal/src/main/java/org/apache/ctakes/temporal/ae/feature/MultiTokenFeaturesExtractor.java>:[161,18]
[unchecked] unchecked method invocation: method addAll in interface List is applied to given
types
[ERROR] required: Collection<? extends E>
[ERROR] found: List
[ERROR] where E is a type-variable:
[ERROR] E extends Object declared in interface List
[ERROR] <https://builds.apache.org/job/ctakes-trunk-compiletest/ws/ctakes-temporal/src/main/java/org/apache/ctakes/temporal/ae/feature/MultiTokenFeaturesExtractor.java>:[161,57]
[unchecked] unchecked conversion
[ERROR] required: Collection<? extends E>
[ERROR] found:    List
[ERROR] where E is a type-variable:
[ERROR] E extends Object declared in interface List
[ERROR] <https://builds.apache.org/job/ctakes-trunk-compiletest/ws/ctakes-temporal/src/main/java/org/apache/ctakes/temporal/ae/EventTimeSelfRelationAnnotator.java>:[141,27]
[unchecked] unchecked generic array creation for varargs parameter of type RelationFeaturesExtractor<IdentifiedAnnotation,IdentifiedAnnotation>[]
[ERROR] <https://builds.apache.org/job/ctakes-trunk-compiletest/ws/ctakes-temporal/src/main/java/org/apache/ctakes/temporal/eval/EvaluationOfNEPredicateEventSpans.java>:[77,37]
[deprecation] createAnnotatorDescription(File) in NEPredicateEventAnnotator has been deprecated
[ERROR] <https://builds.apache.org/job/ctakes-trunk-compiletest/ws/ctakes-temporal/src/main/java/org/apache/ctakes/temporal/eval/EvaluationOfEventEventRelations.java>:[140,35]
[deprecation] createAnnotatorDescription(File) in EventEventRelationAnnotator has been deprecated
[ERROR] <https://builds.apache.org/job/ctakes-trunk-compiletest/ws/ctakes-temporal/src/main/java/org/apache/ctakes/temporal/eval/EvaluationOfEventTimeDeepPheRelations.java>:[320,33]
[deprecation] createEngineDescription(File) in EventTimeSelfRelationAnnotator has been deprecated
[ERROR] <https://builds.apache.org/job/ctakes-trunk-compiletest/ws/ctakes-temporal/src/main/java/org/apache/ctakes/temporal/ae/EventTimeI2B2RelationAnnotator.java>:[122,27]
[unchecked] unchecked generic array creation for varargs parameter of type RelationFeaturesExtractor<IdentifiedAnnotation,IdentifiedAnnotation>[]
[ERROR] <https://builds.apache.org/job/ctakes-trunk-compiletest/ws/ctakes-temporal/src/main/java/org/apache/ctakes/temporal/ae/EventEventRelationGoldContainerAnnotator.java>:[140,27]
[unchecked] unchecked generic array creation for varargs parameter of type RelationFeaturesExtractor<IdentifiedAnnotation,IdentifiedAnnotation>[]
[ERROR] <https://builds.apache.org/job/ctakes-trunk-compiletest/ws/ctakes-temporal/src/main/java/org/apache/ctakes/temporal/eval/EvaluationOfEventEventDeepPheRelations.java>:[314,50]
[deprecation] createAnnotatorDescription(File) in EventEventRelationAnnotator has been deprecated
[ERROR] <https://builds.apache.org/job/ctakes-trunk-compiletest/ws/ctakes-temporal/src/main/java/org/apache/ctakes/temporal/ae/TimeAnnotator.java>:[188,4]
[unchecked] unchecked call to TypePathExtractor(Class<T>,String) as a member of the
raw type TypePathExtractor
[ERROR] where T is a type-variable:
[ERROR] T extends Annotation declared in class TypePathExtractor
[ERROR] <https://builds.apache.org/job/ctakes-trunk-compiletest/ws/ctakes-temporal/src/main/java/org/apache/ctakes/temporal/ae/TimeAnnotator.java>:[184,37]
[unchecked] unchecked call to CombinedExtractor1(FeatureExtractor1<T>,FeatureExtractor1<T>,FeatureExtractor1<T>,FeatureExtractor1<T>,FeatureExtractor1<T>)
as a member of the raw type CombinedExtractor1
[ERROR] where T is a type-variable:
[ERROR] T extends Annotation declared in class CombinedExtractor1
[ERROR] <https://builds.apache.org/job/ctakes-trunk-compiletest/ws/ctakes-temporal/src/main/java/org/apache/ctakes/temporal/ae/TimeAnnotator.java>:[198,36]
[unchecked] unchecked call to CleartkExtractor(Class<SEARCH_T>,FeatureExtractor1<SEARCH_T>,Context...)
as a member of the raw type CleartkExtractor
[ERROR] where SEARCH_T is a type-variable:
[ERROR] SEARCH_T extends Annotation declared in class CleartkExtractor
[ERROR] <https://builds.apache.org/job/ctakes-trunk-compiletest/ws/ctakes-temporal/src/main/java/org/apache/ctakes/temporal/ae/TimeAnnotator.java>:[251,38]
[unchecked] unchecked call to extract(JCas,T) as a member of the raw type FeatureExtractor1
[ERROR] where T is a type-variable:
[ERROR] T extends Annotation declared in interface FeatureExtractor1
[ERROR] <https://builds.apache.org/job/ctakes-trunk-compiletest/ws/ctakes-temporal/src/main/java/org/apache/ctakes/temporal/ae/TimeAnnotator.java>:[251,20]
[unchecked] unchecked method invocation: method addAll in interface List is applied to given
types
[ERROR] required: Collection<? extends E>
[ERROR] found: List
[ERROR] where E is a type-variable:
[ERROR] E extends Object declared in interface List
[ERROR] <https://builds.apache.org/job/ctakes-trunk-compiletest/ws/ctakes-temporal/src/main/java/org/apache/ctakes/temporal/ae/TimeAnnotator.java>:[251,38]
[unchecked] unchecked conversion
[ERROR] required: Collection<? extends E>
[ERROR] found:    List
[ERROR] where E is a type-variable:
[ERROR] E extends Object declared in interface List
[ERROR] <https://builds.apache.org/job/ctakes-trunk-compiletest/ws/ctakes-temporal/src/main/java/org/apache/ctakes/temporal/ae/TimeAnnotator.java>:[255,44]
[unchecked] unchecked call to extractWithin(JCas,FOCUS_T,Annotation) as a member of the raw
type CleartkExtractor
[ERROR] where FOCUS_T is a type-variable:
[ERROR] FOCUS_T extends Annotation declared in class CleartkExtractor
[ERROR] <https://builds.apache.org/job/ctakes-trunk-compiletest/ws/ctakes-temporal/src/main/java/org/apache/ctakes/temporal/ae/TimeAnnotator.java>:[255,20]
[unchecked] unchecked method invocation: method addAll in interface List is applied to given
types
[ERROR] required: Collection<? extends E>
[ERROR] found: List
[ERROR] where E is a type-variable:
[ERROR] E extends Object declared in interface List
[ERROR] <https://builds.apache.org/job/ctakes-trunk-compiletest/ws/ctakes-temporal/src/main/java/org/apache/ctakes/temporal/ae/TimeAnnotator.java>:[255,44]
[unchecked] unchecked conversion
[ERROR] required: Collection<? extends E>
[ERROR] found:    List
[ERROR] where E is a type-variable:
[ERROR] E extends Object declared in interface List
[ERROR] <https://builds.apache.org/job/ctakes-trunk-compiletest/ws/ctakes-temporal/src/main/java/org/apache/ctakes/temporal/ae/EventEventRelationSeedBasedAnnotator.java>:[141,27]
[unchecked] unchecked generic array creation for varargs parameter of type RelationFeaturesExtractor<IdentifiedAnnotation,IdentifiedAnnotation>[]
[ERROR] <https://builds.apache.org/job/ctakes-trunk-compiletest/ws/ctakes-temporal/src/main/java/org/apache/ctakes/temporal/ae/ConsecutiveSentencesEventTimeRelationAnnotator.java>:[56,30]
[deprecation] createPrimitiveDescription(Class<? extends AnalysisComponent>,Object...)
in AnalysisEngineFactory has been deprecated
[ERROR] <https://builds.apache.org/job/ctakes-trunk-compiletest/ws/ctakes-temporal/src/main/java/org/apache/ctakes/temporal/ae/ConsecutiveSentencesEventTimeRelationAnnotator.java>:[71,30]
[deprecation] createPrimitiveDescription(Class<? extends AnalysisComponent>,Object...)
in AnalysisEngineFactory has been deprecated
[ERROR] <https://builds.apache.org/job/ctakes-trunk-compiletest/ws/ctakes-temporal/src/main/java/org/apache/ctakes/temporal/ae/ConsecutiveSentencesEventTimeRelationAnnotator.java>:[81,27]
[unchecked] unchecked generic array creation for varargs parameter of type RelationFeaturesExtractor<IdentifiedAnnotation,IdentifiedAnnotation>[]
[ERROR] <https://builds.apache.org/job/ctakes-trunk-compiletest/ws/ctakes-temporal/src/main/java/org/apache/ctakes/temporal/pipelines/TimeExtractionPipeline.java>:[57,36]
error: cannot find symbol
[ERROR] symbol:   variable PARAM_INPUTDIR
[ERROR] location: class FilesInDirectoryCollectionReader
[ERROR] <https://builds.apache.org/job/ctakes-trunk-compiletest/ws/ctakes-temporal/src/main/java/org/apache/ctakes/temporal/eval/EvaluationOfEventEventHybridModelsRelations.java>:[376,54]
[deprecation] createAnnotatorDescription(File) in EventEventCRFRelationAnnotator has been
deprecated
[ERROR] <https://builds.apache.org/job/ctakes-trunk-compiletest/ws/ctakes-temporal/src/main/java/org/apache/ctakes/temporal/eval/EvaluationOfEventEventHybridModelsRelations.java>:[377,60]
[deprecation] createAnnotatorDescription(File) in EventEventRelationSeedBasedAnnotator has
been deprecated
[ERROR] <https://builds.apache.org/job/ctakes-trunk-compiletest/ws/ctakes-temporal/src/main/java/org/apache/ctakes/temporal/ae/feature/UnexpandedTokenFeaturesExtractor.java>:[34,42]
[unchecked] unchecked call to CleartkExtractor(Class<SEARCH_T>,FeatureExtractor1<SEARCH_T>,Context...)
as a member of the raw type CleartkExtractor
[ERROR] where SEARCH_T is a type-variable:
[ERROR] SEARCH_T extends Annotation declared in class CleartkExtractor
[ERROR] <https://builds.apache.org/job/ctakes-trunk-compiletest/ws/ctakes-temporal/src/main/java/org/apache/ctakes/temporal/ae/feature/UnexpandedTokenFeaturesExtractor.java>:[48,3]
[unchecked] unchecked call to CombinedExtractor1(FeatureExtractor1<T>,FeatureExtractor1<T>)
as a member of the raw type CombinedExtractor1
[ERROR] where T is a type-variable:
[ERROR] T extends Annotation declared in class CombinedExtractor1
[ERROR] <https://builds.apache.org/job/ctakes-trunk-compiletest/ws/ctakes-temporal/src/main/java/org/apache/ctakes/temporal/ae/feature/UnexpandedTokenFeaturesExtractor.java>:[46,55]
[unchecked] unchecked call to NamingExtractor1(String,FeatureExtractor1<T>) as a member
of the raw type NamingExtractor1
[ERROR] where T is a type-variable:
[ERROR] T extends Annotation declared in class NamingExtractor1
[ERROR] <https://builds.apache.org/job/ctakes-trunk-compiletest/ws/ctakes-temporal/src/main/java/org/apache/ctakes/temporal/ae/feature/UnexpandedTokenFeaturesExtractor.java>:[55,3]
[unchecked] unchecked call to CombinedExtractor1(FeatureExtractor1<T>,FeatureExtractor1<T>)
as a member of the raw type CombinedExtractor1
[ERROR] where T is a type-variable:
[ERROR] T extends Annotation declared in class CombinedExtractor1
[ERROR] <https://builds.apache.org/job/ctakes-trunk-compiletest/ws/ctakes-temporal/src/main/java/org/apache/ctakes/temporal/ae/feature/UnexpandedTokenFeaturesExtractor.java>:[53,55]
[unchecked] unchecked call to NamingExtractor1(String,FeatureExtractor1<T>) as a member
of the raw type NamingExtractor1
[ERROR] where T is a type-variable:
[ERROR] T extends Annotation declared in class NamingExtractor1
[ERROR] <https://builds.apache.org/job/ctakes-trunk-compiletest/ws/ctakes-temporal/src/main/java/org/apache/ctakes/temporal/ae/feature/UnexpandedTokenFeaturesExtractor.java>:[62,3]
[unchecked] unchecked call to NamingExtractor1(String,FeatureExtractor1<T>) as a member
of the raw type NamingExtractor1
[ERROR] where T is a type-variable:
[ERROR] T extends Annotation declared in class NamingExtractor1
[ERROR] <https://builds.apache.org/job/ctakes-trunk-compiletest/ws/ctakes-temporal/src/main/java/org/apache/ctakes/temporal/ae/feature/UnexpandedTokenFeaturesExtractor.java>:[60,42]
[unchecked] unchecked call to CleartkExtractor(Class<SEARCH_T>,FeatureExtractor1<SEARCH_T>,Context...)
as a member of the raw type CleartkExtractor
[ERROR] where SEARCH_T is a type-variable:
[ERROR] SEARCH_T extends Annotation declared in class CleartkExtractor
[ERROR] <https://builds.apache.org/job/ctakes-trunk-compiletest/ws/ctakes-temporal/src/main/java/org/apache/ctakes/temporal/ae/feature/UnexpandedTokenFeaturesExtractor.java>:[70,44]
[unchecked] unchecked call to DistanceExtractor(String,Class<? extends Annotation>)
as a member of the raw type DistanceExtractor
[ERROR] <https://builds.apache.org/job/ctakes-trunk-compiletest/ws/ctakes-temporal/src/main/java/org/apache/ctakes/temporal/ae/feature/UnexpandedTokenFeaturesExtractor.java>:[81,56]
[unchecked] unchecked call to extract(JCas,T) as a member of the raw type FeatureExtractor1
[ERROR] where T is a type-variable:
[ERROR] T extends Annotation declared in interface FeatureExtractor1
[ERROR] <https://builds.apache.org/job/ctakes-trunk-compiletest/ws/ctakes-temporal/src/main/java/org/apache/ctakes/temporal/ae/feature/UnexpandedTokenFeaturesExtractor.java>:[81,17]
[unchecked] unchecked method invocation: method addAll in interface List is applied to given
types
[ERROR] required: Collection<? extends E>
[ERROR] found: List
[ERROR] where E is a type-variable:
[ERROR] E extends Object declared in interface List
[ERROR] <https://builds.apache.org/job/ctakes-trunk-compiletest/ws/ctakes-temporal/src/main/java/org/apache/ctakes/temporal/ae/feature/UnexpandedTokenFeaturesExtractor.java>:[81,56]
[unchecked] unchecked conversion
[ERROR] required: Collection<? extends E>
[ERROR] found:    List
[ERROR] where E is a type-variable:
[ERROR] E extends Object declared in interface List
[ERROR] <https://builds.apache.org/job/ctakes-trunk-compiletest/ws/ctakes-temporal/src/main/java/org/apache/ctakes/temporal/ae/feature/UnexpandedTokenFeaturesExtractor.java>:[82,56]
[unchecked] unchecked call to extract(JCas,T) as a member of the raw type FeatureExtractor1
[ERROR] where T is a type-variable:
[ERROR] T extends Annotation declared in interface FeatureExtractor1
[ERROR] <https://builds.apache.org/job/ctakes-trunk-compiletest/ws/ctakes-temporal/src/main/java/org/apache/ctakes/temporal/ae/feature/UnexpandedTokenFeaturesExtractor.java>:[82,17]
[unchecked] unchecked method invocation: method addAll in interface List is applied to given
types
[ERROR] required: Collection<? extends E>
[ERROR] found: List
[ERROR] where E is a type-variable:
[ERROR] E extends Object declared in interface List
[ERROR] <https://builds.apache.org/job/ctakes-trunk-compiletest/ws/ctakes-temporal/src/main/java/org/apache/ctakes/temporal/ae/feature/UnexpandedTokenFeaturesExtractor.java>:[82,56]
[unchecked] unchecked conversion
[ERROR] required: Collection<? extends E>
[ERROR] found:    List
[ERROR] where E is a type-variable:
[ERROR] E extends Object declared in interface List
[ERROR] <https://builds.apache.org/job/ctakes-trunk-compiletest/ws/ctakes-temporal/src/main/java/org/apache/ctakes/temporal/ae/feature/UnexpandedTokenFeaturesExtractor.java>:[83,51]
[unchecked] unchecked call to extractBetween(JCas,FOCUS_T,FOCUS_T) as a member of the raw
type CleartkExtractor
[ERROR] where FOCUS_T is a type-variable:
[ERROR] FOCUS_T extends Annotation declared in class CleartkExtractor
[ERROR] <https://builds.apache.org/job/ctakes-trunk-compiletest/ws/ctakes-temporal/src/main/java/org/apache/ctakes/temporal/ae/feature/UnexpandedTokenFeaturesExtractor.java>:[83,17]
[unchecked] unchecked method invocation: method addAll in interface List is applied to given
types
[ERROR] required: Collection<? extends E>
[ERROR] found: List
[ERROR] where E is a type-variable:
[ERROR] E extends Object declared in interface List
[ERROR] <https://builds.apache.org/job/ctakes-trunk-compiletest/ws/ctakes-temporal/src/main/java/org/apache/ctakes/temporal/ae/feature/UnexpandedTokenFeaturesExtractor.java>:[83,51]
[unchecked] unchecked conversion
[ERROR] required: Collection<? extends E>
[ERROR] found:    List
[ERROR] where E is a type-variable:
[ERROR] E extends Object declared in interface List
[ERROR] <https://builds.apache.org/job/ctakes-trunk-compiletest/ws/ctakes-temporal/src/main/java/org/apache/ctakes/temporal/ae/feature/UnexpandedTokenFeaturesExtractor.java>:[84,17]
[unchecked] unchecked method invocation: method addAll in interface List is applied to given
types
[ERROR] required: Collection<? extends E>
[ERROR] found: List
[ERROR] where E is a type-variable:
[ERROR] E extends Object declared in interface List
[ERROR] <https://builds.apache.org/job/ctakes-trunk-compiletest/ws/ctakes-temporal/src/main/java/org/apache/ctakes/temporal/ae/feature/UnexpandedTokenFeaturesExtractor.java>:[84,45]
[unchecked] unchecked conversion
[ERROR] required: Collection<? extends E>
[ERROR] found:    List
[ERROR] where E is a type-variable:
[ERROR] E extends Object declared in interface List
[ERROR] <https://builds.apache.org/job/ctakes-trunk-compiletest/ws/ctakes-temporal/src/main/java/org/apache/ctakes/temporal/ae/NeuralEventTimeSelfRelationAnnotator.java>:[149,27]
[unchecked] unchecked generic array creation for varargs parameter of type RelationFeaturesExtractor<IdentifiedAnnotation,IdentifiedAnnotation>[]
[ERROR] <https://builds.apache.org/job/ctakes-trunk-compiletest/ws/ctakes-temporal/src/main/java/org/apache/ctakes/temporal/ae/TimexAdmissionTimeAnnotator.java>:[78,30]
[deprecation] createPrimitiveDescription(Class<? extends AnalysisComponent>,Object...)
in AnalysisEngineFactory has been deprecated
[ERROR] <https://builds.apache.org/job/ctakes-trunk-compiletest/ws/ctakes-temporal/src/main/java/org/apache/ctakes/temporal/ae/TimexAdmissionTimeAnnotator.java>:[90,30]
[deprecation] createPrimitiveDescription(Class<? extends AnalysisComponent>,Object...)
in AnalysisEngineFactory has been deprecated
[ERROR] <https://builds.apache.org/job/ctakes-trunk-compiletest/ws/ctakes-temporal/src/main/java/org/apache/ctakes/temporal/ae/TimexAdmissionTimeAnnotator.java>:[131,4]
[unchecked] unchecked call to TypePathExtractor(Class<T>,String) as a member of the
raw type TypePathExtractor
[ERROR] where T is a type-variable:
[ERROR] T extends Annotation declared in class TypePathExtractor
[ERROR] <https://builds.apache.org/job/ctakes-trunk-compiletest/ws/ctakes-temporal/src/main/java/org/apache/ctakes/temporal/ae/TimexAdmissionTimeAnnotator.java>:[129,37]
[unchecked] unchecked call to CombinedExtractor1(FeatureExtractor1<T>,FeatureExtractor1<T>)
as a member of the raw type CombinedExtractor1
[ERROR] where T is a type-variable:
[ERROR] T extends Annotation declared in class CombinedExtractor1
[ERROR] <https://builds.apache.org/job/ctakes-trunk-compiletest/ws/ctakes-temporal/src/main/java/org/apache/ctakes/temporal/ae/TimexAdmissionTimeAnnotator.java>:[132,26]
[unchecked] unchecked call to CleartkExtractor(Class<SEARCH_T>,FeatureExtractor1<SEARCH_T>,Context...)
as a member of the raw type CleartkExtractor
[ERROR] where SEARCH_T is a type-variable:
[ERROR] SEARCH_T extends Annotation declared in class CleartkExtractor
[ERROR] <https://builds.apache.org/job/ctakes-trunk-compiletest/ws/ctakes-temporal/src/main/java/org/apache/ctakes/temporal/ae/TimexAdmissionTimeAnnotator.java>:[198,58]
[unchecked] unchecked call to extract(JCas,FOCUS_T) as a member of the raw type CleartkExtractor
[ERROR] where FOCUS_T is a type-variable:
[ERROR] FOCUS_T extends Annotation declared in class CleartkExtractor
[ERROR] <https://builds.apache.org/job/ctakes-trunk-compiletest/ws/ctakes-temporal/src/main/java/org/apache/ctakes/temporal/ae/TimexAdmissionTimeAnnotator.java>:[198,58]
[unchecked] unchecked conversion
[ERROR] required: List<Feature>
[ERROR] found:    List
[ERROR] <https://builds.apache.org/job/ctakes-trunk-compiletest/ws/ctakes-temporal/src/main/java/org/apache/ctakes/temporal/pipelines/EventExtractionPipeline.java>:[58,36]
error: cannot find symbol
[ERROR] symbol:   variable PARAM_INPUTDIR
[ERROR] location: class FilesInDirectoryCollectionReader
[ERROR] <https://builds.apache.org/job/ctakes-trunk-compiletest/ws/ctakes-temporal/src/main/java/org/apache/ctakes/temporal/pipelines/FullTemporalExtractionPipeline.java>:[94,40]
error: cannot find symbol
[ERROR] symbol:   variable PARAM_INPUTDIR
[ERROR] location: class FilesInDirectoryCollectionReader
[ERROR] <https://builds.apache.org/job/ctakes-trunk-compiletest/ws/ctakes-temporal/src/main/java/org/apache/ctakes/temporal/ae/MetaTimeAnnotator.java>:[75,38]
[deprecation] createEnsembleDescription(File,String) in BackwardsTimeAnnotator has been deprecated
[ERROR] <https://builds.apache.org/job/ctakes-trunk-compiletest/ws/ctakes-temporal/src/main/java/org/apache/ctakes/temporal/ae/MetaTimeAnnotator.java>:[78,46]
[deprecation] createEnsembleDescription(File,String) in ConstituencyBasedTimeAnnotator has
been deprecated
[ERROR] <https://builds.apache.org/job/ctakes-trunk-compiletest/ws/ctakes-temporal/src/main/java/org/apache/ctakes/temporal/ae/MetaTimeAnnotator.java>:[81,32]
[deprecation] createEnsembleDescription(File,String) in CRFTimeAnnotator has been deprecated
[ERROR] <https://builds.apache.org/job/ctakes-trunk-compiletest/ws/ctakes-temporal/src/main/java/org/apache/ctakes/temporal/ae/MetaTimeAnnotator.java>:[104,38]
[deprecation] createEnsembleDescription(File,String) in BackwardsTimeAnnotator has been deprecated
[ERROR] <https://builds.apache.org/job/ctakes-trunk-compiletest/ws/ctakes-temporal/src/main/java/org/apache/ctakes/temporal/ae/MetaTimeAnnotator.java>:[107,46]
[deprecation] createEnsembleDescription(File,String) in ConstituencyBasedTimeAnnotator has
been deprecated
[ERROR] <https://builds.apache.org/job/ctakes-trunk-compiletest/ws/ctakes-temporal/src/main/java/org/apache/ctakes/temporal/ae/MetaTimeAnnotator.java>:[110,32]
[deprecation] createEnsembleDescription(File,String) in CRFTimeAnnotator has been deprecated
[ERROR] <https://builds.apache.org/job/ctakes-trunk-compiletest/ws/ctakes-temporal/src/main/java/org/apache/ctakes/temporal/ae/EventEventRelationAnnotator.java>:[144,27]
[unchecked] unchecked generic array creation for varargs parameter of type RelationFeaturesExtractor<IdentifiedAnnotation,IdentifiedAnnotation>[]
[ERROR] <https://builds.apache.org/job/ctakes-trunk-compiletest/ws/ctakes-temporal/src/main/java/org/apache/ctakes/temporal/ae/EventTimeRelationAnnotator.java>:[122,27]
[unchecked] unchecked generic array creation for varargs parameter of type RelationFeaturesExtractor<IdentifiedAnnotation,IdentifiedAnnotation>[]
[ERROR] <https://builds.apache.org/job/ctakes-trunk-compiletest/ws/ctakes-temporal/src/main/java/org/apache/ctakes/temporal/ae/feature/UMLSBasedTokenFeaturesExtractor.java>:[38,42]
[unchecked] unchecked call to CleartkExtractor(Class<SEARCH_T>,FeatureExtractor1<SEARCH_T>,Context...)
as a member of the raw type CleartkExtractor
[ERROR] where SEARCH_T is a type-variable:
[ERROR] SEARCH_T extends Annotation declared in class CleartkExtractor
[ERROR] <https://builds.apache.org/job/ctakes-trunk-compiletest/ws/ctakes-temporal/src/main/java/org/apache/ctakes/temporal/ae/feature/UMLSBasedTokenFeaturesExtractor.java>:[50,62]
[unchecked] unchecked call to NamingExtractor1(String,FeatureExtractor1<T>) as a member
of the raw type NamingExtractor1
[ERROR] where T is a type-variable:
[ERROR] T extends Annotation declared in class NamingExtractor1
[ERROR] <https://builds.apache.org/job/ctakes-trunk-compiletest/ws/ctakes-temporal/src/main/java/org/apache/ctakes/temporal/ae/feature/UMLSBasedTokenFeaturesExtractor.java>:[54,62]
[unchecked] unchecked call to NamingExtractor1(String,FeatureExtractor1<T>) as a member
of the raw type NamingExtractor1
[ERROR] where T is a type-variable:
[ERROR] T extends Annotation declared in class NamingExtractor1
[ERROR] <https://builds.apache.org/job/ctakes-trunk-compiletest/ws/ctakes-temporal/src/main/java/org/apache/ctakes/temporal/ae/feature/UMLSBasedTokenFeaturesExtractor.java>:[60,62]
[unchecked] unchecked call to NamingExtractor1(String,FeatureExtractor1<T>) as a member
of the raw type NamingExtractor1
[ERROR] where T is a type-variable:
[ERROR] T extends Annotation declared in class NamingExtractor1
[ERROR] <https://builds.apache.org/job/ctakes-trunk-compiletest/ws/ctakes-temporal/src/main/java/org/apache/ctakes/temporal/ae/feature/UMLSBasedTokenFeaturesExtractor.java>:[64,62]
[unchecked] unchecked call to NamingExtractor1(String,FeatureExtractor1<T>) as a member
of the raw type NamingExtractor1
[ERROR] where T is a type-variable:
[ERROR] T extends Annotation declared in class NamingExtractor1
[ERROR] <https://builds.apache.org/job/ctakes-trunk-compiletest/ws/ctakes-temporal/src/main/java/org/apache/ctakes/temporal/ae/feature/UMLSBasedTokenFeaturesExtractor.java>:[73,3]
[unchecked] unchecked call to NamingExtractor1(String,FeatureExtractor1<T>) as a member
of the raw type NamingExtractor1
[ERROR] where T is a type-variable:
[ERROR] T extends Annotation declared in class NamingExtractor1
[ERROR] <https://builds.apache.org/job/ctakes-trunk-compiletest/ws/ctakes-temporal/src/main/java/org/apache/ctakes/temporal/ae/feature/UMLSBasedTokenFeaturesExtractor.java>:[71,42]
[unchecked] unchecked call to CleartkExtractor(Class<SEARCH_T>,FeatureExtractor1<SEARCH_T>,Context...)
as a member of the raw type CleartkExtractor
[ERROR] where SEARCH_T is a type-variable:
[ERROR] SEARCH_T extends Annotation declared in class CleartkExtractor
[ERROR] <https://builds.apache.org/job/ctakes-trunk-compiletest/ws/ctakes-temporal/src/main/java/org/apache/ctakes/temporal/data/analysis/ExtractDoctimerelPairProbabilities.java>:[38,40]
error: cannot find symbol
[ERROR] -> [Help 1]
[ERROR] 
[ERROR] To see the full stack trace of the errors, re-run Maven with the -e switch.
[ERROR] Re-run Maven using the -X switch to enable full debug logging.
[ERROR] 
[ERROR] For more information about the errors and possible solutions, please read the following
articles:
[ERROR] [Help 1] http://cwiki.apache.org/confluence/display/MAVEN/MojoFailureException
[ERROR] 
[ERROR] After correcting the problems, you can resume the build with the command
[ERROR]   mvn <goals> -rf :ctakes-temporal
Sending e-mails to: notifications@ctakes.apache.org
channel stopped

Mime
View raw message