ctakes-notifications mailing list archives

Site index · List index
Message view « Date » · « Thread »
Top « Date » · « Thread »
From Apache Jenkins Server <jenk...@builds.apache.org>
Subject Build failed in Jenkins: ctakes-trunk-compiletest #919
Date Mon, 19 Dec 2016 17:27:41 GMT
See <https://builds.apache.org/job/ctakes-trunk-compiletest/919/changes>

Changes:

[seanfinan] PiperFileReader: For quoted parameters, do not attempt to create an Array or convert
to a Number
Removed "loadParameters" / "loadPropertyFile" in favor of using "load" of a piper with "set"
commands
Removed "addParameters" in favor of "set"

------------------------------------------
[...truncated 4789 lines...]
[ERROR]   required: Class<? extends AnalysisComponent>
  found:    Class
<https://builds.apache.org/job/ctakes-trunk-compiletest/ws/ctakes-core/src/main/java/org/apache/ctakes/core/pipeline/PiperFileReader.java>:[379,19]
[unchecked] unchecked conversion
[ERROR]   required: Class<? extends CollectionReader>
  found:    Class
<https://builds.apache.org/job/ctakes-trunk-compiletest/ws/ctakes-core/src/main/java/org/apache/ctakes/core/pipeline/PiperFileReader.java>:[386,19]
[unchecked] unchecked conversion
[ERROR]   required: Class<? extends CollectionReader>
  found:    Class
<https://builds.apache.org/job/ctakes-trunk-compiletest/ws/ctakes-core/src/main/java/org/apache/ctakes/core/pipeline/PiperFileReader.java>:[391,19]
[unchecked] unchecked conversion
[ERROR]   required: Class<? extends CollectionReader>
  found:    Class
<https://builds.apache.org/job/ctakes-trunk-compiletest/ws/ctakes-core/src/main/java/org/apache/ctakes/core/util/ListIterable.java>:[34,50]
[unchecked] unchecked cast
[ERROR]   required: T
  found:    TOP
  where T is a type-variable:
    T extends Object declared in class FSListIterator
<https://builds.apache.org/job/ctakes-trunk-compiletest/ws/ctakes-core/src/main/java/org/apache/ctakes/core/cr/TextReader.java>:[86,4]
[deprecation] CasInitializer in org.apache.uima.collection has been deprecated
[ERROR] <https://builds.apache.org/job/ctakes-trunk-compiletest/ws/ctakes-core/src/main/java/org/apache/ctakes/core/cr/TextReader.java>:[86,36]
[deprecation] getCasInitializer() in CollectionReader_ImplBase has been deprecated
[ERROR] <https://builds.apache.org/job/ctakes-trunk-compiletest/ws/ctakes-core/src/main/java/org/apache/ctakes/core/cr/JdbcCollectionReader.java>:[179,25]
[unchecked] unchecked conversion
[ERROR] <https://builds.apache.org/job/ctakes-trunk-compiletest/ws/ctakes-core/src/main/java/org/apache/ctakes/core/cr/JdbcCollectionReader.java>:[276,20]
[deprecation] getCasInitializer() in CollectionReader_ImplBase has been deprecated
[ERROR] <https://builds.apache.org/job/ctakes-trunk-compiletest/ws/ctakes-core/src/main/java/org/apache/ctakes/core/cr/JdbcCollectionReader.java>:[279,20]
[deprecation] getCasInitializer() in CollectionReader_ImplBase has been deprecated
[ERROR] <https://builds.apache.org/job/ctakes-trunk-compiletest/ws/ctakes-core/src/main/java/org/apache/ctakes/core/cr/XmiCollectionReaderCtakes.java>:[80,18]
[unchecked] unchecked call to add(E) as a member of the raw type ArrayList
[ERROR]   where E is a type-variable:
    E extends Object declared in class ArrayList
<https://builds.apache.org/job/ctakes-trunk-compiletest/ws/ctakes-core/src/main/java/org/apache/ctakes/core/pipeline/PiperFileRunner.java>:[79,19]
error: cannot find symbol
[ERROR]   symbol:   method addParameters(String,String)
  location: variable builder of type PipelineBuilder
<https://builds.apache.org/job/ctakes-trunk-compiletest/ws/ctakes-core/src/main/java/org/apache/ctakes/core/pipeline/PiperFileRunner.java>:[85,19]
error: cannot find symbol
[ERROR]   symbol:   method addParameters(String,String)
  location: variable builder of type PipelineBuilder
<https://builds.apache.org/job/ctakes-trunk-compiletest/ws/ctakes-core/src/main/java/org/apache/ctakes/core/pipeline/PiperFileRunner.java>:[87,19]
error: cannot find symbol
[ERROR]   symbol:   method addParameters(String,String)
  location: variable builder of type PipelineBuilder
<https://builds.apache.org/job/ctakes-trunk-compiletest/ws/ctakes-core/src/main/java/org/apache/ctakes/core/pipeline/PiperFileRunner.java>:[92,19]
error: cannot find symbol
[ERROR]   symbol:   method addParameters(String,String)
  location: variable builder of type PipelineBuilder
<https://builds.apache.org/job/ctakes-trunk-compiletest/ws/ctakes-core/src/main/java/org/apache/ctakes/core/pipeline/PiperFileRunner.java>:[93,19]
error: cannot find symbol
[ERROR]   symbol:   method addParameters(String,String)
  location: variable builder of type PipelineBuilder
<https://builds.apache.org/job/ctakes-trunk-compiletest/ws/ctakes-core/src/main/java/org/apache/ctakes/core/pipeline/PiperFileRunner.java>:[97,19]
error: cannot find symbol
[ERROR]   symbol:   method addParameters(String,String)
  location: variable builder of type PipelineBuilder
<https://builds.apache.org/job/ctakes-trunk-compiletest/ws/ctakes-core/src/main/java/org/apache/ctakes/core/pipeline/PiperFileRunner.java>:[98,19]
error: cannot find symbol
[ERROR]   symbol:   method addParameters(String,String)
  location: variable builder of type PipelineBuilder
<https://builds.apache.org/job/ctakes-trunk-compiletest/ws/ctakes-core/src/main/java/org/apache/ctakes/core/resource/LuceneIndexReaderResourceImpl.java>:[70,44]
[deprecation] open(Directory) in IndexReader has been deprecated
[ERROR] <https://builds.apache.org/job/ctakes-trunk-compiletest/ws/ctakes-core/src/main/java/org/apache/ctakes/core/resource/LuceneIndexReaderResourceImpl.java>:[75,44]
[deprecation] open(Directory) in IndexReader has been deprecated
[ERROR] <https://builds.apache.org/job/ctakes-trunk-compiletest/ws/ctakes-core/src/main/java/org/apache/ctakes/core/resource/StringIntegerMapResourceImpl.java>:[101,15]
[unchecked] getMap() in StringIntegerMapResourceImpl implements getMap() in StringIntegerMapResource
[ERROR]   return type requires unchecked conversion from Map to Map<String,Integer>
<https://builds.apache.org/job/ctakes-trunk-compiletest/ws/ctakes-core/src/main/java/org/apache/ctakes/core/cr/LinesFromFileCollectionReader.java>:[175,7]
[deprecation] getCasInitializer() in CollectionReader_ImplBase has been deprecated
[ERROR] <https://builds.apache.org/job/ctakes-trunk-compiletest/ws/ctakes-core/src/main/java/org/apache/ctakes/core/cr/LinesFromFileCollectionReader.java>:[178,4]
[deprecation] getCasInitializer() in CollectionReader_ImplBase has been deprecated
[INFO] 34 errors 
[INFO] -------------------------------------------------------------
[JENKINS] Archiving disabled
[INFO] ------------------------------------------------------------------------
[INFO] Reactor Summary:
[INFO] 
[INFO] Apache cTAKES ..................................... SUCCESS [1.619s]
[INFO] Apache cTAKES common type system .................. SUCCESS [6.174s]
[INFO] Apache cTAKES utils ............................... SUCCESS [3.086s]
[INFO] Apache cTAKES Resources core ...................... SUCCESS [3.507s]
[INFO] Apache cTAKES core ................................ FAILURE [2.769s]
[INFO] Apache cTAKES Resources pos-tagger ................ SKIPPED
[INFO] Apache cTAKES part-of-speech tagger ............... SKIPPED
[INFO] Apache cTAKES Resources ctakes-chunker-res ........ SKIPPED
[INFO] Apache cTAKES chunker ............................. SKIPPED
[INFO] Apache cTAKES document preprocessor ............... SKIPPED
[INFO] Apache cTAKES Resources dictionary-lookup ......... SKIPPED
[INFO] Apache cTAKES dictionary lookup ................... SKIPPED
[INFO] Apache cTAKES context dependent tokenizer ......... SKIPPED
[INFO] Apache cTAKES Resources lvg ....................... SKIPPED
[INFO] Apache cTAKES LVG lexical tools ................... SKIPPED
[INFO] Apache cTAKES Resources ne-contexts ............... SKIPPED
[INFO] Apache cTAKES named entity contexts ............... SKIPPED
[INFO] Apache cTAKES Resources constituency-parser ....... SKIPPED
[INFO] Apache cTAKES Constituency Parser ................. SKIPPED
[INFO] Apache cTAKES Resources coreference ............... SKIPPED
[INFO] Apache cTAKES Resources relation-extractor ........ SKIPPED
[INFO] Apache cTAKES Resources dependency-parser ......... SKIPPED
[INFO] Apache cTAKES Dependency Parser ................... SKIPPED
[INFO] Apache cTAKES Relation Extractor .................. SKIPPED
[INFO] Apache cTAKES Resources assertion ................. SKIPPED
[INFO] Apache cTAKES Assertion ........................... SKIPPED
[INFO] Apache cTAKES Resources temporal .................. SKIPPED
[INFO] Apache cTAKES Resources dictionary-lookup-fast-res  SKIPPED
[INFO] Apache cTAKES dictionary lookup fast .............. SKIPPED
[INFO] Apache cTAKES Temporal Information Extraction ..... SKIPPED
[INFO] Apache cTAKES CoReference Resolver ................ SKIPPED
[INFO] Apache cTAKES Resources drug-ner .................. SKIPPED
[INFO] Apache cTAKES Drug NER ............................ SKIPPED
[INFO] Apache cTAKES Resources side-effect ............... SKIPPED
[INFO] Apache cTAKES Side Effects ........................ SKIPPED
[INFO] Apache cTAKES Resources smoking-status ............ SKIPPED
[INFO] Apache cTAKES Smoking Status ...................... SKIPPED
[INFO] Apache cTAKES Resources assertion-zoner ........... SKIPPED
[INFO] Apache cTAKES Assertion's zoner ................... SKIPPED
[INFO] Apache cTAKES Resources ctakes-ytex-res ........... SKIPPED
[INFO] Apache cTAKES YTEX ................................ SKIPPED
[INFO] Apache cTAKES YTEX UIMA ........................... SKIPPED
[INFO] ctakes-clinical-pipeline-res ...................... SKIPPED
[INFO] Apache cTAKES ctakes-clinical-pipeline ............ SKIPPED
[INFO] ctakes-examples-res ............................... SKIPPED
[INFO] ctakes-examples ................................... SKIPPED
[INFO] Apache cTAKES YTEX Web ............................ SKIPPED
[INFO] Apache cTAKES Distribution ........................ SKIPPED
[INFO] Apache cTAKES Regression-test ..................... SKIPPED
[INFO] Apache cTAKES template filler ..................... SKIPPED
[INFO] ------------------------------------------------------------------------
[INFO] BUILD FAILURE
[INFO] ------------------------------------------------------------------------
[INFO] Total time: 23.912s
[INFO] Finished at: Mon Dec 19 16:54:32 UTC 2016
[INFO] Final Memory: 40M/569M
[INFO] ------------------------------------------------------------------------
[JENKINS] Archiving disabled
[JENKINS] Archiving disabled
[JENKINS] Archiving disabled
[JENKINS] Archiving disabled
[JENKINS] Archiving disabled
[JENKINS] Archiving disabled
[JENKINS] Archiving disabled
[JENKINS] Archiving disabled
[JENKINS] Archiving disabled
[JENKINS] Archiving disabled
[JENKINS] Archiving disabled
[JENKINS] Archiving disabled
[JENKINS] Archiving disabled
[JENKINS] Archiving disabled
[JENKINS] Archiving disabled
[JENKINS] Archiving disabled
[JENKINS] Archiving disabled
[JENKINS] Archiving disabled
[JENKINS] Archiving disabled
[JENKINS] Archiving disabled
[JENKINS] Archiving disabled
[JENKINS] Archiving disabled
[JENKINS] Archiving disabled
[JENKINS] Archiving disabled
[JENKINS] Archiving disabled
[JENKINS] Archiving disabled
[JENKINS] Archiving disabled
[JENKINS] Archiving disabled
[JENKINS] Archiving disabled
[JENKINS] Archiving disabled
[JENKINS] Archiving disabled
[JENKINS] Archiving disabled
[JENKINS] Archiving disabled
[JENKINS] Archiving disabled
[JENKINS] Archiving disabled
[JENKINS] Archiving disabled
[JENKINS] Archiving disabled
[JENKINS] Archiving disabled
[JENKINS] Archiving disabled
[JENKINS] Archiving disabled
[JENKINS] Archiving disabled
[JENKINS] Archiving disabled
[JENKINS] Archiving disabled
[JENKINS] Archiving disabled
[JENKINS] Archiving disabled
[JENKINS] Archiving disabled
[JENKINS] Archiving disabled
[JENKINS] Archiving disabled
[JENKINS] Archiving disabled
[JENKINS] Archiving disabled
Waiting for Jenkins to finish collecting data
[ERROR] Failed to execute goal org.apache.maven.plugins:maven-compiler-plugin:2.4:compile
(default-compile) on project ctakes-core: Compilation failure: Compilation failure:
[ERROR] <https://builds.apache.org/job/ctakes-trunk-compiletest/ws/ctakes-core/src/main/java/org/apache/ctakes/core/sentence/SentenceDetectorCtakes.java>:[45,25]
[deprecation] HashSumEventStream in opennlp.tools.util has been deprecated
[ERROR] <https://builds.apache.org/job/ctakes-trunk-compiletest/ws/ctakes-core/src/main/java/org/apache/ctakes/core/cr/TextReader.java>:[34,33]
[deprecation] CasInitializer in org.apache.uima.collection has been deprecated
[ERROR] <https://builds.apache.org/job/ctakes-trunk-compiletest/ws/ctakes-core/src/main/java/org/apache/ctakes/core/cr/FilesInDirectoryCollectionReader.java>:[228,7]
[deprecation] getCasInitializer() in CollectionReader_ImplBase has been deprecated
[ERROR] <https://builds.apache.org/job/ctakes-trunk-compiletest/ws/ctakes-core/src/main/java/org/apache/ctakes/core/cr/FilesInDirectoryCollectionReader.java>:[230,4]
[deprecation] getCasInitializer() in CollectionReader_ImplBase has been deprecated
[ERROR] <https://builds.apache.org/job/ctakes-trunk-compiletest/ws/ctakes-core/src/main/java/org/apache/ctakes/core/ae/SentenceDetector.java>:[303,30]
[deprecation] train(String,ObjectStream<SentenceSample>,boolean,Dictionary,TrainingParameters)
in SentenceDetectorME has been deprecated
[ERROR] <https://builds.apache.org/job/ctakes-trunk-compiletest/ws/ctakes-core/src/main/java/org/apache/ctakes/core/sentence/SentenceDetectorCtakes.java>:[251,5]
[deprecation] HashSumEventStream in opennlp.tools.util has been deprecated
[ERROR] <https://builds.apache.org/job/ctakes-trunk-compiletest/ws/ctakes-core/src/main/java/org/apache/ctakes/core/sentence/SentenceDetectorCtakes.java>:[251,35]
[deprecation] HashSumEventStream in opennlp.tools.util has been deprecated
[ERROR] <https://builds.apache.org/job/ctakes-trunk-compiletest/ws/ctakes-core/src/main/java/org/apache/ctakes/core/pipeline/PiperFileReader.java>:[247,13]
[unchecked] unchecked conversion
[ERROR] required: Class<? extends AnalysisComponent>
[ERROR] found:    Class
[ERROR] <https://builds.apache.org/job/ctakes-trunk-compiletest/ws/ctakes-core/src/main/java/org/apache/ctakes/core/pipeline/PiperFileReader.java>:[259,19]
[unchecked] unchecked conversion
[ERROR] required: Class<? extends AnalysisComponent>
[ERROR] found:    Class
[ERROR] <https://builds.apache.org/job/ctakes-trunk-compiletest/ws/ctakes-core/src/main/java/org/apache/ctakes/core/pipeline/PiperFileReader.java>:[266,19]
[unchecked] unchecked conversion
[ERROR] required: Class<? extends AnalysisComponent>
[ERROR] found:    Class
[ERROR] <https://builds.apache.org/job/ctakes-trunk-compiletest/ws/ctakes-core/src/main/java/org/apache/ctakes/core/pipeline/PiperFileReader.java>:[271,19]
[unchecked] unchecked conversion
[ERROR] required: Class<? extends AnalysisComponent>
[ERROR] found:    Class
[ERROR] <https://builds.apache.org/job/ctakes-trunk-compiletest/ws/ctakes-core/src/main/java/org/apache/ctakes/core/pipeline/PiperFileReader.java>:[276,19]
[unchecked] unchecked conversion
[ERROR] required: Class<? extends AnalysisComponent>
[ERROR] found:    Class
[ERROR] <https://builds.apache.org/job/ctakes-trunk-compiletest/ws/ctakes-core/src/main/java/org/apache/ctakes/core/pipeline/PiperFileReader.java>:[379,19]
[unchecked] unchecked conversion
[ERROR] required: Class<? extends CollectionReader>
[ERROR] found:    Class
[ERROR] <https://builds.apache.org/job/ctakes-trunk-compiletest/ws/ctakes-core/src/main/java/org/apache/ctakes/core/pipeline/PiperFileReader.java>:[386,19]
[unchecked] unchecked conversion
[ERROR] required: Class<? extends CollectionReader>
[ERROR] found:    Class
[ERROR] <https://builds.apache.org/job/ctakes-trunk-compiletest/ws/ctakes-core/src/main/java/org/apache/ctakes/core/pipeline/PiperFileReader.java>:[391,19]
[unchecked] unchecked conversion
[ERROR] required: Class<? extends CollectionReader>
[ERROR] found:    Class
[ERROR] <https://builds.apache.org/job/ctakes-trunk-compiletest/ws/ctakes-core/src/main/java/org/apache/ctakes/core/util/ListIterable.java>:[34,50]
[unchecked] unchecked cast
[ERROR] required: T
[ERROR] found:    TOP
[ERROR] where T is a type-variable:
[ERROR] T extends Object declared in class FSListIterator
[ERROR] <https://builds.apache.org/job/ctakes-trunk-compiletest/ws/ctakes-core/src/main/java/org/apache/ctakes/core/cr/TextReader.java>:[86,4]
[deprecation] CasInitializer in org.apache.uima.collection has been deprecated
[ERROR] <https://builds.apache.org/job/ctakes-trunk-compiletest/ws/ctakes-core/src/main/java/org/apache/ctakes/core/cr/TextReader.java>:[86,36]
[deprecation] getCasInitializer() in CollectionReader_ImplBase has been deprecated
[ERROR] <https://builds.apache.org/job/ctakes-trunk-compiletest/ws/ctakes-core/src/main/java/org/apache/ctakes/core/cr/JdbcCollectionReader.java>:[179,25]
[unchecked] unchecked conversion
[ERROR] <https://builds.apache.org/job/ctakes-trunk-compiletest/ws/ctakes-core/src/main/java/org/apache/ctakes/core/cr/JdbcCollectionReader.java>:[276,20]
[deprecation] getCasInitializer() in CollectionReader_ImplBase has been deprecated
[ERROR] <https://builds.apache.org/job/ctakes-trunk-compiletest/ws/ctakes-core/src/main/java/org/apache/ctakes/core/cr/JdbcCollectionReader.java>:[279,20]
[deprecation] getCasInitializer() in CollectionReader_ImplBase has been deprecated
[ERROR] <https://builds.apache.org/job/ctakes-trunk-compiletest/ws/ctakes-core/src/main/java/org/apache/ctakes/core/cr/XmiCollectionReaderCtakes.java>:[80,18]
[unchecked] unchecked call to add(E) as a member of the raw type ArrayList
[ERROR] where E is a type-variable:
[ERROR] E extends Object declared in class ArrayList
[ERROR] <https://builds.apache.org/job/ctakes-trunk-compiletest/ws/ctakes-core/src/main/java/org/apache/ctakes/core/pipeline/PiperFileRunner.java>:[79,19]
error: cannot find symbol
[ERROR] symbol:   method addParameters(String,String)
[ERROR] location: variable builder of type PipelineBuilder
[ERROR] <https://builds.apache.org/job/ctakes-trunk-compiletest/ws/ctakes-core/src/main/java/org/apache/ctakes/core/pipeline/PiperFileRunner.java>:[85,19]
error: cannot find symbol
[ERROR] symbol:   method addParameters(String,String)
[ERROR] location: variable builder of type PipelineBuilder
[ERROR] <https://builds.apache.org/job/ctakes-trunk-compiletest/ws/ctakes-core/src/main/java/org/apache/ctakes/core/pipeline/PiperFileRunner.java>:[87,19]
error: cannot find symbol
[ERROR] symbol:   method addParameters(String,String)
[ERROR] location: variable builder of type PipelineBuilder
[ERROR] <https://builds.apache.org/job/ctakes-trunk-compiletest/ws/ctakes-core/src/main/java/org/apache/ctakes/core/pipeline/PiperFileRunner.java>:[92,19]
error: cannot find symbol
[ERROR] symbol:   method addParameters(String,String)
[ERROR] location: variable builder of type PipelineBuilder
[ERROR] <https://builds.apache.org/job/ctakes-trunk-compiletest/ws/ctakes-core/src/main/java/org/apache/ctakes/core/pipeline/PiperFileRunner.java>:[93,19]
error: cannot find symbol
[ERROR] symbol:   method addParameters(String,String)
[ERROR] location: variable builder of type PipelineBuilder
[ERROR] <https://builds.apache.org/job/ctakes-trunk-compiletest/ws/ctakes-core/src/main/java/org/apache/ctakes/core/pipeline/PiperFileRunner.java>:[97,19]
error: cannot find symbol
[ERROR] symbol:   method addParameters(String,String)
[ERROR] location: variable builder of type PipelineBuilder
[ERROR] <https://builds.apache.org/job/ctakes-trunk-compiletest/ws/ctakes-core/src/main/java/org/apache/ctakes/core/pipeline/PiperFileRunner.java>:[98,19]
error: cannot find symbol
[ERROR] symbol:   method addParameters(String,String)
[ERROR] location: variable builder of type PipelineBuilder
[ERROR] <https://builds.apache.org/job/ctakes-trunk-compiletest/ws/ctakes-core/src/main/java/org/apache/ctakes/core/resource/LuceneIndexReaderResourceImpl.java>:[70,44]
[deprecation] open(Directory) in IndexReader has been deprecated
[ERROR] <https://builds.apache.org/job/ctakes-trunk-compiletest/ws/ctakes-core/src/main/java/org/apache/ctakes/core/resource/LuceneIndexReaderResourceImpl.java>:[75,44]
[deprecation] open(Directory) in IndexReader has been deprecated
[ERROR] <https://builds.apache.org/job/ctakes-trunk-compiletest/ws/ctakes-core/src/main/java/org/apache/ctakes/core/resource/StringIntegerMapResourceImpl.java>:[101,15]
[unchecked] getMap() in StringIntegerMapResourceImpl implements getMap() in StringIntegerMapResource
[ERROR] return type requires unchecked conversion from Map to Map<String,Integer>
[ERROR] <https://builds.apache.org/job/ctakes-trunk-compiletest/ws/ctakes-core/src/main/java/org/apache/ctakes/core/cr/LinesFromFileCollectionReader.java>:[175,7]
[deprecation] getCasInitializer() in CollectionReader_ImplBase has been deprecated
[ERROR] <https://builds.apache.org/job/ctakes-trunk-compiletest/ws/ctakes-core/src/main/java/org/apache/ctakes/core/cr/LinesFromFileCollectionReader.java>:[178,4]
[deprecation] getCasInitializer() in CollectionReader_ImplBase has been deprecated
[ERROR] -> [Help 1]
[ERROR] 
[ERROR] To see the full stack trace of the errors, re-run Maven with the -e switch.
[ERROR] Re-run Maven using the -X switch to enable full debug logging.
[ERROR] 
[ERROR] For more information about the errors and possible solutions, please read the following
articles:
[ERROR] [Help 1] http://cwiki.apache.org/confluence/display/MAVEN/MojoFailureException
[ERROR] 
[ERROR] After correcting the problems, you can resume the build with the command
[ERROR]   mvn <goals> -rf :ctakes-core
Sending e-mails to: notifications@ctakes.apache.org sean.finan@tch.harvard.edu
channel stopped

Mime
View raw message