ctakes-notifications mailing list archives

Site index · List index
Message view « Date » · « Thread »
Top « Date » · « Thread »
From Apache Jenkins Server <jenk...@builds.apache.org>
Subject Build failed in Jenkins: ctakes-trunk-package » Apache cTAKES Temporal Information Extraction #448
Date Tue, 02 Aug 2016 11:50:38 GMT
See <https://builds.apache.org/job/ctakes-trunk-package/org.apache.ctakes$ctakes-temporal/448/changes>

Changes:

[dligach] added a method to print pos sequences

[dligach] printe event data / single label per word

------------------------------------------
[...truncated 106 lines...]
[ERROR] <https://builds.apache.org/job/ctakes-trunk-package/org.apache.ctakes$ctakes-temporal/ws/src/main/java/org/apache/ctakes/temporal/ae/EventEventRelationSeedBasedAnnotator.java>:[141,27]
[unchecked] unchecked generic array creation for varargs parameter of type RelationFeaturesExtractor<IdentifiedAnnotation,IdentifiedAnnotation>[]
[ERROR] <https://builds.apache.org/job/ctakes-trunk-package/org.apache.ctakes$ctakes-temporal/ws/src/main/java/org/apache/ctakes/temporal/ae/feature/UMLSBasedTokenFeaturesExtractor.java>:[38,42]
[unchecked] unchecked call to CleartkExtractor(Class<SEARCH_T>,FeatureExtractor1<SEARCH_T>,Context...)
as a member of the raw type CleartkExtractor
[ERROR]   where SEARCH_T is a type-variable:
    SEARCH_T extends Annotation declared in class CleartkExtractor
<https://builds.apache.org/job/ctakes-trunk-package/org.apache.ctakes$ctakes-temporal/ws/src/main/java/org/apache/ctakes/temporal/ae/feature/UMLSBasedTokenFeaturesExtractor.java>:[50,62]
[unchecked] unchecked call to NamingExtractor1(String,FeatureExtractor1<T>) as a member
of the raw type NamingExtractor1
[ERROR]   where T is a type-variable:
    T extends Annotation declared in class NamingExtractor1
<https://builds.apache.org/job/ctakes-trunk-package/org.apache.ctakes$ctakes-temporal/ws/src/main/java/org/apache/ctakes/temporal/ae/feature/UMLSBasedTokenFeaturesExtractor.java>:[54,62]
[unchecked] unchecked call to NamingExtractor1(String,FeatureExtractor1<T>) as a member
of the raw type NamingExtractor1
[ERROR]   where T is a type-variable:
    T extends Annotation declared in class NamingExtractor1
<https://builds.apache.org/job/ctakes-trunk-package/org.apache.ctakes$ctakes-temporal/ws/src/main/java/org/apache/ctakes/temporal/ae/feature/UMLSBasedTokenFeaturesExtractor.java>:[60,62]
[unchecked] unchecked call to NamingExtractor1(String,FeatureExtractor1<T>) as a member
of the raw type NamingExtractor1
[ERROR]   where T is a type-variable:
    T extends Annotation declared in class NamingExtractor1
<https://builds.apache.org/job/ctakes-trunk-package/org.apache.ctakes$ctakes-temporal/ws/src/main/java/org/apache/ctakes/temporal/ae/feature/UMLSBasedTokenFeaturesExtractor.java>:[64,62]
[unchecked] unchecked call to NamingExtractor1(String,FeatureExtractor1<T>) as a member
of the raw type NamingExtractor1
[ERROR]   where T is a type-variable:
    T extends Annotation declared in class NamingExtractor1
<https://builds.apache.org/job/ctakes-trunk-package/org.apache.ctakes$ctakes-temporal/ws/src/main/java/org/apache/ctakes/temporal/ae/feature/UMLSBasedTokenFeaturesExtractor.java>:[73,3]
[unchecked] unchecked call to NamingExtractor1(String,FeatureExtractor1<T>) as a member
of the raw type NamingExtractor1
[ERROR]   where T is a type-variable:
    T extends Annotation declared in class NamingExtractor1
<https://builds.apache.org/job/ctakes-trunk-package/org.apache.ctakes$ctakes-temporal/ws/src/main/java/org/apache/ctakes/temporal/ae/feature/UMLSBasedTokenFeaturesExtractor.java>:[71,42]
[unchecked] unchecked call to CleartkExtractor(Class<SEARCH_T>,FeatureExtractor1<SEARCH_T>,Context...)
as a member of the raw type CleartkExtractor
[ERROR]   where SEARCH_T is a type-variable:
    SEARCH_T extends Annotation declared in class CleartkExtractor
<https://builds.apache.org/job/ctakes-trunk-package/org.apache.ctakes$ctakes-temporal/ws/src/main/java/org/apache/ctakes/temporal/ae/feature/UMLSBasedTokenFeaturesExtractor.java>:[81,44]
[unchecked] unchecked call to DistanceExtractor(String,Class<? extends Annotation>)
as a member of the raw type DistanceExtractor
[ERROR] <https://builds.apache.org/job/ctakes-trunk-package/org.apache.ctakes$ctakes-temporal/ws/src/main/java/org/apache/ctakes/temporal/ae/feature/UMLSBasedTokenFeaturesExtractor.java>:[98,65]
[unchecked] unchecked call to extract(JCas,T) as a member of the raw type FeatureExtractor1
[ERROR]   where T is a type-variable:
    T extends Annotation declared in interface FeatureExtractor1
<https://builds.apache.org/job/ctakes-trunk-package/org.apache.ctakes$ctakes-temporal/ws/src/main/java/org/apache/ctakes/temporal/ae/feature/UMLSBasedTokenFeaturesExtractor.java>:[98,19]
[unchecked] unchecked method invocation: method addAll in interface List is applied to given
types
[ERROR]   required: Collection<? extends E>
  found: List
  where E is a type-variable:
    E extends Object declared in interface List
<https://builds.apache.org/job/ctakes-trunk-package/org.apache.ctakes$ctakes-temporal/ws/src/main/java/org/apache/ctakes/temporal/ae/feature/UMLSBasedTokenFeaturesExtractor.java>:[98,65]
[unchecked] unchecked conversion
[ERROR]   required: Collection<? extends E>
  found:    List
  where E is a type-variable:
    E extends Object declared in interface List
<https://builds.apache.org/job/ctakes-trunk-package/org.apache.ctakes$ctakes-temporal/ws/src/main/java/org/apache/ctakes/temporal/ae/feature/UMLSBasedTokenFeaturesExtractor.java>:[99,53]
[unchecked] unchecked call to extractBetween(JCas,FOCUS_T,FOCUS_T) as a member of the raw
type CleartkExtractor
[ERROR]   where FOCUS_T is a type-variable:
    FOCUS_T extends Annotation declared in class CleartkExtractor
<https://builds.apache.org/job/ctakes-trunk-package/org.apache.ctakes$ctakes-temporal/ws/src/main/java/org/apache/ctakes/temporal/ae/feature/UMLSBasedTokenFeaturesExtractor.java>:[99,19]
[unchecked] unchecked method invocation: method addAll in interface List is applied to given
types
[ERROR]   required: Collection<? extends E>
  found: List
  where E is a type-variable:
    E extends Object declared in interface List
<https://builds.apache.org/job/ctakes-trunk-package/org.apache.ctakes$ctakes-temporal/ws/src/main/java/org/apache/ctakes/temporal/ae/feature/UMLSBasedTokenFeaturesExtractor.java>:[99,53]
[unchecked] unchecked conversion
[ERROR]   required: Collection<? extends E>
  found:    List
  where E is a type-variable:
    E extends Object declared in interface List
<https://builds.apache.org/job/ctakes-trunk-package/org.apache.ctakes$ctakes-temporal/ws/src/main/java/org/apache/ctakes/temporal/ae/feature/UMLSBasedTokenFeaturesExtractor.java>:[100,19]
[unchecked] unchecked method invocation: method addAll in interface List is applied to given
types
[ERROR]   required: Collection<? extends E>
  found: List
  where E is a type-variable:
    E extends Object declared in interface List
<https://builds.apache.org/job/ctakes-trunk-package/org.apache.ctakes$ctakes-temporal/ws/src/main/java/org/apache/ctakes/temporal/ae/feature/UMLSBasedTokenFeaturesExtractor.java>:[100,47]
[unchecked] unchecked conversion
[ERROR]   required: Collection<? extends E>
  found:    List
  where E is a type-variable:
    E extends Object declared in interface List
<https://builds.apache.org/job/ctakes-trunk-package/org.apache.ctakes$ctakes-temporal/ws/src/main/java/org/apache/ctakes/temporal/ae/feature/UMLSBasedTokenFeaturesExtractor.java>:[111,65]
[unchecked] unchecked call to extract(JCas,T) as a member of the raw type FeatureExtractor1
[ERROR]   where T is a type-variable:
    T extends Annotation declared in interface FeatureExtractor1
<https://builds.apache.org/job/ctakes-trunk-package/org.apache.ctakes$ctakes-temporal/ws/src/main/java/org/apache/ctakes/temporal/ae/feature/UMLSBasedTokenFeaturesExtractor.java>:[111,19]
[unchecked] unchecked method invocation: method addAll in interface List is applied to given
types
[ERROR]   required: Collection<? extends E>
  found: List
  where E is a type-variable:
    E extends Object declared in interface List
<https://builds.apache.org/job/ctakes-trunk-package/org.apache.ctakes$ctakes-temporal/ws/src/main/java/org/apache/ctakes/temporal/ae/feature/UMLSBasedTokenFeaturesExtractor.java>:[111,65]
[unchecked] unchecked conversion
[ERROR]   required: Collection<? extends E>
  found:    List
  where E is a type-variable:
    E extends Object declared in interface List
<https://builds.apache.org/job/ctakes-trunk-package/org.apache.ctakes$ctakes-temporal/ws/src/main/java/org/apache/ctakes/temporal/ae/feature/UMLSBasedTokenFeaturesExtractor.java>:[112,53]
[unchecked] unchecked call to extractBetween(JCas,FOCUS_T,FOCUS_T) as a member of the raw
type CleartkExtractor
[ERROR]   where FOCUS_T is a type-variable:
    FOCUS_T extends Annotation declared in class CleartkExtractor
<https://builds.apache.org/job/ctakes-trunk-package/org.apache.ctakes$ctakes-temporal/ws/src/main/java/org/apache/ctakes/temporal/ae/feature/UMLSBasedTokenFeaturesExtractor.java>:[112,19]
[unchecked] unchecked method invocation: method addAll in interface List is applied to given
types
[ERROR]   required: Collection<? extends E>
  found: List
  where E is a type-variable:
    E extends Object declared in interface List
<https://builds.apache.org/job/ctakes-trunk-package/org.apache.ctakes$ctakes-temporal/ws/src/main/java/org/apache/ctakes/temporal/ae/feature/UMLSBasedTokenFeaturesExtractor.java>:[112,53]
[unchecked] unchecked conversion
[ERROR]   required: Collection<? extends E>
  found:    List
  where E is a type-variable:
    E extends Object declared in interface List
<https://builds.apache.org/job/ctakes-trunk-package/org.apache.ctakes$ctakes-temporal/ws/src/main/java/org/apache/ctakes/temporal/ae/feature/UMLSBasedTokenFeaturesExtractor.java>:[113,19]
[unchecked] unchecked method invocation: method addAll in interface List is applied to given
types
[ERROR]   required: Collection<? extends E>
  found: List
  where E is a type-variable:
    E extends Object declared in interface List
<https://builds.apache.org/job/ctakes-trunk-package/org.apache.ctakes$ctakes-temporal/ws/src/main/java/org/apache/ctakes/temporal/ae/feature/UMLSBasedTokenFeaturesExtractor.java>:[113,47]
[unchecked] unchecked conversion
[ERROR]   required: Collection<? extends E>
  found:    List
  where E is a type-variable:
    E extends Object declared in interface List
<https://builds.apache.org/job/ctakes-trunk-package/org.apache.ctakes$ctakes-temporal/ws/src/main/java/org/apache/ctakes/temporal/ae/feature/UMLSBasedTokenFeaturesExtractor.java>:[118,63]
[unchecked] unchecked call to extract(JCas,T) as a member of the raw type FeatureExtractor1
[ERROR]   where T is a type-variable:
    T extends Annotation declared in interface FeatureExtractor1
<https://builds.apache.org/job/ctakes-trunk-package/org.apache.ctakes$ctakes-temporal/ws/src/main/java/org/apache/ctakes/temporal/ae/feature/UMLSBasedTokenFeaturesExtractor.java>:[118,17]
[unchecked] unchecked method invocation: method addAll in interface List is applied to given
types
[ERROR]   required: Collection<? extends E>
  found: List
  where E is a type-variable:
    E extends Object declared in interface List
<https://builds.apache.org/job/ctakes-trunk-package/org.apache.ctakes$ctakes-temporal/ws/src/main/java/org/apache/ctakes/temporal/ae/feature/UMLSBasedTokenFeaturesExtractor.java>:[118,63]
[unchecked] unchecked conversion
[ERROR]   required: Collection<? extends E>
  found:    List
  where E is a type-variable:
    E extends Object declared in interface List
<https://builds.apache.org/job/ctakes-trunk-package/org.apache.ctakes$ctakes-temporal/ws/src/main/java/org/apache/ctakes/temporal/ae/feature/UMLSBasedTokenFeaturesExtractor.java>:[119,63]
[unchecked] unchecked call to extract(JCas,T) as a member of the raw type FeatureExtractor1
[ERROR]   where T is a type-variable:
    T extends Annotation declared in interface FeatureExtractor1
<https://builds.apache.org/job/ctakes-trunk-package/org.apache.ctakes$ctakes-temporal/ws/src/main/java/org/apache/ctakes/temporal/ae/feature/UMLSBasedTokenFeaturesExtractor.java>:[119,17]
[unchecked] unchecked method invocation: method addAll in interface List is applied to given
types
[ERROR]   required: Collection<? extends E>
  found: List
  where E is a type-variable:
    E extends Object declared in interface List
<https://builds.apache.org/job/ctakes-trunk-package/org.apache.ctakes$ctakes-temporal/ws/src/main/java/org/apache/ctakes/temporal/ae/feature/UMLSBasedTokenFeaturesExtractor.java>:[119,63]
[unchecked] unchecked conversion
[ERROR]   required: Collection<? extends E>
  found:    List
  where E is a type-variable:
    E extends Object declared in interface List
<https://builds.apache.org/job/ctakes-trunk-package/org.apache.ctakes$ctakes-temporal/ws/src/main/java/org/apache/ctakes/temporal/ae/feature/UMLSBasedTokenFeaturesExtractor.java>:[120,51]
[unchecked] unchecked call to extractBetween(JCas,FOCUS_T,FOCUS_T) as a member of the raw
type CleartkExtractor
[ERROR]   where FOCUS_T is a type-variable:
    FOCUS_T extends Annotation declared in class CleartkExtractor
<https://builds.apache.org/job/ctakes-trunk-package/org.apache.ctakes$ctakes-temporal/ws/src/main/java/org/apache/ctakes/temporal/ae/feature/UMLSBasedTokenFeaturesExtractor.java>:[120,17]
[unchecked] unchecked method invocation: method addAll in interface List is applied to given
types
[ERROR]   required: Collection<? extends E>
  found: List
  where E is a type-variable:
    E extends Object declared in interface List
<https://builds.apache.org/job/ctakes-trunk-package/org.apache.ctakes$ctakes-temporal/ws/src/main/java/org/apache/ctakes/temporal/ae/feature/UMLSBasedTokenFeaturesExtractor.java>:[120,51]
[unchecked] unchecked conversion
[ERROR]   required: Collection<? extends E>
  found:    List
  where E is a type-variable:
    E extends Object declared in interface List
<https://builds.apache.org/job/ctakes-trunk-package/org.apache.ctakes$ctakes-temporal/ws/src/main/java/org/apache/ctakes/temporal/ae/feature/UMLSBasedTokenFeaturesExtractor.java>:[121,17]
[unchecked] unchecked method invocation: method addAll in interface List is applied to given
types
[ERROR]   required: Collection<? extends E>
  found: List
  where E is a type-variable:
    E extends Object declared in interface List
<https://builds.apache.org/job/ctakes-trunk-package/org.apache.ctakes$ctakes-temporal/ws/src/main/java/org/apache/ctakes/temporal/ae/feature/UMLSBasedTokenFeaturesExtractor.java>:[121,45]
[unchecked] unchecked conversion
[ERROR]   required: Collection<? extends E>
  found:    List
  where E is a type-variable:
    E extends Object declared in interface List
<https://builds.apache.org/job/ctakes-trunk-package/org.apache.ctakes$ctakes-temporal/ws/src/main/java/org/apache/ctakes/temporal/ae/ConstituencyBasedTimeAnnotator.java>:[188,26]
[unchecked] unchecked call to CleartkExtractor(Class<SEARCH_T>,FeatureExtractor1<SEARCH_T>,Context...)
as a member of the raw type CleartkExtractor
[ERROR]   where SEARCH_T is a type-variable:
    SEARCH_T extends Annotation declared in class CleartkExtractor
<https://builds.apache.org/job/ctakes-trunk-package/org.apache.ctakes$ctakes-temporal/ws/src/main/java/org/apache/ctakes/temporal/ae/ConstituencyBasedTimeAnnotator.java>:[190,24]
[unchecked] unchecked call to CleartkExtractor(Class<SEARCH_T>,FeatureExtractor1<SEARCH_T>,Context...)
as a member of the raw type CleartkExtractor
[ERROR]   where SEARCH_T is a type-variable:
    SEARCH_T extends Annotation declared in class CleartkExtractor
<https://builds.apache.org/job/ctakes-trunk-package/org.apache.ctakes$ctakes-temporal/ws/src/main/java/org/apache/ctakes/temporal/ae/ConstituencyBasedTimeAnnotator.java>:[235,47]
[unchecked] unchecked call to extract(JCas,T) as a member of the raw type FeatureExtractor1
[ERROR]   where T is a type-variable:
    T extends Annotation declared in interface FeatureExtractor1
<https://builds.apache.org/job/ctakes-trunk-package/org.apache.ctakes$ctakes-temporal/ws/src/main/java/org/apache/ctakes/temporal/ae/ConstituencyBasedTimeAnnotator.java>:[235,21]
[unchecked] unchecked method invocation: method addAll in class ArrayList is applied to given
types
[ERROR]   required: Collection<? extends E>
  found: List
  where E is a type-variable:
    E extends Object declared in class ArrayList
<https://builds.apache.org/job/ctakes-trunk-package/org.apache.ctakes$ctakes-temporal/ws/src/main/java/org/apache/ctakes/temporal/ae/ConstituencyBasedTimeAnnotator.java>:[235,47]
[unchecked] unchecked conversion
[ERROR]   required: Collection<? extends E>
  found:    List
  where E is a type-variable:
    E extends Object declared in class ArrayList
<https://builds.apache.org/job/ctakes-trunk-package/org.apache.ctakes$ctakes-temporal/ws/src/main/java/org/apache/ctakes/temporal/ae/ConstituencyBasedTimeAnnotator.java>:[251,39]
[unchecked] unchecked call to extract(JCas,T) as a member of the raw type FeatureExtractor1
[ERROR]   where T is a type-variable:
    T extends Annotation declared in interface FeatureExtractor1
<https://builds.apache.org/job/ctakes-trunk-package/org.apache.ctakes$ctakes-temporal/ws/src/main/java/org/apache/ctakes/temporal/ae/ConstituencyBasedTimeAnnotator.java>:[251,21]
[unchecked] unchecked method invocation: method addAll in class ArrayList is applied to given
types
[ERROR]   required: Collection<? extends E>
  found: List
  where E is a type-variable:
    E extends Object declared in class ArrayList
<https://builds.apache.org/job/ctakes-trunk-package/org.apache.ctakes$ctakes-temporal/ws/src/main/java/org/apache/ctakes/temporal/ae/ConstituencyBasedTimeAnnotator.java>:[251,39]
[unchecked] unchecked conversion
[ERROR]   required: Collection<? extends E>
  found:    List
  where E is a type-variable:
    E extends Object declared in class ArrayList
<https://builds.apache.org/job/ctakes-trunk-package/org.apache.ctakes$ctakes-temporal/ws/src/main/java/org/apache/ctakes/temporal/ae/EventEventCRFRelationAnnotator.java>:[162,27]
[unchecked] unchecked generic array creation for varargs parameter of type RelationFeaturesExtractor<IdentifiedAnnotation,IdentifiedAnnotation>[]
[ERROR] <https://builds.apache.org/job/ctakes-trunk-package/org.apache.ctakes$ctakes-temporal/ws/src/main/java/org/apache/ctakes/temporal/eval/EvaluationOfEventEventHybridModelsRelations.java>:[376,54]
[deprecation] createAnnotatorDescription(File) in EventEventCRFRelationAnnotator has been
deprecated
[ERROR] <https://builds.apache.org/job/ctakes-trunk-package/org.apache.ctakes$ctakes-temporal/ws/src/main/java/org/apache/ctakes/temporal/eval/EvaluationOfEventEventHybridModelsRelations.java>:[377,60]
[deprecation] createAnnotatorDescription(File) in EventEventRelationSeedBasedAnnotator has
been deprecated
[ERROR] <https://builds.apache.org/job/ctakes-trunk-package/org.apache.ctakes$ctakes-temporal/ws/src/main/java/org/apache/ctakes/temporal/eval/EvaluationOfEventTimeDeepPheRelations.java>:[320,33]
[deprecation] createEngineDescription(File) in EventTimeSelfRelationAnnotator has been deprecated
[ERROR] <https://builds.apache.org/job/ctakes-trunk-package/org.apache.ctakes$ctakes-temporal/ws/src/main/java/org/apache/ctakes/temporal/ae/TemporalRelationExtractorAnnotator.java>:[115,27]
[unchecked] unchecked generic array creation for varargs parameter of type RelationFeaturesExtractor<IdentifiedAnnotation,IdentifiedAnnotation>[]
[ERROR] <https://builds.apache.org/job/ctakes-trunk-package/org.apache.ctakes$ctakes-temporal/ws/src/main/java/org/apache/ctakes/temporal/ae/TimeAnnotator.java>:[188,4]
[unchecked] unchecked call to TypePathExtractor(Class<T>,String) as a member of the
raw type TypePathExtractor
[ERROR]   where T is a type-variable:
    T extends Annotation declared in class TypePathExtractor
<https://builds.apache.org/job/ctakes-trunk-package/org.apache.ctakes$ctakes-temporal/ws/src/main/java/org/apache/ctakes/temporal/ae/TimeAnnotator.java>:[184,37]
[unchecked] unchecked call to CombinedExtractor1(FeatureExtractor1<T>,FeatureExtractor1<T>,FeatureExtractor1<T>,FeatureExtractor1<T>,FeatureExtractor1<T>)
as a member of the raw type CombinedExtractor1
[ERROR]   where T is a type-variable:
    T extends Annotation declared in class CombinedExtractor1
<https://builds.apache.org/job/ctakes-trunk-package/org.apache.ctakes$ctakes-temporal/ws/src/main/java/org/apache/ctakes/temporal/ae/TimeAnnotator.java>:[198,36]
[unchecked] unchecked call to CleartkExtractor(Class<SEARCH_T>,FeatureExtractor1<SEARCH_T>,Context...)
as a member of the raw type CleartkExtractor
[ERROR]   where SEARCH_T is a type-variable:
    SEARCH_T extends Annotation declared in class CleartkExtractor
<https://builds.apache.org/job/ctakes-trunk-package/org.apache.ctakes$ctakes-temporal/ws/src/main/java/org/apache/ctakes/temporal/ae/TimeAnnotator.java>:[251,38]
[unchecked] unchecked call to extract(JCas,T) as a member of the raw type FeatureExtractor1
[ERROR]   where T is a type-variable:
    T extends Annotation declared in interface FeatureExtractor1
<https://builds.apache.org/job/ctakes-trunk-package/org.apache.ctakes$ctakes-temporal/ws/src/main/java/org/apache/ctakes/temporal/ae/TimeAnnotator.java>:[251,20]
[unchecked] unchecked method invocation: method addAll in interface List is applied to given
types
[ERROR]   required: Collection<? extends E>
  found: List
  where E is a type-variable:
    E extends Object declared in interface List
<https://builds.apache.org/job/ctakes-trunk-package/org.apache.ctakes$ctakes-temporal/ws/src/main/java/org/apache/ctakes/temporal/ae/TimeAnnotator.java>:[251,38]
[unchecked] unchecked conversion
[ERROR]   required: Collection<? extends E>
  found:    List
  where E is a type-variable:
    E extends Object declared in interface List
<https://builds.apache.org/job/ctakes-trunk-package/org.apache.ctakes$ctakes-temporal/ws/src/main/java/org/apache/ctakes/temporal/ae/TimeAnnotator.java>:[255,44]
[unchecked] unchecked call to extractWithin(JCas,FOCUS_T,Annotation) as a member of the raw
type CleartkExtractor
[ERROR]   where FOCUS_T is a type-variable:
    FOCUS_T extends Annotation declared in class CleartkExtractor
<https://builds.apache.org/job/ctakes-trunk-package/org.apache.ctakes$ctakes-temporal/ws/src/main/java/org/apache/ctakes/temporal/ae/TimeAnnotator.java>:[255,20]
[unchecked] unchecked method invocation: method addAll in interface List is applied to given
types
[ERROR]   required: Collection<? extends E>
  found: List
  where E is a type-variable:
    E extends Object declared in interface List
<https://builds.apache.org/job/ctakes-trunk-package/org.apache.ctakes$ctakes-temporal/ws/src/main/java/org/apache/ctakes/temporal/ae/TimeAnnotator.java>:[255,44]
[unchecked] unchecked conversion
[ERROR]   required: Collection<? extends E>
  found:    List
  where E is a type-variable:
    E extends Object declared in interface List
<https://builds.apache.org/job/ctakes-trunk-package/org.apache.ctakes$ctakes-temporal/ws/src/main/java/org/apache/ctakes/temporal/eval/EvaluationOfEventEventRelations.java>:[140,35]
[deprecation] createAnnotatorDescription(File) in EventEventRelationAnnotator has been deprecated
[ERROR] <https://builds.apache.org/job/ctakes-trunk-package/org.apache.ctakes$ctakes-temporal/ws/src/main/java/org/apache/ctakes/temporal/ae/BackwardsTimeAnnotator.java>:[167,38]
[unchecked] unchecked call to CleartkExtractor(Class<SEARCH_T>,FeatureExtractor1<SEARCH_T>,Context...)
as a member of the raw type CleartkExtractor
[ERROR]   where SEARCH_T is a type-variable:
    SEARCH_T extends Annotation declared in class CleartkExtractor
<https://builds.apache.org/job/ctakes-trunk-package/org.apache.ctakes$ctakes-temporal/ws/src/main/java/org/apache/ctakes/temporal/ae/BackwardsTimeAnnotator.java>:[205,43]
[unchecked] unchecked call to extract(JCas,T) as a member of the raw type FeatureExtractor1
[ERROR]   where T is a type-variable:
    T extends Annotation declared in interface FeatureExtractor1
<https://builds.apache.org/job/ctakes-trunk-package/org.apache.ctakes$ctakes-temporal/ws/src/main/java/org/apache/ctakes/temporal/ae/BackwardsTimeAnnotator.java>:[205,25]
[unchecked] unchecked method invocation: method addAll in interface List is applied to given
types
[ERROR]   required: Collection<? extends E>
  found: List
  where E is a type-variable:
    E extends Object declared in interface List
<https://builds.apache.org/job/ctakes-trunk-package/org.apache.ctakes$ctakes-temporal/ws/src/main/java/org/apache/ctakes/temporal/ae/BackwardsTimeAnnotator.java>:[205,43]
[unchecked] unchecked conversion
[ERROR]   required: Collection<? extends E>
  found:    List
  where E is a type-variable:
    E extends Object declared in interface List
<https://builds.apache.org/job/ctakes-trunk-package/org.apache.ctakes$ctakes-temporal/ws/src/main/java/org/apache/ctakes/temporal/ae/BackwardsTimeAnnotator.java>:[209,49]
[unchecked] unchecked call to extractWithin(JCas,FOCUS_T,Annotation) as a member of the raw
type CleartkExtractor
[ERROR]   where FOCUS_T is a type-variable:
    FOCUS_T extends Annotation declared in class CleartkExtractor
<https://builds.apache.org/job/ctakes-trunk-package/org.apache.ctakes$ctakes-temporal/ws/src/main/java/org/apache/ctakes/temporal/ae/BackwardsTimeAnnotator.java>:[209,25]
[unchecked] unchecked method invocation: method addAll in interface List is applied to given
types
[ERROR]   required: Collection<? extends E>
  found: List
  where E is a type-variable:
    E extends Object declared in interface List
<https://builds.apache.org/job/ctakes-trunk-package/org.apache.ctakes$ctakes-temporal/ws/src/main/java/org/apache/ctakes/temporal/ae/BackwardsTimeAnnotator.java>:[209,49]
[unchecked] unchecked conversion
[ERROR]   required: Collection<? extends E>
  found:    List
  where E is a type-variable:
    E extends Object declared in interface List
<https://builds.apache.org/job/ctakes-trunk-package/org.apache.ctakes$ctakes-temporal/ws/src/main/java/org/apache/ctakes/temporal/ae/EventTimeSelfRelationAnnotator.java>:[141,27]
[unchecked] unchecked generic array creation for varargs parameter of type RelationFeaturesExtractor<IdentifiedAnnotation,IdentifiedAnnotation>[]
[INFO] 101 errors 
[INFO] -------------------------------------------------------------

Mime
View raw message