ctakes-notifications mailing list archives

Site index · List index
Message view « Date » · « Thread »
Top « Date » · « Thread »
From Apache Jenkins Server <jenk...@builds.apache.org>
Subject Build failed in Jenkins: ctakes-trunk-compiletest #817
Date Mon, 11 Jul 2016 15:57:35 GMT
See <https://builds.apache.org/job/ctakes-trunk-compiletest/817/changes>

Changes:

[dligach] training data printer for docTimeRel

[dligach] it's possible to shuffle files before extracting training data

------------------------------------------
[...truncated 12497 lines...]
** ERR: problem of opening/reading diacritics file: '<https://builds.apache.org/job/ctakes-trunk-compiletest/ws/ctakes-temporal/data/Unicode/diacriticMap.data'.>
Exception: java.io.FileNotFoundException: <https://builds.apache.org/job/ctakes-trunk-compiletest/ws/ctakes-temporal/data/Unicode/diacriticMap.data>
(No such file or directory)
Exception: java.io.FileNotFoundException: <https://builds.apache.org/job/ctakes-trunk-compiletest/ws/ctakes-temporal/data/Unicode/ligatureMap.data>
(No such file or directory)
** Error: problem of opening/reading ligature file: '<https://builds.apache.org/job/ctakes-trunk-compiletest/ws/ctakes-temporal/data/Unicode/ligatureMap.data'.>
** Error: problem of opening/reading symbol synonym file: '<https://builds.apache.org/job/ctakes-trunk-compiletest/ws/ctakes-temporal/data/Unicode/synonymMap.data'.>
Exception: java.io.FileNotFoundException: <https://builds.apache.org/job/ctakes-trunk-compiletest/ws/ctakes-temporal/data/Unicode/synonymMap.data>
(No such file or directory)
**Error: problem of opening/reading file '<https://builds.apache.org/job/ctakes-trunk-compiletest/ws/ctakes-temporal/data/misc/removeS.data'.>
Exception: java.io.FileNotFoundException: <https://builds.apache.org/job/ctakes-trunk-compiletest/ws/ctakes-temporal/data/misc/removeS.data>
(No such file or directory)
** Error: problem of opening/reading Unicode symbol file: '<https://builds.apache.org/job/ctakes-trunk-compiletest/ws/ctakes-temporal/data/Unicode/symbolMap.data'.>
Exception: java.io.FileNotFoundException: <https://builds.apache.org/job/ctakes-trunk-compiletest/ws/ctakes-temporal/data/Unicode/symbolMap.data>
(No such file or directory)
** Error: problem of opening/reading Unicode file: '<https://builds.apache.org/job/ctakes-trunk-compiletest/ws/ctakes-temporal/data/Unicode/unicodeMap.data'.>
Exception: java.io.FileNotFoundException: <https://builds.apache.org/job/ctakes-trunk-compiletest/ws/ctakes-temporal/data/Unicode/unicodeMap.data>
(No such file or directory)
** Error: problem of opening/reading nonStripMap file: '<https://builds.apache.org/job/ctakes-trunk-compiletest/ws/ctakes-temporal/data/Unicode/nonStripMap.data'.>
Exception: java.io.FileNotFoundException: <https://builds.apache.org/job/ctakes-trunk-compiletest/ws/ctakes-temporal/data/Unicode/nonStripMap.data>
(No such file or directory)
Exception: java.io.FileNotFoundException: <https://builds.apache.org/job/ctakes-trunk-compiletest/ws/ctakes-temporal/data/rules/im.rul>
(No such file or directory)
**Error: problem of opening/reading file '<https://builds.apache.org/job/ctakes-trunk-compiletest/ws/ctakes-temporal//data/rules/im.rul'.>
Exception: java.io.FileNotFoundException: <https://builds.apache.org/job/ctakes-trunk-compiletest/ws/ctakes-temporal/data/rules/im.rul>
(No such file or directory)
**Error: problem of opening/reading file '<https://builds.apache.org/job/ctakes-trunk-compiletest/ws/ctakes-temporal//data/rules/im.rul'.>
Exception: java.io.FileNotFoundException: <https://builds.apache.org/job/ctakes-trunk-compiletest/ws/ctakes-temporal/data/rules/dm.rul>
(No such file or directory)
**Error: problem of opening/reading file '<https://builds.apache.org/job/ctakes-trunk-compiletest/ws/ctakes-temporal//data/rules/dm.rul'.>
Exception: java.io.FileNotFoundException: <https://builds.apache.org/job/ctakes-trunk-compiletest/ws/ctakes-temporal/data/rules/dm.rul>
(No such file or directory)
**Error: problem of opening/reading file '<https://builds.apache.org/job/ctakes-trunk-compiletest/ws/ctakes-temporal//data/rules/dm.rul'.>
11 Jul 2016 15:56:07  INFO LvgCmdApiResourceImpl - cd <https://builds.apache.org/job/ctakes-trunk-compiletest/ws/ctakes-temporal>
11 Jul 2016 15:56:07  INFO TokenizerAnnotatorPTB - Initializing org.apache.ctakes.core.ae.TokenizerAnnotatorPTB
11 Jul 2016 15:56:07  INFO POSTagger - POS tagger model file: org/apache/ctakes/postagger/models/mayo-pos.zip
11 Jul 2016 15:56:08  INFO SentenceDetector - Starting processing.
11 Jul 2016 15:56:08  INFO TokenizerAnnotatorPTB - process(JCas) in org.apache.ctakes.core.ae.TokenizerAnnotatorPTB
11 Jul 2016 15:56:08  INFO LvgAnnotator - process(JCas)
11 Jul 2016 15:56:08  INFO ContextDependentTokenizerAnnotator - process(JCas)
11 Jul 2016 15:56:08  INFO POSTagger - process(JCas)
11 Jul 2016 15:56:08  INFO BackwardsTimeAnnotatorTest - Event: recently
11 Jul 2016 15:56:08  INFO BackwardsTimeAnnotatorTest - Event: 6 months ago
Tests run: 1, Failures: 0, Errors: 0, Skipped: 0, Time elapsed: 16.891 sec
Running org.apache.ctakes.temporal.ae.DocTimeRelAnnotatorTest
11 Jul 2016 15:56:11  INFO ClearNLPDependencyParserAE - using Morphy analysis? true
Loading configuration.
Loading feature templates.
Loading lexica.
Loading model:
........................................................................................
11 Jul 2016 15:56:23  INFO ContextDependentTokenizerAnnotator - Finite state machines loaded.
11 Jul 2016 15:56:23  INFO SentenceDetector - Sentence detector model file: org/apache/ctakes/core/sentdetect/sd-med-model.zip
11 Jul 2016 15:56:24  INFO LvgCmdApiResourceImpl - Loading NLM Norm and Lvg with config file
= /tmp/lvg.properties
11 Jul 2016 15:56:24  INFO LvgCmdApiResourceImpl -   config file absolute path = /tmp/lvg.properties
11 Jul 2016 15:56:24  INFO LvgCmdApiResourceImpl - cwd = <https://builds.apache.org/job/ctakes-trunk-compiletest/ws/ctakes-temporal>
11 Jul 2016 15:56:24  INFO LvgCmdApiResourceImpl - cd <https://builds.apache.org/job/ctakes-trunk-compiletest/ws/ctakes-temporal>
Exception: java.io.FileNotFoundException: <https://builds.apache.org/job/ctakes-trunk-compiletest/ws/ctakes-temporal/data/misc/stopWords.data>
(No such file or directory)
** Error: problem of opening/reading stop words file: '<https://builds.apache.org/job/ctakes-trunk-compiletest/ws/ctakes-temporal/data/misc/stopWords.data'.>
Exception: java.io.FileNotFoundException: <https://builds.apache.org/job/ctakes-trunk-compiletest/ws/ctakes-temporal/data/misc/nonInfoWords.data>
(No such file or directory)
** Error: problem of opening/reading non-Info words file: '<https://builds.apache.org/job/ctakes-trunk-compiletest/ws/ctakes-temporal/data/misc/nonInfoWords.data'.>
Exception: java.io.FileNotFoundException: <https://builds.apache.org/job/ctakes-trunk-compiletest/ws/ctakes-temporal/data/misc/conjunctionWord.data>
(No such file or directory)
** Error: problem of opening/reading conjunction words file: '<https://builds.apache.org/job/ctakes-trunk-compiletest/ws/ctakes-temporal/data/misc/conjunctionWord.data'.>
** ERR: problem of opening/reading diacritics file: '<https://builds.apache.org/job/ctakes-trunk-compiletest/ws/ctakes-temporal/data/Unicode/diacriticMap.data'.>
Exception: java.io.FileNotFoundException: <https://builds.apache.org/job/ctakes-trunk-compiletest/ws/ctakes-temporal/data/Unicode/diacriticMap.data>
(No such file or directory)
Exception: java.io.FileNotFoundException: <https://builds.apache.org/job/ctakes-trunk-compiletest/ws/ctakes-temporal/data/Unicode/ligatureMap.data>
(No such file or directory)
** Error: problem of opening/reading ligature file: '<https://builds.apache.org/job/ctakes-trunk-compiletest/ws/ctakes-temporal/data/Unicode/ligatureMap.data'.>
** Error: problem of opening/reading symbol synonym file: '<https://builds.apache.org/job/ctakes-trunk-compiletest/ws/ctakes-temporal/data/Unicode/synonymMap.data'.>
Exception: java.io.FileNotFoundException: <https://builds.apache.org/job/ctakes-trunk-compiletest/ws/ctakes-temporal/data/Unicode/synonymMap.data>
(No such file or directory)
**Error: problem of opening/reading file '<https://builds.apache.org/job/ctakes-trunk-compiletest/ws/ctakes-temporal/data/misc/removeS.data'.>
Exception: java.io.FileNotFoundException: <https://builds.apache.org/job/ctakes-trunk-compiletest/ws/ctakes-temporal/data/misc/removeS.data>
(No such file or directory)
** Error: problem of opening/reading Unicode symbol file: '<https://builds.apache.org/job/ctakes-trunk-compiletest/ws/ctakes-temporal/data/Unicode/symbolMap.data'.>
Exception: java.io.FileNotFoundException: <https://builds.apache.org/job/ctakes-trunk-compiletest/ws/ctakes-temporal/data/Unicode/symbolMap.data>
(No such file or directory)
** Error: problem of opening/reading Unicode file: '<https://builds.apache.org/job/ctakes-trunk-compiletest/ws/ctakes-temporal/data/Unicode/unicodeMap.data'.>
Exception: java.io.FileNotFoundException: <https://builds.apache.org/job/ctakes-trunk-compiletest/ws/ctakes-temporal/data/Unicode/unicodeMap.data>
(No such file or directory)
** Error: problem of opening/reading nonStripMap file: '<https://builds.apache.org/job/ctakes-trunk-compiletest/ws/ctakes-temporal/data/Unicode/nonStripMap.data'.>
Exception: java.io.FileNotFoundException: <https://builds.apache.org/job/ctakes-trunk-compiletest/ws/ctakes-temporal/data/Unicode/nonStripMap.data>
(No such file or directory)
Exception: java.io.FileNotFoundException: <https://builds.apache.org/job/ctakes-trunk-compiletest/ws/ctakes-temporal/data/rules/im.rul>
(No such file or directory)
**Error: problem of opening/reading file '<https://builds.apache.org/job/ctakes-trunk-compiletest/ws/ctakes-temporal//data/rules/im.rul'.>
Exception: java.io.FileNotFoundException: <https://builds.apache.org/job/ctakes-trunk-compiletest/ws/ctakes-temporal/data/rules/im.rul>
(No such file or directory)
**Error: problem of opening/reading file '<https://builds.apache.org/job/ctakes-trunk-compiletest/ws/ctakes-temporal//data/rules/im.rul'.>
Exception: java.io.FileNotFoundException: <https://builds.apache.org/job/ctakes-trunk-compiletest/ws/ctakes-temporal/data/rules/dm.rul>
(No such file or directory)
**Error: problem of opening/reading file '<https://builds.apache.org/job/ctakes-trunk-compiletest/ws/ctakes-temporal//data/rules/dm.rul'.>
Exception: java.io.FileNotFoundException: <https://builds.apache.org/job/ctakes-trunk-compiletest/ws/ctakes-temporal/data/rules/dm.rul>
(No such file or directory)
**Error: problem of opening/reading file '<https://builds.apache.org/job/ctakes-trunk-compiletest/ws/ctakes-temporal//data/rules/dm.rul'.>
Exception: java.io.FileNotFoundException: <https://builds.apache.org/job/ctakes-trunk-compiletest/ws/ctakes-temporal/data/misc/stopWords.data>
(No such file or directory)
** Error: problem of opening/reading stop words file: '<https://builds.apache.org/job/ctakes-trunk-compiletest/ws/ctakes-temporal/data/misc/stopWords.data'.>
Exception: java.io.FileNotFoundException: <https://builds.apache.org/job/ctakes-trunk-compiletest/ws/ctakes-temporal/data/misc/nonInfoWords.data>
(No such file or directory)
** Error: problem of opening/reading non-Info words file: '<https://builds.apache.org/job/ctakes-trunk-compiletest/ws/ctakes-temporal/data/misc/nonInfoWords.data'.>
Exception: java.io.FileNotFoundException: <https://builds.apache.org/job/ctakes-trunk-compiletest/ws/ctakes-temporal/data/misc/conjunctionWord.data>
(No such file or directory)
** Error: problem of opening/reading conjunction words file: '<https://builds.apache.org/job/ctakes-trunk-compiletest/ws/ctakes-temporal/data/misc/conjunctionWord.data'.>
** ERR: problem of opening/reading diacritics file: '<https://builds.apache.org/job/ctakes-trunk-compiletest/ws/ctakes-temporal/data/Unicode/diacriticMap.data'.>
Exception: java.io.FileNotFoundException: <https://builds.apache.org/job/ctakes-trunk-compiletest/ws/ctakes-temporal/data/Unicode/diacriticMap.data>
(No such file or directory)
Exception: java.io.FileNotFoundException: <https://builds.apache.org/job/ctakes-trunk-compiletest/ws/ctakes-temporal/data/Unicode/ligatureMap.data>
(No such file or directory)
** Error: problem of opening/reading ligature file: '<https://builds.apache.org/job/ctakes-trunk-compiletest/ws/ctakes-temporal/data/Unicode/ligatureMap.data'.>
** Error: problem of opening/reading symbol synonym file: '<https://builds.apache.org/job/ctakes-trunk-compiletest/ws/ctakes-temporal/data/Unicode/synonymMap.data'.>
Exception: java.io.FileNotFoundException: <https://builds.apache.org/job/ctakes-trunk-compiletest/ws/ctakes-temporal/data/Unicode/synonymMap.data>
(No such file or directory)
**Error: problem of opening/reading file '<https://builds.apache.org/job/ctakes-trunk-compiletest/ws/ctakes-temporal/data/misc/removeS.data'.>
Exception: java.io.FileNotFoundException: <https://builds.apache.org/job/ctakes-trunk-compiletest/ws/ctakes-temporal/data/misc/removeS.data>
(No such file or directory)
** Error: problem of opening/reading Unicode symbol file: '<https://builds.apache.org/job/ctakes-trunk-compiletest/ws/ctakes-temporal/data/Unicode/symbolMap.data'.>
Exception: java.io.FileNotFoundException: <https://builds.apache.org/job/ctakes-trunk-compiletest/ws/ctakes-temporal/data/Unicode/symbolMap.data>
(No such file or directory)
** Error: problem of opening/reading Unicode file: '<https://builds.apache.org/job/ctakes-trunk-compiletest/ws/ctakes-temporal/data/Unicode/unicodeMap.data'.>
Exception: java.io.FileNotFoundException: <https://builds.apache.org/job/ctakes-trunk-compiletest/ws/ctakes-temporal/data/Unicode/unicodeMap.data>
(No such file or directory)
** Error: problem of opening/reading nonStripMap file: '<https://builds.apache.org/job/ctakes-trunk-compiletest/ws/ctakes-temporal/data/Unicode/nonStripMap.data'.>
Exception: java.io.FileNotFoundException: <https://builds.apache.org/job/ctakes-trunk-compiletest/ws/ctakes-temporal/data/Unicode/nonStripMap.data>
(No such file or directory)
Exception: java.io.FileNotFoundException: <https://builds.apache.org/job/ctakes-trunk-compiletest/ws/ctakes-temporal/data/rules/im.rul>
(No such file or directory)
**Error: problem of opening/reading file '<https://builds.apache.org/job/ctakes-trunk-compiletest/ws/ctakes-temporal//data/rules/im.rul'.>
Exception: java.io.FileNotFoundException: <https://builds.apache.org/job/ctakes-trunk-compiletest/ws/ctakes-temporal/data/rules/im.rul>
(No such file or directory)
**Error: problem of opening/reading file '<https://builds.apache.org/job/ctakes-trunk-compiletest/ws/ctakes-temporal//data/rules/im.rul'.>
Exception: java.io.FileNotFoundException: <https://builds.apache.org/job/ctakes-trunk-compiletest/ws/ctakes-temporal/data/rules/dm.rul>
(No such file or directory)
**Error: problem of opening/reading file '<https://builds.apache.org/job/ctakes-trunk-compiletest/ws/ctakes-temporal//data/rules/dm.rul'.>
Exception: java.io.FileNotFoundException: <https://builds.apache.org/job/ctakes-trunk-compiletest/ws/ctakes-temporal/data/rules/dm.rul>
(No such file or directory)
**Error: problem of opening/reading file '<https://builds.apache.org/job/ctakes-trunk-compiletest/ws/ctakes-temporal//data/rules/dm.rul'.>
11 Jul 2016 15:56:24  INFO LvgCmdApiResourceImpl - cd <https://builds.apache.org/job/ctakes-trunk-compiletest/ws/ctakes-temporal>
11 Jul 2016 15:56:24  INFO TokenizerAnnotatorPTB - Initializing org.apache.ctakes.core.ae.TokenizerAnnotatorPTB
11 Jul 2016 15:56:24  INFO POSTagger - POS tagger model file: org/apache/ctakes/postagger/models/mayo-pos.zip
11 Jul 2016 15:56:24  INFO SentenceDetector - Starting processing.
11 Jul 2016 15:56:24  INFO TokenizerAnnotatorPTB - process(JCas) in org.apache.ctakes.core.ae.TokenizerAnnotatorPTB
11 Jul 2016 15:56:24  INFO LvgAnnotator - process(JCas)
11 Jul 2016 15:56:24  INFO ContextDependentTokenizerAnnotator - process(JCas)
11 Jul 2016 15:56:24  INFO POSTagger - process(JCas)
11 Jul 2016 15:56:24  INFO DocTimeRelAnnotatorTest - Event: old DocTimeRel:OVERLAP
11 Jul 2016 15:56:24  INFO DocTimeRelAnnotatorTest - Event: referred DocTimeRel:BEFORE
11 Jul 2016 15:56:24  INFO DocTimeRelAnnotatorTest - Event: diagnosed DocTimeRel:BEFORE
11 Jul 2016 15:56:24  INFO DocTimeRelAnnotatorTest - Event: cancer DocTimeRel:OVERLAP
11 Jul 2016 15:56:24  INFO DocTimeRelAnnotatorTest - Event: blood DocTimeRel:OVERLAP
Tests run: 1, Failures: 0, Errors: 0, Skipped: 0, Time elapsed: 16.239 sec
Running org.apache.ctakes.temporal.ae.EventTimeRelationAnnotatorTest
11 Jul 2016 15:56:27  INFO ClearNLPDependencyParserAE - using Morphy analysis? true
Loading configuration.
Loading feature templates.
Loading lexica.
Loading model:
.Killed

Results :

Tests run: 2, Failures: 0, Errors: 0, Skipped: 0

[JENKINS] Recording test results
[JENKINS] Archiving disabled
[INFO] ------------------------------------------------------------------------
[INFO] Reactor Summary:
[INFO] 
[INFO] Apache cTAKES ..................................... SUCCESS [6.419s]
[INFO] Apache cTAKES common type system .................. SUCCESS [18.062s]
[INFO] Apache cTAKES utils ............................... SUCCESS [5.530s]
[INFO] Apache cTAKES Resources core ...................... SUCCESS [2.354s]
[INFO] Apache cTAKES core ................................ SUCCESS [50.192s]
[INFO] Apache cTAKES Resources pos-tagger ................ SUCCESS [12.548s]
[INFO] Apache cTAKES part-of-speech tagger ............... SUCCESS [8.656s]
[INFO] Apache cTAKES Resources ctakes-chunker-res ........ SUCCESS [5.662s]
[INFO] Apache cTAKES chunker ............................. SUCCESS [8.955s]
[INFO] Apache cTAKES document preprocessor ............... SUCCESS [8.638s]
[INFO] Apache cTAKES Resources dictionary-lookup ......... SUCCESS [25.013s]
[INFO] Apache cTAKES dictionary lookup ................... SUCCESS [7.379s]
[INFO] Apache cTAKES context dependent tokenizer ......... SUCCESS [8.780s]
[INFO] Apache cTAKES Resources lvg ....................... SUCCESS [40.259s]
[INFO] Apache cTAKES LVG lexical tools ................... SUCCESS [4.858s]
[INFO] Apache cTAKES Resources ne-contexts ............... SUCCESS [2.284s]
[INFO] Apache cTAKES named entity contexts ............... SUCCESS [5.893s]
[INFO] Apache cTAKES Resources constituency-parser ....... SUCCESS [5.406s]
[INFO] Apache cTAKES Constituency Parser ................. SUCCESS [7.206s]
[INFO] Apache cTAKES Resources coreference ............... SUCCESS [3.782s]
[INFO] Apache cTAKES Resources relation-extractor ........ SUCCESS [1.336s]
[INFO] Apache cTAKES Resources dependency-parser ......... SUCCESS [7.342s]
[INFO] Apache cTAKES Dependency Parser ................... SUCCESS [28.125s]
[INFO] Apache cTAKES Relation Extractor .................. SUCCESS [11.897s]
[INFO] Apache cTAKES Resources assertion ................. SUCCESS [1.543s]
[INFO] Apache cTAKES Assertion ........................... SUCCESS [7.851s]
[INFO] Apache cTAKES Resources temporal .................. SUCCESS [7.848s]
[INFO] Apache cTAKES Resources dictionary-lookup-fast-res  SUCCESS [13.290s]
[INFO] Apache cTAKES dictionary lookup fast .............. SUCCESS [12.275s]
[INFO] Apache cTAKES Resources drug-ner .................. SUCCESS [1.371s]
[INFO] Apache cTAKES Drug NER ............................ SUCCESS [9.686s]
[INFO] Apache cTAKES Resources ctakes-ytex-res ........... SUCCESS [1.302s]
[INFO] Apache cTAKES YTEX ................................ SUCCESS [10.066s]
[INFO] Apache cTAKES YTEX UIMA ........................... SUCCESS [14.301s]
[INFO] Apache cTAKES ctakes-clinical-pipeline ............ SUCCESS [10.736s]
[INFO] Apache cTAKES Temporal Information Extraction ..... FAILURE [1:06.453s]
[INFO] Apache cTAKES CoReference Resolver ................ SKIPPED
[INFO] Apache cTAKES Resources side-effect ............... SKIPPED
[INFO] Apache cTAKES Side Effects ........................ SKIPPED
[INFO] Apache cTAKES Resources smoking-status ............ SKIPPED
[INFO] Apache cTAKES Smoking Status ...................... SKIPPED
[INFO] Apache cTAKES Resources assertion-zoner ........... SKIPPED
[INFO] Apache cTAKES Assertion's zoner ................... SKIPPED
[INFO] Apache cTAKES YTEX Web ............................ SKIPPED
[INFO] Apache cTAKES Distribution ........................ SKIPPED
[INFO] Apache cTAKES Regression-test ..................... SKIPPED
[INFO] Apache cTAKES template filler ..................... SKIPPED
[INFO] ctakes-examples ................................... SKIPPED
[INFO] ------------------------------------------------------------------------
[INFO] BUILD FAILURE
[INFO] ------------------------------------------------------------------------
[INFO] Total time: 8:36.221s
[INFO] Finished at: Mon Jul 11 15:56:35 UTC 2016
[INFO] Final Memory: 107M/580M
[INFO] ------------------------------------------------------------------------
[JENKINS] Archiving disabled
[JENKINS] Archiving disabled
[JENKINS] Archiving disabled
[JENKINS] Archiving disabled
[JENKINS] Archiving disabled
[JENKINS] Archiving disabled
[JENKINS] Archiving disabled
[JENKINS] Archiving disabled
[JENKINS] Archiving disabled
[JENKINS] Archiving disabled
[JENKINS] Archiving disabled
[JENKINS] Archiving disabled
[JENKINS] Archiving disabled
[JENKINS] Archiving disabled
[JENKINS] Archiving disabled
[JENKINS] Archiving disabled
[JENKINS] Archiving disabled
[JENKINS] Archiving disabled
[JENKINS] Archiving disabled
[JENKINS] Archiving disabled
[JENKINS] Archiving disabled
[JENKINS] Archiving disabled
[JENKINS] Archiving disabled
[JENKINS] Archiving disabled
[JENKINS] Archiving disabled
[JENKINS] Archiving disabled
[JENKINS] Archiving disabled
[JENKINS] Archiving disabled
[JENKINS] Archiving disabled
[JENKINS] Archiving disabled
[JENKINS] Archiving disabled
[JENKINS] Archiving disabled
[JENKINS] Archiving disabled
[JENKINS] Archiving disabled
[JENKINS] Archiving disabled
[JENKINS] Archiving disabled
[JENKINS] Archiving disabled
[JENKINS] Archiving disabled
[JENKINS] Archiving disabled
[JENKINS] Archiving disabled
[JENKINS] Archiving disabled
[JENKINS] Archiving disabled
[JENKINS] Archiving disabled
[JENKINS] Archiving disabled
[JENKINS] Archiving disabled
[JENKINS] Archiving disabled
[JENKINS] Archiving disabled
[JENKINS] Archiving disabled
Waiting for Jenkins to finish collecting data
[ERROR] Failed to execute goal org.apache.maven.plugins:maven-surefire-plugin:2.12.1:test
(default-test) on project ctakes-temporal: Execution default-test of goal org.apache.maven.plugins:maven-surefire-plugin:2.12.1:test
failed: The forked VM terminated without saying properly goodbye. VM crash or System.exit
called ? -> [Help 1]
[ERROR] 
[ERROR] To see the full stack trace of the errors, re-run Maven with the -e switch.
[ERROR] Re-run Maven using the -X switch to enable full debug logging.
[ERROR] 
[ERROR] For more information about the errors and possible solutions, please read the following
articles:
[ERROR] [Help 1] http://cwiki.apache.org/confluence/display/MAVEN/PluginExecutionException
[ERROR] 
[ERROR] After correcting the problems, you can resume the build with the command
[ERROR]   mvn <goals> -rf :ctakes-temporal
Sending e-mails to: notifications@ctakes.apache.org dmitriy.dligach@childrens.harvard.edu
channel stopped

Mime
View raw message