ctakes-notifications mailing list archives

Site index · List index
Message view « Date » · « Thread »
Top « Date » · « Thread »
From Apache Jenkins Server <jenk...@builds.apache.org>
Subject Build failed in Jenkins: ctakes-trunk-package #445
Date Tue, 26 Jul 2016 11:51:35 GMT
See <https://builds.apache.org/job/ctakes-trunk-package/445/changes>

Changes:

[clin] Check in the Region-based CNN implementation (python code) for event-time.

[clin] Check in the Region-based CNN implementation for event-time.

[clin] comment out the DocTimeRelAnnotatortest to see if Jenkis can build.

[tmill] Add model of selectional preferences for coref.

------------------------------------------
[...truncated 5360 lines...]
[INFO] 
[INFO] --- maven-remote-resources-plugin:1.4:process (default) @ ctakes-assertion-zoner ---
[INFO] 
[INFO] --- maven-resources-plugin:2.5:resources (default-resources) @ ctakes-assertion-zoner
---
[debug] execute contextualize
[INFO] Using 'UTF-8' encoding to copy filtered resources.
[INFO] Copying 1 resource
[INFO] Copying 3 resources
[INFO] 
[INFO] --- jcasgen-maven-plugin:2.5.0:generate (default) @ ctakes-assertion-zoner ---
[INFO] JCasGen: Found descriptor '<https://builds.apache.org/job/ctakes-trunk-package/ws/ctakes-assertion-zoner/src/main/resources/org/apache/ctakes/assertion/zoner/types/TypeSystem.xml'>
[INFO] JCasGen: Output going to '<https://builds.apache.org/job/ctakes-trunk-package/ws/ctakes-assertion-zoner/target/generated-sources/jcasgen'>
[INFO] JCasGen: Reading the XML TAE descriptor, and creating types, for xml input file '<https://builds.apache.org/job/ctakes-trunk-package/ws/ctakes-assertion-zoner/target/jcasgen/typesystem.xml'.>
[INFO] JCasGen: Creating: 'org.apache.ctakes.assertion.zoner.types.Heading'.
[INFO] JCasGen: Creating: 'org.apache.ctakes.assertion.zoner.types.Heading_Type'.
[INFO] JCasGen: Creating: 'org.apache.ctakes.assertion.zoner.types.Subzone'.
[INFO] JCasGen: Creating: 'org.apache.ctakes.assertion.zoner.types.Subzone_Type'.
[INFO] JCasGen: Creating: 'org.apache.ctakes.assertion.zoner.types.Zone'.
[INFO] JCasGen: Creating: 'org.apache.ctakes.assertion.zoner.types.Zone_Type'.
[INFO] 
[INFO] --- maven-compiler-plugin:2.4:compile (default-compile) @ ctakes-assertion-zoner ---
[INFO] Compiling 10 source files to <https://builds.apache.org/job/ctakes-trunk-package/ws/ctakes-assertion-zoner/target/classes>
[INFO] 
[INFO] --- maven-resources-plugin:2.5:testResources (default-testResources) @ ctakes-assertion-zoner
---
[debug] execute contextualize
[INFO] Using 'UTF-8' encoding to copy filtered resources.
[INFO] skip non existing resourceDirectory <https://builds.apache.org/job/ctakes-trunk-package/ws/ctakes-assertion-zoner/src/test/resources>
[INFO] Copying 3 resources
[INFO] 
[INFO] --- maven-compiler-plugin:2.4:testCompile (default-testCompile) @ ctakes-assertion-zoner
---
[INFO] No sources to compile
[INFO] 
[INFO] --- maven-surefire-plugin:2.12.1:test (default-test) @ ctakes-assertion-zoner ---
[INFO] Tests are skipped.
[INFO] 
[INFO] --- maven-jar-plugin:2.4:jar (default-jar) @ ctakes-assertion-zoner ---
[INFO] Building jar: <https://builds.apache.org/job/ctakes-trunk-package/ws/ctakes-assertion-zoner/target/ctakes-assertion-zoner-3.2.3-SNAPSHOT.jar>
[INFO] 
[INFO] --- maven-site-plugin:3.1:attach-descriptor (attach-descriptor) @ ctakes-assertion-zoner
---
[INFO] 
[INFO] --- maven-install-plugin:2.3.1:install (default-install) @ ctakes-assertion-zoner ---
[INFO] Installing <https://builds.apache.org/job/ctakes-trunk-package/ws/ctakes-assertion-zoner/target/ctakes-assertion-zoner-3.2.3-SNAPSHOT.jar>
to /home/jenkins/jenkins-slave/maven-repositories/0/org/apache/ctakes/ctakes-assertion-zoner/3.2.3-SNAPSHOT/ctakes-assertion-zoner-3.2.3-SNAPSHOT.jar
[INFO] Installing <https://builds.apache.org/job/ctakes-trunk-package/ws/ctakes-assertion-zoner/pom.xml>
to /home/jenkins/jenkins-slave/maven-repositories/0/org/apache/ctakes/ctakes-assertion-zoner/3.2.3-SNAPSHOT/ctakes-assertion-zoner-3.2.3-SNAPSHOT.pom
[INFO]                                                                         
[INFO] ------------------------------------------------------------------------
[INFO] Building Apache cTAKES YTEX Web 3.2.3-SNAPSHOT
[INFO] ------------------------------------------------------------------------
Downloading: http://oss.sonatype.org/content/groups/jetty/org/glassfish/javax.el/maven-metadata.xml
Downloading: http://repository.apache.org/snapshots/org/glassfish/javax.el/maven-metadata.xml
Downloading: http://repo.maven.apache.org/maven2/org/glassfish/javax.el/maven-metadata.xml
Downloading: https://maven.java.net/content/repositories/snapshots/org/glassfish/javax.el/maven-metadata.xml
Downloaded: http://repo.maven.apache.org/maven2/org/glassfish/javax.el/maven-metadata.xml
(847 B at 2.4 KB/sec)
Downloaded: https://maven.java.net/content/repositories/snapshots/org/glassfish/javax.el/maven-metadata.xml
(373 B at 0.2 KB/sec)
Downloading: http://oss.sonatype.org/content/groups/jetty/org/glassfish/javax.el/3.0.1-b06-SNAPSHOT/maven-metadata.xml
Downloading: http://repository.apache.org/snapshots/org/glassfish/javax.el/3.0.1-b06-SNAPSHOT/maven-metadata.xml
Downloading: https://maven.java.net/content/repositories/snapshots/org/glassfish/javax.el/3.0.1-b06-SNAPSHOT/maven-metadata.xml
[WARNING] Could not transfer metadata org.glassfish:javax.el:3.0.1-b06-SNAPSHOT/maven-metadata.xml
from/to Nexus (http://repository.apache.org/snapshots): Error transferring file: Server returned
HTTP response code: 502 for URL: http://repository.apache.org/snapshots/org/glassfish/javax.el/3.0.1-b06-SNAPSHOT/maven-metadata.xml
from http://repository.apache.org/snapshots/org/glassfish/javax.el/3.0.1-b06-SNAPSHOT/maven-metadata.xml
[WARNING] Failure to transfer org.glassfish:javax.el:3.0.1-b06-SNAPSHOT/maven-metadata.xml
from http://repository.apache.org/snapshots was cached in the local repository, resolution
will not be reattempted until the update interval of Nexus has elapsed or updates are forced.
Original error: Could not transfer metadata org.glassfish:javax.el:3.0.1-b06-SNAPSHOT/maven-metadata.xml
from/to Nexus (http://repository.apache.org/snapshots): Error transferring file: Server returned
HTTP response code: 502 for URL: http://repository.apache.org/snapshots/org/glassfish/javax.el/3.0.1-b06-SNAPSHOT/maven-metadata.xml
from http://repository.apache.org/snapshots/org/glassfish/javax.el/3.0.1-b06-SNAPSHOT/maven-metadata.xml
Downloading: http://repository.apache.org/snapshots/org/glassfish/javax.el/3.0.1-b06-SNAPSHOT/javax.el-3.0.1-b06-SNAPSHOT.pom
Downloading: http://oss.sonatype.org/content/groups/jetty/org/glassfish/javax.el/3.0.1-b06-SNAPSHOT/javax.el-3.0.1-b06-SNAPSHOT.pom
Downloading: https://maven.java.net/content/repositories/snapshots/org/glassfish/javax.el/3.0.1-b06-SNAPSHOT/javax.el-3.0.1-b06-SNAPSHOT.pom
Downloading: http://oss.sonatype.org/content/groups/jetty/org/glassfish/javax.el/3.0.1-b07-SNAPSHOT/maven-metadata.xml
Downloading: http://repository.apache.org/snapshots/org/glassfish/javax.el/3.0.1-b07-SNAPSHOT/maven-metadata.xml
Downloading: https://maven.java.net/content/repositories/snapshots/org/glassfish/javax.el/3.0.1-b07-SNAPSHOT/maven-metadata.xml
Downloading: http://repository.apache.org/snapshots/org/glassfish/javax.el/3.0.1-b07-SNAPSHOT/javax.el-3.0.1-b07-SNAPSHOT.pom
Downloading: http://oss.sonatype.org/content/groups/jetty/org/glassfish/javax.el/3.0.1-b07-SNAPSHOT/javax.el-3.0.1-b07-SNAPSHOT.pom
Downloading: https://maven.java.net/content/repositories/snapshots/org/glassfish/javax.el/3.0.1-b07-SNAPSHOT/javax.el-3.0.1-b07-SNAPSHOT.pom
[WARNING] The POM for org.glassfish:javax.el:jar:3.0.1-b07-SNAPSHOT is missing, no dependency
information available
Downloading: http://repository.apache.org/snapshots/org/glassfish/javax.el/3.0.1-b08-SNAPSHOT/maven-metadata.xml
Downloading: http://oss.sonatype.org/content/groups/jetty/org/glassfish/javax.el/3.0.1-b08-SNAPSHOT/maven-metadata.xml
Downloading: https://maven.java.net/content/repositories/snapshots/org/glassfish/javax.el/3.0.1-b08-SNAPSHOT/maven-metadata.xml
[WARNING] Could not transfer metadata org.glassfish:javax.el:3.0.1-b08-SNAPSHOT/maven-metadata.xml
from/to Nexus (http://repository.apache.org/snapshots): Error transferring file: Server returned
HTTP response code: 502 for URL: http://repository.apache.org/snapshots/org/glassfish/javax.el/3.0.1-b08-SNAPSHOT/maven-metadata.xml
from http://repository.apache.org/snapshots/org/glassfish/javax.el/3.0.1-b08-SNAPSHOT/maven-metadata.xml
[WARNING] Failure to transfer org.glassfish:javax.el:3.0.1-b08-SNAPSHOT/maven-metadata.xml
from http://repository.apache.org/snapshots was cached in the local repository, resolution
will not be reattempted until the update interval of Nexus has elapsed or updates are forced.
Original error: Could not transfer metadata org.glassfish:javax.el:3.0.1-b08-SNAPSHOT/maven-metadata.xml
from/to Nexus (http://repository.apache.org/snapshots): Error transferring file: Server returned
HTTP response code: 502 for URL: http://repository.apache.org/snapshots/org/glassfish/javax.el/3.0.1-b08-SNAPSHOT/maven-metadata.xml
from http://repository.apache.org/snapshots/org/glassfish/javax.el/3.0.1-b08-SNAPSHOT/maven-metadata.xml
Downloading: http://repository.apache.org/snapshots/org/glassfish/javax.el/3.0.1-b08-SNAPSHOT/javax.el-3.0.1-b08-SNAPSHOT.pom
Downloading: http://oss.sonatype.org/content/groups/jetty/org/glassfish/javax.el/3.0.1-b08-SNAPSHOT/javax.el-3.0.1-b08-SNAPSHOT.pom
Downloading: https://maven.java.net/content/repositories/snapshots/org/glassfish/javax.el/3.0.1-b08-SNAPSHOT/javax.el-3.0.1-b08-SNAPSHOT.pom
[WARNING] The POM for org.glassfish:javax.el:jar:3.0.1-b08-SNAPSHOT is missing, no dependency
information available
[INFO] ------------------------------------------------------------------------
[INFO] Reactor Summary:
[INFO] 
[INFO] Apache cTAKES ..................................... SUCCESS [5.949s]
[INFO] Apache cTAKES common type system .................. SUCCESS [9.671s]
[INFO] Apache cTAKES utils ............................... SUCCESS [2.951s]
[INFO] Apache cTAKES Resources core ...................... SUCCESS [0.533s]
[INFO] Apache cTAKES core ................................ SUCCESS [6.304s]
[INFO] Apache cTAKES Resources pos-tagger ................ SUCCESS [1.950s]
[INFO] Apache cTAKES part-of-speech tagger ............... SUCCESS [1.945s]
[INFO] Apache cTAKES Resources ctakes-chunker-res ........ SUCCESS [2.267s]
[INFO] Apache cTAKES chunker ............................. SUCCESS [1.877s]
[INFO] Apache cTAKES document preprocessor ............... SUCCESS [1.443s]
[INFO] Apache cTAKES Resources dictionary-lookup ......... SUCCESS [14.867s]
[INFO] Apache cTAKES dictionary lookup ................... SUCCESS [2.742s]
[INFO] Apache cTAKES context dependent tokenizer ......... SUCCESS [1.157s]
[INFO] Apache cTAKES Resources lvg ....................... SUCCESS [38.773s]
[INFO] Apache cTAKES LVG lexical tools ................... SUCCESS [6.212s]
[INFO] Apache cTAKES Resources ne-contexts ............... SUCCESS [0.377s]
[INFO] Apache cTAKES named entity contexts ............... SUCCESS [0.841s]
[INFO] Apache cTAKES Resources constituency-parser ....... SUCCESS [3.047s]
[INFO] Apache cTAKES Constituency Parser ................. SUCCESS [1.050s]
[INFO] Apache cTAKES Resources coreference ............... SUCCESS [5.559s]
[INFO] Apache cTAKES Resources relation-extractor ........ SUCCESS [0.589s]
[INFO] Apache cTAKES Resources dependency-parser ......... SUCCESS [26.497s]
[INFO] Apache cTAKES Dependency Parser ................... SUCCESS [4.355s]
[INFO] Apache cTAKES Relation Extractor .................. SUCCESS [8.154s]
[INFO] Apache cTAKES Resources assertion ................. SUCCESS [3.481s]
[INFO] Apache cTAKES Assertion ........................... SUCCESS [6.642s]
[INFO] Apache cTAKES Resources temporal .................. SUCCESS [1.651s]
[INFO] Apache cTAKES Resources dictionary-lookup-fast-res  SUCCESS [1.258s]
[INFO] Apache cTAKES dictionary lookup fast .............. SUCCESS [1.226s]
[INFO] Apache cTAKES Resources drug-ner .................. SUCCESS [0.509s]
[INFO] Apache cTAKES Drug NER ............................ SUCCESS [4.985s]
[INFO] Apache cTAKES Resources ctakes-ytex-res ........... SUCCESS [0.692s]
[INFO] Apache cTAKES YTEX ................................ SUCCESS [43.985s]
[INFO] Apache cTAKES YTEX UIMA ........................... SUCCESS [37.694s]
[INFO] Apache cTAKES ctakes-clinical-pipeline ............ SUCCESS [9.420s]
[INFO] Apache cTAKES Temporal Information Extraction ..... SUCCESS [55.305s]
[INFO] Apache cTAKES CoReference Resolver ................ SUCCESS [8.071s]
[INFO] Apache cTAKES Resources side-effect ............... SUCCESS [0.645s]
[INFO] Apache cTAKES Side Effects ........................ SUCCESS [5.125s]
[INFO] Apache cTAKES Resources smoking-status ............ SUCCESS [0.480s]
[INFO] Apache cTAKES Smoking Status ...................... SUCCESS [5.461s]
[INFO] Apache cTAKES Resources assertion-zoner ........... SUCCESS [0.480s]
[INFO] Apache cTAKES Assertion's zoner ................... SUCCESS [0.912s]
[INFO] Apache cTAKES YTEX Web ............................ FAILURE [18.432s]
[INFO] Apache cTAKES Distribution ........................ SKIPPED
[INFO] Apache cTAKES Regression-test ..................... SKIPPED
[INFO] Apache cTAKES template filler ..................... SKIPPED
[INFO] ctakes-examples ................................... SKIPPED
[INFO] ------------------------------------------------------------------------
[INFO] BUILD FAILURE
[INFO] ------------------------------------------------------------------------
[INFO] Total time: 6:09.929s
[INFO] Finished at: Tue Jul 26 11:49:26 UTC 2016
[INFO] Final Memory: 117M/924M
[INFO] ------------------------------------------------------------------------
Waiting for Jenkins to finish collecting data
[ERROR] Failed to execute goal on project ctakes-ytex-web: Could not resolve dependencies
for project org.apache.ctakes:ctakes-ytex-web:war:3.2.3-SNAPSHOT: Failed to collect dependencies
for [org.apache.ctakes:ctakes-ytex:jar:3.2.3-SNAPSHOT (compile), org.apache.ctakes:ctakes-ytex-res:jar:3.2.3-SNAPSHOT
(compile), org.springframework:spring-web:jar:3.1.2.RELEASE (compile), com.sun.faces:jsf-api:jar:2.1.3
(compile), com.sun.faces:jsf-impl:jar:2.1.3 (compile), org.icefaces:icefaces:jar:2.0.2 (compile),
org.icefaces:icefaces-ace:jar:2.0.2 (compile), org.icefaces:icefaces-compat:jar:2.0.2 (compile),
backport-util-concurrent:backport-util-concurrent:jar:3.1 (compile), net.sf.jsr107cache:jsr107cache:jar:1.0
(compile), org.apache.cxf:cxf-rt-frontend-jaxws:jar:2.7.8 (compile), org.apache.cxf:cxf-rt-frontend-jaxrs:jar:2.7.8
(compile), org.apache.cxf:cxf-rt-transports-http:jar:2.7.8 (compile), org.apache.cxf:cxf-rt-databinding-aegis:jar:2.7.8
(compile), javax.servlet.jsp:jsp-api:jar:2.2 (compile), javax.servlet:jstl:jar:1.2 (compile),
commons-el:commons-el:jar:1.0 (compile), org.glassfish.web:el-impl:jar:2.2 (compile), org.eclipse.jetty:jetty-server:jar:9.1.0.M0
(compile), org.eclipse.jetty:jetty-runner:jar:9.1.0.M0 (compile), org.eclipse.jetty:jetty-jsp:jar:9.1.0.M0
(compile)]: Failed to read artifact descriptor for org.glassfish:javax.el:jar:3.0.1-b06-SNAPSHOT:
Could not transfer artifact org.glassfish:javax.el:pom:3.0.1-b06-SNAPSHOT from/to Nexus (http://repository.apache.org/snapshots):
Error transferring file: Server returned HTTP response code: 502 for URL: http://repository.apache.org/snapshots/org/glassfish/javax.el/3.0.1-b06-SNAPSHOT/javax.el-3.0.1-b06-SNAPSHOT.pom
from http://repository.apache.org/snapshots/org/glassfish/javax.el/3.0.1-b06-SNAPSHOT/javax.el-3.0.1-b06-SNAPSHOT.pom
-> [Help 1]
[ERROR] 
[ERROR] To see the full stack trace of the errors, re-run Maven with the -e switch.
[ERROR] Re-run Maven using the -X switch to enable full debug logging.
[ERROR] 
[ERROR] For more information about the errors and possible solutions, please read the following
articles:
[ERROR] [Help 1] http://cwiki.apache.org/confluence/display/MAVEN/DependencyResolutionException
[ERROR] 
[ERROR] After correcting the problems, you can resume the build with the command
[ERROR]   mvn <goals> -rf :ctakes-ytex-web
[JENKINS] Archiving <https://builds.apache.org/job/ctakes-trunk-package/ws/ctakes-core/pom.xml>
to org.apache.ctakes/ctakes-core/3.2.3-SNAPSHOT/ctakes-core-3.2.3-SNAPSHOT.pom
[JENKINS] Archiving <https://builds.apache.org/job/ctakes-trunk-package/ws/ctakes-core/target/ctakes-core-3.2.3-SNAPSHOT.jar>
to org.apache.ctakes/ctakes-core/3.2.3-SNAPSHOT/ctakes-core-3.2.3-SNAPSHOT.jar
[JENKINS] Archiving <https://builds.apache.org/job/ctakes-trunk-package/ws/ctakes-ytex-res/pom.xml>
to org.apache.ctakes/ctakes-ytex-res/3.2.3-SNAPSHOT/ctakes-ytex-res-3.2.3-SNAPSHOT.pom
[JENKINS] Archiving <https://builds.apache.org/job/ctakes-trunk-package/ws/ctakes-ytex-res/target/ctakes-ytex-res-3.2.3-SNAPSHOT.jar>
to org.apache.ctakes/ctakes-ytex-res/3.2.3-SNAPSHOT/ctakes-ytex-res-3.2.3-SNAPSHOT.jar
Compressed 153.66 KB of artifacts by 20.8% relative to #444
[JENKINS] Archiving <https://builds.apache.org/job/ctakes-trunk-package/ws/ctakes-coreference/pom.xml>
to org.apache.ctakes/ctakes-coreference/3.2.3-SNAPSHOT/ctakes-coreference-3.2.3-SNAPSHOT.pom
[JENKINS] Archiving <https://builds.apache.org/job/ctakes-trunk-package/ws/ctakes-coreference/target/ctakes-coreference-3.2.3-SNAPSHOT.jar>
to org.apache.ctakes/ctakes-coreference/3.2.3-SNAPSHOT/ctakes-coreference-3.2.3-SNAPSHOT.jar
[JENKINS] Archiving <https://builds.apache.org/job/ctakes-trunk-package/ws/ctakes-dependency-parser/pom.xml>
to org.apache.ctakes/ctakes-dependency-parser/3.2.3-SNAPSHOT/ctakes-dependency-parser-3.2.3-SNAPSHOT.pom
[JENKINS] Archiving <https://builds.apache.org/job/ctakes-trunk-package/ws/ctakes-dependency-parser/target/ctakes-dependency-parser-3.2.3-SNAPSHOT.jar>
to org.apache.ctakes/ctakes-dependency-parser/3.2.3-SNAPSHOT/ctakes-dependency-parser-3.2.3-SNAPSHOT.jar
[JENKINS] Archiving <https://builds.apache.org/job/ctakes-trunk-package/ws/ctakes-regression-test/pom.xml>
to org.apache.ctakes/ctakes-regression-test/3.2.3-SNAPSHOT/ctakes-regression-test-3.2.3-SNAPSHOT.pom
[JENKINS] Archiving <https://builds.apache.org/job/ctakes-trunk-package/ws/ctakes-ytex-uima/pom.xml>
to org.apache.ctakes/ctakes-ytex-uima/3.2.3-SNAPSHOT/ctakes-ytex-uima-3.2.3-SNAPSHOT.pom
[JENKINS] Archiving <https://builds.apache.org/job/ctakes-trunk-package/ws/ctakes-ytex-uima/target/ctakes-ytex-uima-3.2.3-SNAPSHOT.jar>
to org.apache.ctakes/ctakes-ytex-uima/3.2.3-SNAPSHOT/ctakes-ytex-uima-3.2.3-SNAPSHOT.jar
[JENKINS] Archiving <https://builds.apache.org/job/ctakes-trunk-package/ws/ctakes-dictionary-lookup-res/pom.xml>
to org.apache.ctakes/ctakes-dictionary-lookup-res/3.2.3-SNAPSHOT/ctakes-dictionary-lookup-res-3.2.3-SNAPSHOT.pom
[JENKINS] Archiving <https://builds.apache.org/job/ctakes-trunk-package/ws/ctakes-dictionary-lookup-res/target/ctakes-dictionary-lookup-res-3.2.3-SNAPSHOT.jar>
to org.apache.ctakes/ctakes-dictionary-lookup-res/3.2.3-SNAPSHOT/ctakes-dictionary-lookup-res-3.2.3-SNAPSHOT.jar
[JENKINS] Archiving <https://builds.apache.org/job/ctakes-trunk-package/ws/ctakes-ne-contexts/pom.xml>
to org.apache.ctakes/ctakes-ne-contexts/3.2.3-SNAPSHOT/ctakes-ne-contexts-3.2.3-SNAPSHOT.pom
[JENKINS] Archiving <https://builds.apache.org/job/ctakes-trunk-package/ws/ctakes-ne-contexts/target/ctakes-ne-contexts-3.2.3-SNAPSHOT.jar>
to org.apache.ctakes/ctakes-ne-contexts/3.2.3-SNAPSHOT/ctakes-ne-contexts-3.2.3-SNAPSHOT.jar
[JENKINS] Archiving <https://builds.apache.org/job/ctakes-trunk-package/ws/ctakes-drug-ner/pom.xml>
to org.apache.ctakes/ctakes-drug-ner/3.2.3-SNAPSHOT/ctakes-drug-ner-3.2.3-SNAPSHOT.pom
[JENKINS] Archiving <https://builds.apache.org/job/ctakes-trunk-package/ws/ctakes-drug-ner/target/ctakes-drug-ner-3.2.3-SNAPSHOT.jar>
to org.apache.ctakes/ctakes-drug-ner/3.2.3-SNAPSHOT/ctakes-drug-ner-3.2.3-SNAPSHOT.jar
[JENKINS] Archiving <https://builds.apache.org/job/ctakes-trunk-package/ws/ctakes-preprocessor/pom.xml>
to org.apache.ctakes/ctakes-preprocessor/3.2.3-SNAPSHOT/ctakes-preprocessor-3.2.3-SNAPSHOT.pom
[JENKINS] Archiving <https://builds.apache.org/job/ctakes-trunk-package/ws/ctakes-preprocessor/target/ctakes-preprocessor-3.2.3-SNAPSHOT.jar>
to org.apache.ctakes/ctakes-preprocessor/3.2.3-SNAPSHOT/ctakes-preprocessor-3.2.3-SNAPSHOT.jar
[JENKINS] Archiving <https://builds.apache.org/job/ctakes-trunk-package/ws/ctakes-smoking-status/pom.xml>
to org.apache.ctakes/ctakes-smoking-status/3.2.3-SNAPSHOT/ctakes-smoking-status-3.2.3-SNAPSHOT.pom
[JENKINS] Archiving <https://builds.apache.org/job/ctakes-trunk-package/ws/ctakes-smoking-status/target/ctakes-smoking-status-3.2.3-SNAPSHOT.jar>
to org.apache.ctakes/ctakes-smoking-status/3.2.3-SNAPSHOT/ctakes-smoking-status-3.2.3-SNAPSHOT.jar
[JENKINS] Archiving <https://builds.apache.org/job/ctakes-trunk-package/ws/ctakes-clinical-pipeline/pom.xml>
to org.apache.ctakes/ctakes-clinical-pipeline/3.2.3-SNAPSHOT/ctakes-clinical-pipeline-3.2.3-SNAPSHOT.pom
[JENKINS] Archiving <https://builds.apache.org/job/ctakes-trunk-package/ws/ctakes-clinical-pipeline/target/ctakes-clinical-pipeline-3.2.3-SNAPSHOT.jar>
to org.apache.ctakes/ctakes-clinical-pipeline/3.2.3-SNAPSHOT/ctakes-clinical-pipeline-3.2.3-SNAPSHOT.jar
[JENKINS] Archiving <https://builds.apache.org/job/ctakes-trunk-package/ws/ctakes-chunker/pom.xml>
to org.apache.ctakes/ctakes-chunker/3.2.3-SNAPSHOT/ctakes-chunker-3.2.3-SNAPSHOT.pom
[JENKINS] Archiving <https://builds.apache.org/job/ctakes-trunk-package/ws/ctakes-chunker/target/ctakes-chunker-3.2.3-SNAPSHOT.jar>
to org.apache.ctakes/ctakes-chunker/3.2.3-SNAPSHOT/ctakes-chunker-3.2.3-SNAPSHOT.jar
[JENKINS] Archiving <https://builds.apache.org/job/ctakes-trunk-package/ws/ctakes-temporal/pom.xml>
to org.apache.ctakes/ctakes-temporal/3.2.3-SNAPSHOT/ctakes-temporal-3.2.3-SNAPSHOT.pom
[JENKINS] Archiving <https://builds.apache.org/job/ctakes-trunk-package/ws/ctakes-temporal/target/ctakes-temporal-3.2.3-SNAPSHOT.jar>
to org.apache.ctakes/ctakes-temporal/3.2.3-SNAPSHOT/ctakes-temporal-3.2.3-SNAPSHOT.jar
Compressed 91.86 MB of artifacts by 98.9% relative to #444
[JENKINS] Archiving <https://builds.apache.org/job/ctakes-trunk-package/ws/ctakes-smoking-status-res/pom.xml>
to org.apache.ctakes/ctakes-smoking-status-res/3.2.3-SNAPSHOT/ctakes-smoking-status-res-3.2.3-SNAPSHOT.pom
[JENKINS] Archiving <https://builds.apache.org/job/ctakes-trunk-package/ws/ctakes-smoking-status-res/target/ctakes-smoking-status-res-3.2.3-SNAPSHOT.jar>
to org.apache.ctakes/ctakes-smoking-status-res/3.2.3-SNAPSHOT/ctakes-smoking-status-res-3.2.3-SNAPSHOT.jar
[JENKINS] Archiving <https://builds.apache.org/job/ctakes-trunk-package/ws/ctakes-coreference-res/pom.xml>
to org.apache.ctakes/ctakes-coreference-res/3.2.3-SNAPSHOT/ctakes-coreference-res-3.2.3-SNAPSHOT.pom
[JENKINS] Archiving <https://builds.apache.org/job/ctakes-trunk-package/ws/ctakes-coreference-res/target/ctakes-coreference-res-3.2.3-SNAPSHOT.jar>
to org.apache.ctakes/ctakes-coreference-res/3.2.3-SNAPSHOT/ctakes-coreference-res-3.2.3-SNAPSHOT.jar
Compressed 23.90 MB of artifacts by 93.5% relative to #444
[JENKINS] Archiving <https://builds.apache.org/job/ctakes-trunk-package/ws/ctakes-core-res/pom.xml>
to org.apache.ctakes/ctakes-core-res/3.2.3-SNAPSHOT/ctakes-core-res-3.2.3-SNAPSHOT.pom
[JENKINS] Archiving <https://builds.apache.org/job/ctakes-trunk-package/ws/ctakes-core-res/target/ctakes-core-res-3.2.3-SNAPSHOT.jar>
to org.apache.ctakes/ctakes-core-res/3.2.3-SNAPSHOT/ctakes-core-res-3.2.3-SNAPSHOT.jar
Compressed 644.62 KB of artifacts by 79.4% relative to #444
[JENKINS] Archiving <https://builds.apache.org/job/ctakes-trunk-package/ws/pom.xml>
to org.apache.ctakes/ctakes/3.2.3-SNAPSHOT/ctakes-3.2.3-SNAPSHOT.pom
[JENKINS] Archiving <https://builds.apache.org/job/ctakes-trunk-package/ws/ctakes-dictionary-lookup/pom.xml>
to org.apache.ctakes/ctakes-dictionary-lookup/3.2.3-SNAPSHOT/ctakes-dictionary-lookup-3.2.3-SNAPSHOT.pom
[JENKINS] Archiving <https://builds.apache.org/job/ctakes-trunk-package/ws/ctakes-dictionary-lookup/target/ctakes-dictionary-lookup-3.2.3-SNAPSHOT.jar>
to org.apache.ctakes/ctakes-dictionary-lookup/3.2.3-SNAPSHOT/ctakes-dictionary-lookup-3.2.3-SNAPSHOT.jar
[JENKINS] Archiving <https://builds.apache.org/job/ctakes-trunk-package/ws/ctakes-dictionary-lookup-fast/pom.xml>
to org.apache.ctakes/ctakes-dictionary-lookup-fast/3.2.3-SNAPSHOT/ctakes-dictionary-lookup-fast-3.2.3-SNAPSHOT.pom
[JENKINS] Archiving <https://builds.apache.org/job/ctakes-trunk-package/ws/ctakes-dictionary-lookup-fast/target/ctakes-dictionary-lookup-fast-3.2.3-SNAPSHOT.jar>
to org.apache.ctakes/ctakes-dictionary-lookup-fast/3.2.3-SNAPSHOT/ctakes-dictionary-lookup-fast-3.2.3-SNAPSHOT.jar
[JENKINS] Archiving <https://builds.apache.org/job/ctakes-trunk-package/ws/ctakes-assertion-zoner-res/pom.xml>
to org.apache.ctakes/ctakes-assertion-zoner-res/3.2.3-SNAPSHOT/ctakes-assertion-zoner-res-3.2.3-SNAPSHOT.pom
[JENKINS] Archiving <https://builds.apache.org/job/ctakes-trunk-package/ws/ctakes-assertion-zoner-res/target/ctakes-assertion-zoner-res-3.2.3-SNAPSHOT.jar>
to org.apache.ctakes/ctakes-assertion-zoner-res/3.2.3-SNAPSHOT/ctakes-assertion-zoner-res-3.2.3-SNAPSHOT.jar
[JENKINS] Archiving <https://builds.apache.org/job/ctakes-trunk-package/ws/ctakes-examples/pom.xml>
to org.apache.ctakes/ctakes-examples/3.2.3-SNAPSHOT/ctakes-examples-3.2.3-SNAPSHOT.pom
[JENKINS] Archiving <https://builds.apache.org/job/ctakes-trunk-package/ws/ctakes-utils/pom.xml>
to org.apache.ctakes/ctakes-utils/3.2.3-SNAPSHOT/ctakes-utils-3.2.3-SNAPSHOT.pom
[JENKINS] Archiving <https://builds.apache.org/job/ctakes-trunk-package/ws/ctakes-utils/target/ctakes-utils-3.2.3-SNAPSHOT.jar>
to org.apache.ctakes/ctakes-utils/3.2.3-SNAPSHOT/ctakes-utils-3.2.3-SNAPSHOT.jar
[JENKINS] Archiving <https://builds.apache.org/job/ctakes-trunk-package/ws/ctakes-side-effect-res/pom.xml>
to org.apache.ctakes/ctakes-side-effect-res/3.2.3-SNAPSHOT/ctakes-side-effect-res-3.2.3-SNAPSHOT.pom
[JENKINS] Archiving <https://builds.apache.org/job/ctakes-trunk-package/ws/ctakes-side-effect-res/target/ctakes-side-effect-res-3.2.3-SNAPSHOT.jar>
to org.apache.ctakes/ctakes-side-effect-res/3.2.3-SNAPSHOT/ctakes-side-effect-res-3.2.3-SNAPSHOT.jar
[JENKINS] Archiving <https://builds.apache.org/job/ctakes-trunk-package/ws/ctakes-constituency-parser-res/pom.xml>
to org.apache.ctakes/ctakes-constituency-parser-res/3.2.3-SNAPSHOT/ctakes-constituency-parser-res-3.2.3-SNAPSHOT.pom
[JENKINS] Archiving <https://builds.apache.org/job/ctakes-trunk-package/ws/ctakes-constituency-parser-res/target/ctakes-constituency-parser-res-3.2.3-SNAPSHOT.jar>
to org.apache.ctakes/ctakes-constituency-parser-res/3.2.3-SNAPSHOT/ctakes-constituency-parser-res-3.2.3-SNAPSHOT.jar
Compressed 32.15 MB of artifacts by 99.6% relative to #444
[JENKINS] Archiving <https://builds.apache.org/job/ctakes-trunk-package/ws/ctakes-lvg/pom.xml>
to org.apache.ctakes/ctakes-lvg/3.2.3-SNAPSHOT/ctakes-lvg-3.2.3-SNAPSHOT.pom
[JENKINS] Archiving <https://builds.apache.org/job/ctakes-trunk-package/ws/ctakes-lvg/target/ctakes-lvg-3.2.3-SNAPSHOT.jar>
to org.apache.ctakes/ctakes-lvg/3.2.3-SNAPSHOT/ctakes-lvg-3.2.3-SNAPSHOT.jar
[JENKINS] Archiving <https://builds.apache.org/job/ctakes-trunk-package/ws/ctakes-ytex-web/pom.xml>
to org.apache.ctakes/ctakes-ytex-web/3.2.3-SNAPSHOT/ctakes-ytex-web-3.2.3-SNAPSHOT.pom
[JENKINS] Archiving <https://builds.apache.org/job/ctakes-trunk-package/ws/ctakes-lvg-res/pom.xml>
to org.apache.ctakes/ctakes-lvg-res/3.2.3-SNAPSHOT/ctakes-lvg-res-3.2.3-SNAPSHOT.pom
[JENKINS] Archiving <https://builds.apache.org/job/ctakes-trunk-package/ws/ctakes-lvg-res/target/ctakes-lvg-res-3.2.3-SNAPSHOT.jar>
to org.apache.ctakes/ctakes-lvg-res/3.2.3-SNAPSHOT/ctakes-lvg-res-3.2.3-SNAPSHOT.jar
[JENKINS] Archiving <https://builds.apache.org/job/ctakes-trunk-package/ws/ctakes-assertion-res/pom.xml>
to org.apache.ctakes/ctakes-assertion-res/3.2.3-SNAPSHOT/ctakes-assertion-res-3.2.3-SNAPSHOT.pom
[JENKINS] Archiving <https://builds.apache.org/job/ctakes-trunk-package/ws/ctakes-assertion-res/target/ctakes-assertion-res-3.2.3-SNAPSHOT.jar>
to org.apache.ctakes/ctakes-assertion-res/3.2.3-SNAPSHOT/ctakes-assertion-res-3.2.3-SNAPSHOT.jar
Compressed 11.18 MB of artifacts by 95.6% relative to #444
[JENKINS] Archiving <https://builds.apache.org/job/ctakes-trunk-package/ws/ctakes-dictionary-lookup-fast-res/pom.xml>
to org.apache.ctakes/ctakes-dictionary-lookup-fast-res/3.2.3-SNAPSHOT/ctakes-dictionary-lookup-fast-res-3.2.3-SNAPSHOT.pom
[JENKINS] Archiving <https://builds.apache.org/job/ctakes-trunk-package/ws/ctakes-dictionary-lookup-fast-res/target/ctakes-dictionary-lookup-fast-res-3.2.3-SNAPSHOT.jar>
to org.apache.ctakes/ctakes-dictionary-lookup-fast-res/3.2.3-SNAPSHOT/ctakes-dictionary-lookup-fast-res-3.2.3-SNAPSHOT.jar
[JENKINS] Archiving <https://builds.apache.org/job/ctakes-trunk-package/ws/ctakes-dependency-parser-res/pom.xml>
to org.apache.ctakes/ctakes-dependency-parser-res/3.2.3-SNAPSHOT/ctakes-dependency-parser-res-3.2.3-SNAPSHOT.pom
[JENKINS] Archiving <https://builds.apache.org/job/ctakes-trunk-package/ws/ctakes-dependency-parser-res/target/ctakes-dependency-parser-res-3.2.3-SNAPSHOT.jar>
to org.apache.ctakes/ctakes-dependency-parser-res/3.2.3-SNAPSHOT/ctakes-dependency-parser-res-3.2.3-SNAPSHOT.jar
Compressed 259.20 MB of artifacts by 99.9% relative to #444
[JENKINS] Archiving <https://builds.apache.org/job/ctakes-trunk-package/ws/ctakes-assertion/pom.xml>
to org.apache.ctakes/ctakes-assertion/3.2.3-SNAPSHOT/ctakes-assertion-3.2.3-SNAPSHOT.pom
[JENKINS] Archiving <https://builds.apache.org/job/ctakes-trunk-package/ws/ctakes-assertion/target/ctakes-assertion-3.2.3-SNAPSHOT.jar>
to org.apache.ctakes/ctakes-assertion/3.2.3-SNAPSHOT/ctakes-assertion-3.2.3-SNAPSHOT.jar
[JENKINS] Archiving <https://builds.apache.org/job/ctakes-trunk-package/ws/ctakes-temporal-res/pom.xml>
to org.apache.ctakes/ctakes-temporal-res/3.2.3-SNAPSHOT/ctakes-temporal-res-3.2.3-SNAPSHOT.pom
[JENKINS] Archiving <https://builds.apache.org/job/ctakes-trunk-package/ws/ctakes-temporal-res/target/ctakes-temporal-res-3.2.3-SNAPSHOT.jar>
to org.apache.ctakes/ctakes-temporal-res/3.2.3-SNAPSHOT/ctakes-temporal-res-3.2.3-SNAPSHOT.jar
Compressed 6.86 MB of artifacts by 97.1% relative to #444
[JENKINS] Archiving <https://builds.apache.org/job/ctakes-trunk-package/ws/ctakes-relation-extractor-res/pom.xml>
to org.apache.ctakes/ctakes-relation-extractor-res/3.2.3-SNAPSHOT/ctakes-relation-extractor-res-3.2.3-SNAPSHOT.pom
[JENKINS] Archiving <https://builds.apache.org/job/ctakes-trunk-package/ws/ctakes-relation-extractor-res/target/ctakes-relation-extractor-res-3.2.3-SNAPSHOT.jar>
to org.apache.ctakes/ctakes-relation-extractor-res/3.2.3-SNAPSHOT/ctakes-relation-extractor-res-3.2.3-SNAPSHOT.jar
Compressed 1.45 MB of artifacts by 92.7% relative to #444
[JENKINS] Archiving <https://builds.apache.org/job/ctakes-trunk-package/ws/ctakes-pos-tagger/pom.xml>
to org.apache.ctakes/ctakes-pos-tagger/3.2.3-SNAPSHOT/ctakes-pos-tagger-3.2.3-SNAPSHOT.pom
[JENKINS] Archiving <https://builds.apache.org/job/ctakes-trunk-package/ws/ctakes-pos-tagger/target/ctakes-pos-tagger-3.2.3-SNAPSHOT.jar>
to org.apache.ctakes/ctakes-pos-tagger/3.2.3-SNAPSHOT/ctakes-pos-tagger-3.2.3-SNAPSHOT.jar
[JENKINS] Archiving <https://builds.apache.org/job/ctakes-trunk-package/ws/ctakes-relation-extractor/pom.xml>
to org.apache.ctakes/ctakes-relation-extractor/3.2.3-SNAPSHOT/ctakes-relation-extractor-3.2.3-SNAPSHOT.pom
[JENKINS] Archiving <https://builds.apache.org/job/ctakes-trunk-package/ws/ctakes-relation-extractor/target/ctakes-relation-extractor-3.2.3-SNAPSHOT.jar>
to org.apache.ctakes/ctakes-relation-extractor/3.2.3-SNAPSHOT/ctakes-relation-extractor-3.2.3-SNAPSHOT.jar
[JENKINS] Archiving <https://builds.apache.org/job/ctakes-trunk-package/ws/ctakes-ne-contexts-res/pom.xml>
to org.apache.ctakes/ctakes-ne-contexts-res/3.2.3-SNAPSHOT/ctakes-ne-contexts-res-3.2.3-SNAPSHOT.pom
[JENKINS] Archiving <https://builds.apache.org/job/ctakes-trunk-package/ws/ctakes-ne-contexts-res/target/ctakes-ne-contexts-res-3.2.3-SNAPSHOT.jar>
to org.apache.ctakes/ctakes-ne-contexts-res/3.2.3-SNAPSHOT/ctakes-ne-contexts-res-3.2.3-SNAPSHOT.jar
[JENKINS] Archiving <https://builds.apache.org/job/ctakes-trunk-package/ws/ctakes-constituency-parser/pom.xml>
to org.apache.ctakes/ctakes-constituency-parser/3.2.3-SNAPSHOT/ctakes-constituency-parser-3.2.3-SNAPSHOT.pom
[JENKINS] Archiving <https://builds.apache.org/job/ctakes-trunk-package/ws/ctakes-constituency-parser/target/ctakes-constituency-parser-3.2.3-SNAPSHOT.jar>
to org.apache.ctakes/ctakes-constituency-parser/3.2.3-SNAPSHOT/ctakes-constituency-parser-3.2.3-SNAPSHOT.jar
[JENKINS] Archiving <https://builds.apache.org/job/ctakes-trunk-package/ws/ctakes-assertion-zoner/pom.xml>
to org.apache.ctakes/ctakes-assertion-zoner/3.2.3-SNAPSHOT/ctakes-assertion-zoner-3.2.3-SNAPSHOT.pom
[JENKINS] Archiving <https://builds.apache.org/job/ctakes-trunk-package/ws/ctakes-assertion-zoner/target/ctakes-assertion-zoner-3.2.3-SNAPSHOT.jar>
to org.apache.ctakes/ctakes-assertion-zoner/3.2.3-SNAPSHOT/ctakes-assertion-zoner-3.2.3-SNAPSHOT.jar
[JENKINS] Archiving <https://builds.apache.org/job/ctakes-trunk-package/ws/ctakes-drug-ner-res/pom.xml>
to org.apache.ctakes/ctakes-drug-ner-res/3.2.3-SNAPSHOT/ctakes-drug-ner-res-3.2.3-SNAPSHOT.pom
[JENKINS] Archiving <https://builds.apache.org/job/ctakes-trunk-package/ws/ctakes-drug-ner-res/target/ctakes-drug-ner-res-3.2.3-SNAPSHOT.jar>
to org.apache.ctakes/ctakes-drug-ner-res/3.2.3-SNAPSHOT/ctakes-drug-ner-res-3.2.3-SNAPSHOT.jar
[JENKINS] Archiving <https://builds.apache.org/job/ctakes-trunk-package/ws/ctakes-pos-tagger-res/pom.xml>
to org.apache.ctakes/ctakes-pos-tagger-res/3.2.3-SNAPSHOT/ctakes-pos-tagger-res-3.2.3-SNAPSHOT.pom
[JENKINS] Archiving <https://builds.apache.org/job/ctakes-trunk-package/ws/ctakes-pos-tagger-res/target/ctakes-pos-tagger-res-3.2.3-SNAPSHOT.jar>
to org.apache.ctakes/ctakes-pos-tagger-res/3.2.3-SNAPSHOT/ctakes-pos-tagger-res-3.2.3-SNAPSHOT.jar
Compressed 11.26 MB of artifacts by 99.4% relative to #444
[JENKINS] Archiving <https://builds.apache.org/job/ctakes-trunk-package/ws/ctakes-chunker-res/pom.xml>
to org.apache.ctakes/ctakes-chunker-res/3.2.3-SNAPSHOT/ctakes-chunker-res-3.2.3-SNAPSHOT.pom
[JENKINS] Archiving <https://builds.apache.org/job/ctakes-trunk-package/ws/ctakes-chunker-res/target/ctakes-chunker-res-3.2.3-SNAPSHOT.jar>
to org.apache.ctakes/ctakes-chunker-res/3.2.3-SNAPSHOT/ctakes-chunker-res-3.2.3-SNAPSHOT.jar
Compressed 12.16 MB of artifacts by 99.7% relative to #444
[JENKINS] Archiving <https://builds.apache.org/job/ctakes-trunk-package/ws/ctakes-ytex/pom.xml>
to org.apache.ctakes/ctakes-ytex/3.2.3-SNAPSHOT/ctakes-ytex-3.2.3-SNAPSHOT.pom
[JENKINS] Archiving <https://builds.apache.org/job/ctakes-trunk-package/ws/ctakes-ytex/target/ctakes-ytex-3.2.3-SNAPSHOT.jar>
to org.apache.ctakes/ctakes-ytex/3.2.3-SNAPSHOT/ctakes-ytex-3.2.3-SNAPSHOT.jar
[JENKINS] Archiving <https://builds.apache.org/job/ctakes-trunk-package/ws/ctakes-template-filler/pom.xml>
to org.apache.ctakes/ctakes-template-filler/3.2.3-SNAPSHOT/ctakes-template-filler-3.2.3-SNAPSHOT.pom
[JENKINS] Archiving <https://builds.apache.org/job/ctakes-trunk-package/ws/ctakes-distribution/pom.xml>
to org.apache.ctakes/ctakes-distribution/3.2.3-SNAPSHOT/ctakes-distribution-3.2.3-SNAPSHOT.pom
[JENKINS] Archiving <https://builds.apache.org/job/ctakes-trunk-package/ws/ctakes-type-system/pom.xml>
to org.apache.ctakes/ctakes-type-system/3.2.3-SNAPSHOT/ctakes-type-system-3.2.3-SNAPSHOT.pom
[JENKINS] Archiving <https://builds.apache.org/job/ctakes-trunk-package/ws/ctakes-type-system/target/ctakes-type-system-3.2.3-SNAPSHOT.jar>
to org.apache.ctakes/ctakes-type-system/3.2.3-SNAPSHOT/ctakes-type-system-3.2.3-SNAPSHOT.jar
[JENKINS] Archiving <https://builds.apache.org/job/ctakes-trunk-package/ws/ctakes-side-effect/pom.xml>
to org.apache.ctakes/ctakes-side-effect/3.2.3-SNAPSHOT/ctakes-side-effect-3.2.3-SNAPSHOT.pom
[JENKINS] Archiving <https://builds.apache.org/job/ctakes-trunk-package/ws/ctakes-side-effect/target/ctakes-side-effect-3.2.3-SNAPSHOT.jar>
to org.apache.ctakes/ctakes-side-effect/3.2.3-SNAPSHOT/ctakes-side-effect-3.2.3-SNAPSHOT.jar
[JENKINS] Archiving <https://builds.apache.org/job/ctakes-trunk-package/ws/ctakes-context-tokenizer/pom.xml>
to org.apache.ctakes/ctakes-context-tokenizer/3.2.3-SNAPSHOT/ctakes-context-tokenizer-3.2.3-SNAPSHOT.pom
[JENKINS] Archiving <https://builds.apache.org/job/ctakes-trunk-package/ws/ctakes-context-tokenizer/target/ctakes-context-tokenizer-3.2.3-SNAPSHOT.jar>
to org.apache.ctakes/ctakes-context-tokenizer/3.2.3-SNAPSHOT/ctakes-context-tokenizer-3.2.3-SNAPSHOT.jar
Sending e-mails to: notifications@ctakes.apache.org
channel stopped

Mime
View raw message