ctakes-notifications mailing list archives

Site index · List index
Message view « Date » · « Thread »
Top « Date » · « Thread »
From Apache Jenkins Server <jenk...@builds.apache.org>
Subject Build failed in Jenkins: ctakes-trunk-compiletest #804
Date Tue, 21 Jun 2016 21:41:53 GMT
See <https://builds.apache.org/job/ctakes-trunk-compiletest/804/changes>

Changes:

[rec] [CTAKES-401] License headers are JavaDoc comments but should be block comments

------------------------------------------
[...truncated 13253 lines...]
** ERR: problem of opening/reading diacritics file: '<https://builds.apache.org/job/ctakes-trunk-compiletest/ws/ctakes-temporal/data/Unicode/diacriticMap.data'.>
Exception: java.io.FileNotFoundException: <https://builds.apache.org/job/ctakes-trunk-compiletest/ws/ctakes-temporal/data/Unicode/diacriticMap.data>
(No such file or directory)
Exception: java.io.FileNotFoundException: <https://builds.apache.org/job/ctakes-trunk-compiletest/ws/ctakes-temporal/data/Unicode/ligatureMap.data>
(No such file or directory)
** Error: problem of opening/reading ligature file: '<https://builds.apache.org/job/ctakes-trunk-compiletest/ws/ctakes-temporal/data/Unicode/ligatureMap.data'.>
** Error: problem of opening/reading symbol synonym file: '<https://builds.apache.org/job/ctakes-trunk-compiletest/ws/ctakes-temporal/data/Unicode/synonymMap.data'.>
Exception: java.io.FileNotFoundException: <https://builds.apache.org/job/ctakes-trunk-compiletest/ws/ctakes-temporal/data/Unicode/synonymMap.data>
(No such file or directory)
**Error: problem of opening/reading file '<https://builds.apache.org/job/ctakes-trunk-compiletest/ws/ctakes-temporal/data/misc/removeS.data'.>
Exception: java.io.FileNotFoundException: <https://builds.apache.org/job/ctakes-trunk-compiletest/ws/ctakes-temporal/data/misc/removeS.data>
(No such file or directory)
** Error: problem of opening/reading Unicode symbol file: '<https://builds.apache.org/job/ctakes-trunk-compiletest/ws/ctakes-temporal/data/Unicode/symbolMap.data'.>
Exception: java.io.FileNotFoundException: <https://builds.apache.org/job/ctakes-trunk-compiletest/ws/ctakes-temporal/data/Unicode/symbolMap.data>
(No such file or directory)
** Error: problem of opening/reading Unicode file: '<https://builds.apache.org/job/ctakes-trunk-compiletest/ws/ctakes-temporal/data/Unicode/unicodeMap.data'.>
Exception: java.io.FileNotFoundException: <https://builds.apache.org/job/ctakes-trunk-compiletest/ws/ctakes-temporal/data/Unicode/unicodeMap.data>
(No such file or directory)
** Error: problem of opening/reading nonStripMap file: '<https://builds.apache.org/job/ctakes-trunk-compiletest/ws/ctakes-temporal/data/Unicode/nonStripMap.data'.>
Exception: java.io.FileNotFoundException: <https://builds.apache.org/job/ctakes-trunk-compiletest/ws/ctakes-temporal/data/Unicode/nonStripMap.data>
(No such file or directory)
Exception: java.io.FileNotFoundException: <https://builds.apache.org/job/ctakes-trunk-compiletest/ws/ctakes-temporal/data/rules/im.rul>
(No such file or directory)
**Error: problem of opening/reading file '<https://builds.apache.org/job/ctakes-trunk-compiletest/ws/ctakes-temporal//data/rules/im.rul'.>
Exception: java.io.FileNotFoundException: <https://builds.apache.org/job/ctakes-trunk-compiletest/ws/ctakes-temporal/data/rules/im.rul>
(No such file or directory)
**Error: problem of opening/reading file '<https://builds.apache.org/job/ctakes-trunk-compiletest/ws/ctakes-temporal//data/rules/im.rul'.>
Exception: java.io.FileNotFoundException: <https://builds.apache.org/job/ctakes-trunk-compiletest/ws/ctakes-temporal/data/rules/dm.rul>
(No such file or directory)
**Error: problem of opening/reading file '<https://builds.apache.org/job/ctakes-trunk-compiletest/ws/ctakes-temporal//data/rules/dm.rul'.>
Exception: java.io.FileNotFoundException: <https://builds.apache.org/job/ctakes-trunk-compiletest/ws/ctakes-temporal/data/rules/dm.rul>
(No such file or directory)
**Error: problem of opening/reading file '<https://builds.apache.org/job/ctakes-trunk-compiletest/ws/ctakes-temporal//data/rules/dm.rul'.>
21 Jun 2016 21:41:08  INFO LvgCmdApiResourceImpl - cd <https://builds.apache.org/job/ctakes-trunk-compiletest/ws/ctakes-temporal>
21 Jun 2016 21:41:08  INFO TokenizerAnnotatorPTB - Initializing org.apache.ctakes.core.ae.TokenizerAnnotatorPTB
21 Jun 2016 21:41:08  INFO POSTagger - POS tagger model file: org/apache/ctakes/postagger/models/mayo-pos.zip
21 Jun 2016 21:41:09  INFO SentenceDetector - Starting processing.
21 Jun 2016 21:41:09  INFO TokenizerAnnotatorPTB - process(JCas) in org.apache.ctakes.core.ae.TokenizerAnnotatorPTB
21 Jun 2016 21:41:09  INFO LvgAnnotator - process(JCas)
21 Jun 2016 21:41:09  INFO ContextDependentTokenizerAnnotator - process(JCas)
21 Jun 2016 21:41:09  INFO POSTagger - process(JCas)
21 Jun 2016 21:41:09  INFO BackwardsTimeAnnotatorTest - Event: recently
21 Jun 2016 21:41:09  INFO BackwardsTimeAnnotatorTest - Event: 6 months ago
Tests run: 1, Failures: 0, Errors: 0, Skipped: 0, Time elapsed: 17.242 sec
Running org.apache.ctakes.temporal.ae.DocTimeRelAnnotatorTest
21 Jun 2016 21:41:12  INFO ClearNLPDependencyParserAE - using Morphy analysis? true
Loading configuration.
Loading feature templates.
Loading lexica.
Loading model:
........................................................................................
21 Jun 2016 21:41:25  INFO ContextDependentTokenizerAnnotator - Finite state machines loaded.
21 Jun 2016 21:41:25  INFO SentenceDetector - Sentence detector model file: org/apache/ctakes/core/sentdetect/sd-med-model.zip
21 Jun 2016 21:41:25  INFO LvgCmdApiResourceImpl - Loading NLM Norm and Lvg with config file
= /tmp/lvg.properties
21 Jun 2016 21:41:25  INFO LvgCmdApiResourceImpl -   config file absolute path = /tmp/lvg.properties
21 Jun 2016 21:41:25  INFO LvgCmdApiResourceImpl - cwd = <https://builds.apache.org/job/ctakes-trunk-compiletest/ws/ctakes-temporal>
21 Jun 2016 21:41:25  INFO LvgCmdApiResourceImpl - cd <https://builds.apache.org/job/ctakes-trunk-compiletest/ws/ctakes-temporal>
Exception: java.io.FileNotFoundException: <https://builds.apache.org/job/ctakes-trunk-compiletest/ws/ctakes-temporal/data/misc/stopWords.data>
(No such file or directory)
** Error: problem of opening/reading stop words file: '<https://builds.apache.org/job/ctakes-trunk-compiletest/ws/ctakes-temporal/data/misc/stopWords.data'.>
Exception: java.io.FileNotFoundException: <https://builds.apache.org/job/ctakes-trunk-compiletest/ws/ctakes-temporal/data/misc/nonInfoWords.data>
(No such file or directory)
** Error: problem of opening/reading non-Info words file: '<https://builds.apache.org/job/ctakes-trunk-compiletest/ws/ctakes-temporal/data/misc/nonInfoWords.data'.>
Exception: java.io.FileNotFoundException: <https://builds.apache.org/job/ctakes-trunk-compiletest/ws/ctakes-temporal/data/misc/conjunctionWord.data>
(No such file or directory)
** Error: problem of opening/reading conjunction words file: '<https://builds.apache.org/job/ctakes-trunk-compiletest/ws/ctakes-temporal/data/misc/conjunctionWord.data'.>
** ERR: problem of opening/reading diacritics file: '<https://builds.apache.org/job/ctakes-trunk-compiletest/ws/ctakes-temporal/data/Unicode/diacriticMap.data'.>
Exception: java.io.FileNotFoundException: <https://builds.apache.org/job/ctakes-trunk-compiletest/ws/ctakes-temporal/data/Unicode/diacriticMap.data>
(No such file or directory)
Exception: java.io.FileNotFoundException: <https://builds.apache.org/job/ctakes-trunk-compiletest/ws/ctakes-temporal/data/Unicode/ligatureMap.data>
(No such file or directory)
** Error: problem of opening/reading ligature file: '<https://builds.apache.org/job/ctakes-trunk-compiletest/ws/ctakes-temporal/data/Unicode/ligatureMap.data'.>
** Error: problem of opening/reading symbol synonym file: '<https://builds.apache.org/job/ctakes-trunk-compiletest/ws/ctakes-temporal/data/Unicode/synonymMap.data'.>
Exception: java.io.FileNotFoundException: <https://builds.apache.org/job/ctakes-trunk-compiletest/ws/ctakes-temporal/data/Unicode/synonymMap.data>
(No such file or directory)
**Error: problem of opening/reading file '<https://builds.apache.org/job/ctakes-trunk-compiletest/ws/ctakes-temporal/data/misc/removeS.data'.>
Exception: java.io.FileNotFoundException: <https://builds.apache.org/job/ctakes-trunk-compiletest/ws/ctakes-temporal/data/misc/removeS.data>
(No such file or directory)
** Error: problem of opening/reading Unicode symbol file: '<https://builds.apache.org/job/ctakes-trunk-compiletest/ws/ctakes-temporal/data/Unicode/symbolMap.data'.>
Exception: java.io.FileNotFoundException: <https://builds.apache.org/job/ctakes-trunk-compiletest/ws/ctakes-temporal/data/Unicode/symbolMap.data>
(No such file or directory)
** Error: problem of opening/reading Unicode file: '<https://builds.apache.org/job/ctakes-trunk-compiletest/ws/ctakes-temporal/data/Unicode/unicodeMap.data'.>
Exception: java.io.FileNotFoundException: <https://builds.apache.org/job/ctakes-trunk-compiletest/ws/ctakes-temporal/data/Unicode/unicodeMap.data>
(No such file or directory)
** Error: problem of opening/reading nonStripMap file: '<https://builds.apache.org/job/ctakes-trunk-compiletest/ws/ctakes-temporal/data/Unicode/nonStripMap.data'.>
Exception: java.io.FileNotFoundException: <https://builds.apache.org/job/ctakes-trunk-compiletest/ws/ctakes-temporal/data/Unicode/nonStripMap.data>
(No such file or directory)
Exception: java.io.FileNotFoundException: <https://builds.apache.org/job/ctakes-trunk-compiletest/ws/ctakes-temporal/data/rules/im.rul>
(No such file or directory)
**Error: problem of opening/reading file '<https://builds.apache.org/job/ctakes-trunk-compiletest/ws/ctakes-temporal//data/rules/im.rul'.>
Exception: java.io.FileNotFoundException: <https://builds.apache.org/job/ctakes-trunk-compiletest/ws/ctakes-temporal/data/rules/im.rul>
(No such file or directory)
**Error: problem of opening/reading file '<https://builds.apache.org/job/ctakes-trunk-compiletest/ws/ctakes-temporal//data/rules/im.rul'.>
Exception: java.io.FileNotFoundException: <https://builds.apache.org/job/ctakes-trunk-compiletest/ws/ctakes-temporal/data/rules/dm.rul>
(No such file or directory)
**Error: problem of opening/reading file '<https://builds.apache.org/job/ctakes-trunk-compiletest/ws/ctakes-temporal//data/rules/dm.rul'.>
Exception: java.io.FileNotFoundException: <https://builds.apache.org/job/ctakes-trunk-compiletest/ws/ctakes-temporal/data/rules/dm.rul>
(No such file or directory)
**Error: problem of opening/reading file '<https://builds.apache.org/job/ctakes-trunk-compiletest/ws/ctakes-temporal//data/rules/dm.rul'.>
Exception: java.io.FileNotFoundException: <https://builds.apache.org/job/ctakes-trunk-compiletest/ws/ctakes-temporal/data/misc/stopWords.data>
(No such file or directory)
** Error: problem of opening/reading stop words file: '<https://builds.apache.org/job/ctakes-trunk-compiletest/ws/ctakes-temporal/data/misc/stopWords.data'.>
Exception: java.io.FileNotFoundException: <https://builds.apache.org/job/ctakes-trunk-compiletest/ws/ctakes-temporal/data/misc/nonInfoWords.data>
(No such file or directory)
** Error: problem of opening/reading non-Info words file: '<https://builds.apache.org/job/ctakes-trunk-compiletest/ws/ctakes-temporal/data/misc/nonInfoWords.data'.>
Exception: java.io.FileNotFoundException: <https://builds.apache.org/job/ctakes-trunk-compiletest/ws/ctakes-temporal/data/misc/conjunctionWord.data>
(No such file or directory)
** Error: problem of opening/reading conjunction words file: '<https://builds.apache.org/job/ctakes-trunk-compiletest/ws/ctakes-temporal/data/misc/conjunctionWord.data'.>
** ERR: problem of opening/reading diacritics file: '<https://builds.apache.org/job/ctakes-trunk-compiletest/ws/ctakes-temporal/data/Unicode/diacriticMap.data'.>
Exception: java.io.FileNotFoundException: <https://builds.apache.org/job/ctakes-trunk-compiletest/ws/ctakes-temporal/data/Unicode/diacriticMap.data>
(No such file or directory)
Exception: java.io.FileNotFoundException: <https://builds.apache.org/job/ctakes-trunk-compiletest/ws/ctakes-temporal/data/Unicode/ligatureMap.data>
(No such file or directory)
** Error: problem of opening/reading ligature file: '<https://builds.apache.org/job/ctakes-trunk-compiletest/ws/ctakes-temporal/data/Unicode/ligatureMap.data'.>
** Error: problem of opening/reading symbol synonym file: '<https://builds.apache.org/job/ctakes-trunk-compiletest/ws/ctakes-temporal/data/Unicode/synonymMap.data'.>
Exception: java.io.FileNotFoundException: <https://builds.apache.org/job/ctakes-trunk-compiletest/ws/ctakes-temporal/data/Unicode/synonymMap.data>
(No such file or directory)
**Error: problem of opening/reading file '<https://builds.apache.org/job/ctakes-trunk-compiletest/ws/ctakes-temporal/data/misc/removeS.data'.>
Exception: java.io.FileNotFoundException: <https://builds.apache.org/job/ctakes-trunk-compiletest/ws/ctakes-temporal/data/misc/removeS.data>
(No such file or directory)
** Error: problem of opening/reading Unicode symbol file: '<https://builds.apache.org/job/ctakes-trunk-compiletest/ws/ctakes-temporal/data/Unicode/symbolMap.data'.>
Exception: java.io.FileNotFoundException: <https://builds.apache.org/job/ctakes-trunk-compiletest/ws/ctakes-temporal/data/Unicode/symbolMap.data>
(No such file or directory)
** Error: problem of opening/reading Unicode file: '<https://builds.apache.org/job/ctakes-trunk-compiletest/ws/ctakes-temporal/data/Unicode/unicodeMap.data'.>
Exception: java.io.FileNotFoundException: <https://builds.apache.org/job/ctakes-trunk-compiletest/ws/ctakes-temporal/data/Unicode/unicodeMap.data>
(No such file or directory)
** Error: problem of opening/reading nonStripMap file: '<https://builds.apache.org/job/ctakes-trunk-compiletest/ws/ctakes-temporal/data/Unicode/nonStripMap.data'.>
Exception: java.io.FileNotFoundException: <https://builds.apache.org/job/ctakes-trunk-compiletest/ws/ctakes-temporal/data/Unicode/nonStripMap.data>
(No such file or directory)
Exception: java.io.FileNotFoundException: <https://builds.apache.org/job/ctakes-trunk-compiletest/ws/ctakes-temporal/data/rules/im.rul>
(No such file or directory)
**Error: problem of opening/reading file '<https://builds.apache.org/job/ctakes-trunk-compiletest/ws/ctakes-temporal//data/rules/im.rul'.>
Exception: java.io.FileNotFoundException: <https://builds.apache.org/job/ctakes-trunk-compiletest/ws/ctakes-temporal/data/rules/im.rul>
(No such file or directory)
**Error: problem of opening/reading file '<https://builds.apache.org/job/ctakes-trunk-compiletest/ws/ctakes-temporal//data/rules/im.rul'.>
Exception: java.io.FileNotFoundException: <https://builds.apache.org/job/ctakes-trunk-compiletest/ws/ctakes-temporal/data/rules/dm.rul>
(No such file or directory)
**Error: problem of opening/reading file '<https://builds.apache.org/job/ctakes-trunk-compiletest/ws/ctakes-temporal//data/rules/dm.rul'.>
Exception: java.io.FileNotFoundException: <https://builds.apache.org/job/ctakes-trunk-compiletest/ws/ctakes-temporal/data/rules/dm.rul>
(No such file or directory)
**Error: problem of opening/reading file '<https://builds.apache.org/job/ctakes-trunk-compiletest/ws/ctakes-temporal//data/rules/dm.rul'.>
21 Jun 2016 21:41:25  INFO LvgCmdApiResourceImpl - cd <https://builds.apache.org/job/ctakes-trunk-compiletest/ws/ctakes-temporal>
21 Jun 2016 21:41:25  INFO TokenizerAnnotatorPTB - Initializing org.apache.ctakes.core.ae.TokenizerAnnotatorPTB
21 Jun 2016 21:41:25  INFO POSTagger - POS tagger model file: org/apache/ctakes/postagger/models/mayo-pos.zip
21 Jun 2016 21:41:26  INFO SentenceDetector - Starting processing.
21 Jun 2016 21:41:26  INFO TokenizerAnnotatorPTB - process(JCas) in org.apache.ctakes.core.ae.TokenizerAnnotatorPTB
21 Jun 2016 21:41:26  INFO LvgAnnotator - process(JCas)
21 Jun 2016 21:41:26  INFO ContextDependentTokenizerAnnotator - process(JCas)
21 Jun 2016 21:41:26  INFO POSTagger - process(JCas)
21 Jun 2016 21:41:26  INFO DocTimeRelAnnotatorTest - Event: old DocTimeRel:OVERLAP
21 Jun 2016 21:41:26  INFO DocTimeRelAnnotatorTest - Event: referred DocTimeRel:BEFORE
21 Jun 2016 21:41:26  INFO DocTimeRelAnnotatorTest - Event: diagnosed DocTimeRel:BEFORE
21 Jun 2016 21:41:26  INFO DocTimeRelAnnotatorTest - Event: cancer DocTimeRel:OVERLAP
21 Jun 2016 21:41:26  INFO DocTimeRelAnnotatorTest - Event: blood DocTimeRel:OVERLAP
Tests run: 1, Failures: 0, Errors: 0, Skipped: 0, Time elapsed: 16.835 sec
Running org.apache.ctakes.temporal.ae.EventTimeRelationAnnotatorTest
21 Jun 2016 21:41:29  INFO ClearNLPDependencyParserAE - using Morphy analysis? true
Loading configuration.
Loading feature templates.
Loading lexica.
Loading model:
......Killed

Results :

Tests run: 2, Failures: 0, Errors: 0, Skipped: 0

[JENKINS] Recording test results
[JENKINS] Archiving disabled
[INFO] ------------------------------------------------------------------------
[INFO] Reactor Summary:
[INFO] 
[INFO] Apache cTAKES ..................................... SUCCESS [6.072s]
[INFO] Apache cTAKES common type system .................. SUCCESS [10.971s]
[INFO] Apache cTAKES utils ............................... SUCCESS [2.863s]
[INFO] Apache cTAKES Resources core ...................... SUCCESS [1.412s]
[INFO] Apache cTAKES core ................................ SUCCESS [32.412s]
[INFO] Apache cTAKES Resources pos-tagger ................ SUCCESS [1.374s]
[INFO] Apache cTAKES part-of-speech tagger ............... SUCCESS [4.669s]
[INFO] Apache cTAKES Resources ctakes-chunker-res ........ SUCCESS [1.409s]
[INFO] Apache cTAKES chunker ............................. SUCCESS [3.157s]
[INFO] Apache cTAKES document preprocessor ............... SUCCESS [2.597s]
[INFO] Apache cTAKES Resources dictionary-lookup ......... SUCCESS [18.088s]
[INFO] Apache cTAKES dictionary lookup ................... SUCCESS [3.641s]
[INFO] Apache cTAKES context dependent tokenizer ......... SUCCESS [4.566s]
[INFO] Apache cTAKES Resources lvg ....................... SUCCESS [30.350s]
[INFO] Apache cTAKES LVG lexical tools ................... SUCCESS [3.677s]
[INFO] Apache cTAKES Resources ne-contexts ............... SUCCESS [1.278s]
[INFO] Apache cTAKES named entity contexts ............... SUCCESS [3.860s]
[INFO] Apache cTAKES Resources constituency-parser ....... SUCCESS [1.551s]
[INFO] Apache cTAKES Constituency Parser ................. SUCCESS [2.054s]
[INFO] Apache cTAKES Resources coreference ............... SUCCESS [1.775s]
[INFO] Apache cTAKES Resources relation-extractor ........ SUCCESS [1.269s]
[INFO] Apache cTAKES Resources dependency-parser ......... SUCCESS [3.707s]
[INFO] Apache cTAKES Dependency Parser ................... SUCCESS [27.259s]
[INFO] Apache cTAKES Relation Extractor .................. SUCCESS [10.433s]
[INFO] Apache cTAKES Resources assertion ................. SUCCESS [1.555s]
[INFO] Apache cTAKES Assertion ........................... SUCCESS [6.722s]
[INFO] Apache cTAKES Resources temporal .................. SUCCESS [1.536s]
[INFO] Apache cTAKES Resources dictionary-lookup-fast-res  SUCCESS [3.271s]
[INFO] Apache cTAKES dictionary lookup fast .............. SUCCESS [10.941s]
[INFO] Apache cTAKES Resources drug-ner .................. SUCCESS [1.357s]
[INFO] Apache cTAKES Drug NER ............................ SUCCESS [7.127s]
[INFO] Apache cTAKES Resources ctakes-ytex-res ........... SUCCESS [1.533s]
[INFO] Apache cTAKES YTEX ................................ SUCCESS [7.177s]
[INFO] Apache cTAKES YTEX UIMA ........................... SUCCESS [8.637s]
[INFO] Apache cTAKES ctakes-clinical-pipeline ............ SUCCESS [6.109s]
[INFO] Apache cTAKES Temporal Information Extraction ..... FAILURE [1:04.295s]
[INFO] Apache cTAKES CoReference Resolver ................ SKIPPED
[INFO] Apache cTAKES Resources side-effect ............... SKIPPED
[INFO] Apache cTAKES Side Effects ........................ SKIPPED
[INFO] Apache cTAKES Resources smoking-status ............ SKIPPED
[INFO] Apache cTAKES Smoking Status ...................... SKIPPED
[INFO] Apache cTAKES Resources assertion-zoner ........... SKIPPED
[INFO] Apache cTAKES Assertion's zoner ................... SKIPPED
[INFO] Apache cTAKES YTEX Web ............................ SKIPPED
[INFO] Apache cTAKES Distribution ........................ SKIPPED
[INFO] Apache cTAKES Regression-test ..................... SKIPPED
[INFO] Apache cTAKES template filler ..................... SKIPPED
[INFO] ctakes-examples ................................... SKIPPED
[INFO] ------------------------------------------------------------------------
[INFO] BUILD FAILURE
[INFO] ------------------------------------------------------------------------
[INFO] Total time: 5:28.529s
[INFO] Finished at: Tue Jun 21 21:41:33 UTC 2016
[INFO] Final Memory: 102M/783M
[INFO] ------------------------------------------------------------------------
[JENKINS] Archiving disabled
[JENKINS] Archiving disabled
[JENKINS] Archiving disabled
[JENKINS] Archiving disabled
[JENKINS] Archiving disabled
[JENKINS] Archiving disabled
[JENKINS] Archiving disabled
[JENKINS] Archiving disabled
[JENKINS] Archiving disabled
[JENKINS] Archiving disabled
[JENKINS] Archiving disabled
[JENKINS] Archiving disabled
[JENKINS] Archiving disabled
[JENKINS] Archiving disabled
[JENKINS] Archiving disabled
[JENKINS] Archiving disabled
[JENKINS] Archiving disabled
[JENKINS] Archiving disabled
[JENKINS] Archiving disabled
[JENKINS] Archiving disabled
[JENKINS] Archiving disabled
[JENKINS] Archiving disabled
[JENKINS] Archiving disabled
[JENKINS] Archiving disabled
[JENKINS] Archiving disabled
[JENKINS] Archiving disabled
[JENKINS] Archiving disabled
[JENKINS] Archiving disabled
[JENKINS] Archiving disabled
[JENKINS] Archiving disabled
[JENKINS] Archiving disabled
[JENKINS] Archiving disabled
[JENKINS] Archiving disabled
[JENKINS] Archiving disabled
[JENKINS] Archiving disabled
[JENKINS] Archiving disabled
[JENKINS] Archiving disabled
[JENKINS] Archiving disabled
[JENKINS] Archiving disabled
[JENKINS] Archiving disabled
[JENKINS] Archiving disabled
[JENKINS] Archiving disabled
[JENKINS] Archiving disabled
[JENKINS] Archiving disabled
[JENKINS] Archiving disabled
[JENKINS] Archiving disabled
[JENKINS] Archiving disabled
[JENKINS] Archiving disabled
Waiting for Jenkins to finish collecting data
[ERROR] Failed to execute goal org.apache.maven.plugins:maven-surefire-plugin:2.12.1:test
(default-test) on project ctakes-temporal: Execution default-test of goal org.apache.maven.plugins:maven-surefire-plugin:2.12.1:test
failed: The forked VM terminated without saying properly goodbye. VM crash or System.exit
called ? -> [Help 1]
[ERROR] 
[ERROR] To see the full stack trace of the errors, re-run Maven with the -e switch.
[ERROR] Re-run Maven using the -X switch to enable full debug logging.
[ERROR] 
[ERROR] For more information about the errors and possible solutions, please read the following
articles:
[ERROR] [Help 1] http://cwiki.apache.org/confluence/display/MAVEN/PluginExecutionException
[ERROR] 
[ERROR] After correcting the problems, you can resume the build with the command
[ERROR]   mvn <goals> -rf :ctakes-temporal
Sending e-mails to: notifications@ctakes.apache.org richard.eckart@gmail.com
channel stopped

Mime
View raw message