ctakes-notifications mailing list archives

Site index · List index
Message view « Date » · « Thread »
Top « Date » · « Thread »
From Apache Jenkins Server <jenk...@builds.apache.org>
Subject Build failed in Jenkins: ctakes-trunk-compiletest #794
Date Mon, 25 Apr 2016 22:39:21 GMT
See <https://builds.apache.org/job/ctakes-trunk-compiletest/794/changes>

Changes:

[clin] fix a relation bug that caused location_of category counts to keep on increasing for
each grid search option.

------------------------------------------
[...truncated 11806 lines...]
Exception: java.io.FileNotFoundException: <https://builds.apache.org/job/ctakes-trunk-compiletest/ws/ctakes-temporal/data/misc/stopWords.data>
(No such file or directory)
** Error: problem of opening/reading stop words file: '<https://builds.apache.org/job/ctakes-trunk-compiletest/ws/ctakes-temporal/data/misc/stopWords.data'.>
Exception: java.io.FileNotFoundException: <https://builds.apache.org/job/ctakes-trunk-compiletest/ws/ctakes-temporal/data/misc/nonInfoWords.data>
(No such file or directory)
** Error: problem of opening/reading non-Info words file: '<https://builds.apache.org/job/ctakes-trunk-compiletest/ws/ctakes-temporal/data/misc/nonInfoWords.data'.>
Exception: java.io.FileNotFoundException: <https://builds.apache.org/job/ctakes-trunk-compiletest/ws/ctakes-temporal/data/misc/conjunctionWord.data>
(No such file or directory)
** Error: problem of opening/reading conjunction words file: '<https://builds.apache.org/job/ctakes-trunk-compiletest/ws/ctakes-temporal/data/misc/conjunctionWord.data'.>
** ERR: problem of opening/reading diacritics file: '<https://builds.apache.org/job/ctakes-trunk-compiletest/ws/ctakes-temporal/data/Unicode/diacriticMap.data'.>
Exception: java.io.FileNotFoundException: <https://builds.apache.org/job/ctakes-trunk-compiletest/ws/ctakes-temporal/data/Unicode/diacriticMap.data>
(No such file or directory)
Exception: java.io.FileNotFoundException: <https://builds.apache.org/job/ctakes-trunk-compiletest/ws/ctakes-temporal/data/Unicode/ligatureMap.data>
(No such file or directory)
** Error: problem of opening/reading ligature file: '<https://builds.apache.org/job/ctakes-trunk-compiletest/ws/ctakes-temporal/data/Unicode/ligatureMap.data'.>
** Error: problem of opening/reading symbol synonym file: '<https://builds.apache.org/job/ctakes-trunk-compiletest/ws/ctakes-temporal/data/Unicode/synonymMap.data'.>
Exception: java.io.FileNotFoundException: <https://builds.apache.org/job/ctakes-trunk-compiletest/ws/ctakes-temporal/data/Unicode/synonymMap.data>
(No such file or directory)
**Error: problem of opening/reading file '<https://builds.apache.org/job/ctakes-trunk-compiletest/ws/ctakes-temporal/data/misc/removeS.data'.>
Exception: java.io.FileNotFoundException: <https://builds.apache.org/job/ctakes-trunk-compiletest/ws/ctakes-temporal/data/misc/removeS.data>
(No such file or directory)
** Error: problem of opening/reading Unicode symbol file: '<https://builds.apache.org/job/ctakes-trunk-compiletest/ws/ctakes-temporal/data/Unicode/symbolMap.data'.>
Exception: java.io.FileNotFoundException: <https://builds.apache.org/job/ctakes-trunk-compiletest/ws/ctakes-temporal/data/Unicode/symbolMap.data>
(No such file or directory)
** Error: problem of opening/reading Unicode file: '<https://builds.apache.org/job/ctakes-trunk-compiletest/ws/ctakes-temporal/data/Unicode/unicodeMap.data'.>
Exception: java.io.FileNotFoundException: <https://builds.apache.org/job/ctakes-trunk-compiletest/ws/ctakes-temporal/data/Unicode/unicodeMap.data>
(No such file or directory)
** Error: problem of opening/reading nonStripMap file: '<https://builds.apache.org/job/ctakes-trunk-compiletest/ws/ctakes-temporal/data/Unicode/nonStripMap.data'.>
Exception: java.io.FileNotFoundException: <https://builds.apache.org/job/ctakes-trunk-compiletest/ws/ctakes-temporal/data/Unicode/nonStripMap.data>
(No such file or directory)
Exception: java.io.FileNotFoundException: <https://builds.apache.org/job/ctakes-trunk-compiletest/ws/ctakes-temporal/data/rules/im.rul>
(No such file or directory)
**Error: problem of opening/reading file '<https://builds.apache.org/job/ctakes-trunk-compiletest/ws/ctakes-temporal//data/rules/im.rul'.>
Exception: java.io.FileNotFoundException: <https://builds.apache.org/job/ctakes-trunk-compiletest/ws/ctakes-temporal/data/rules/im.rul>
(No such file or directory)
**Error: problem of opening/reading file '<https://builds.apache.org/job/ctakes-trunk-compiletest/ws/ctakes-temporal//data/rules/im.rul'.>
Exception: java.io.FileNotFoundException: <https://builds.apache.org/job/ctakes-trunk-compiletest/ws/ctakes-temporal/data/rules/dm.rul>
(No such file or directory)
**Error: problem of opening/reading file '<https://builds.apache.org/job/ctakes-trunk-compiletest/ws/ctakes-temporal//data/rules/dm.rul'.>
Exception: java.io.FileNotFoundException: <https://builds.apache.org/job/ctakes-trunk-compiletest/ws/ctakes-temporal/data/rules/dm.rul>
(No such file or directory)
**Error: problem of opening/reading file '<https://builds.apache.org/job/ctakes-trunk-compiletest/ws/ctakes-temporal//data/rules/dm.rul'.>
25 Apr 2016 22:38:30  INFO LvgCmdApiResourceImpl - cd <https://builds.apache.org/job/ctakes-trunk-compiletest/ws/ctakes-temporal>
25 Apr 2016 22:38:30  INFO TokenizerAnnotatorPTB - Initializing org.apache.ctakes.core.ae.TokenizerAnnotatorPTB
25 Apr 2016 22:38:30  INFO POSTagger - POS tagger model file: org/apache/ctakes/postagger/models/mayo-pos.zip
25 Apr 2016 22:38:30  INFO SentenceDetector - Starting processing.
25 Apr 2016 22:38:30  INFO TokenizerAnnotatorPTB - process(JCas) in org.apache.ctakes.core.ae.TokenizerAnnotatorPTB
25 Apr 2016 22:38:30  INFO LvgAnnotator - process(JCas)
25 Apr 2016 22:38:30  INFO ContextDependentTokenizerAnnotator - process(JCas)
25 Apr 2016 22:38:30  INFO POSTagger - process(JCas)
Null value found in Feature(<Time-Class->, <NULL>)
Null value found in Feature(<Time-Class->, <NULL>)
Null value found in Feature(<Time-Class->, <NULL>)
Null value found in Feature(<Time-Class->, <NULL>)
Null value found in Feature(<Time-Class->, <NULL>)
25 Apr 2016 22:38:31  INFO EventTimeRelationAnnotatorTest - Relation: RelationArgument
   id: 0
   argument: TimeMention
      sofa: _InitialView
      begin: 58
      end: 66
      id: 0
      ontologyConceptArr: <null>
      typeID: 0
      segmentID: <null>
      sentenceID: <null>
      discoveryTechnique: 0
      confidence: 0.0
      polarity: 0
      uncertainty: 0
      conditional: false
      generic: false
      subject: <null>
      historyOf: 0
      originalText: <null>
      date: <null>
      time: <null>
      timeClass: <null>
   role: "Arg1"
   participatesIn: <null>
 RelationArgument
   id: 0
   argument: EventMention
      sofa: _InitialView
      begin: 67
      end: 76
      id: 0
      ontologyConceptArr: <null>
      typeID: 0
      segmentID: <null>
      sentenceID: <null>
      discoveryTechnique: 0
      confidence: 1.3807402
      polarity: 0
      uncertainty: 0
      conditional: false
      generic: false
      subject: <null>
      historyOf: 0
      originalText: <null>
      event: Event
         id: 0
         ontologyConcept: <null>
         mentions: <null>
         discoveryTechnique: 0
         confidence: 0.0
         conditional: false
         generic: false
         subject: <null>
         polarity: 0
         uncertainty: 0
         historyOf: 0
         properties: EventProperties
            contextualModality: <null>
            contextualAspect: <null>
            permanence: <null>
            category: <null>
            aspect: <null>
            docTimeRel: <null>
            degree: <null>
            polarity: 0
   role: "Arg2"
   participatesIn: <null>
 Category: CONTAINS
Tests run: 1, Failures: 0, Errors: 0, Skipped: 0, Time elapsed: 14.506 sec
Running org.apache.ctakes.temporal.ae.EventEventRelationAnnotatorTest
25 Apr 2016 22:38:34  INFO ClearNLPDependencyParserAE - using Morphy analysis? true
Loading configuration.
Loading feature templates.
Loading lexica.
Loading model:
Java HotSpot(TM) 64-Bit Server VM warning: INFO: os::commit_memory(0x000000074b300000, 409993216,
0) failed; error='Cannot allocate memory' (errno=12)
#
# There is insufficient memory for the Java Runtime Environment to continue.
# Native memory allocation (mmap) failed to map 409993216 bytes for committing reserved memory.
# An error report file with more information is saved as:
# <https://builds.apache.org/job/ctakes-trunk-compiletest/ws/ctakes-temporal/hs_err_pid20877.log>

Results :

Tests run: 3, Failures: 0, Errors: 0, Skipped: 0

[JENKINS] Recording test results
[JENKINS] Archiving disabled
[INFO] ------------------------------------------------------------------------
[INFO] Reactor Summary:
[INFO] 
[INFO] Apache cTAKES ..................................... SUCCESS [3.891s]
[INFO] Apache cTAKES common type system .................. SUCCESS [8.864s]
[INFO] Apache cTAKES utils ............................... SUCCESS [2.953s]
[INFO] Apache cTAKES Resources core ...................... SUCCESS [1.300s]
[INFO] Apache cTAKES core ................................ SUCCESS [32.831s]
[INFO] Apache cTAKES Resources pos-tagger ................ SUCCESS [1.398s]
[INFO] Apache cTAKES part-of-speech tagger ............... SUCCESS [4.468s]
[INFO] Apache cTAKES Resources ctakes-chunker-res ........ SUCCESS [1.648s]
[INFO] Apache cTAKES chunker ............................. SUCCESS [2.996s]
[INFO] Apache cTAKES document preprocessor ............... SUCCESS [2.791s]
[INFO] Apache cTAKES Resources dictionary-lookup ......... SUCCESS [16.969s]
[INFO] Apache cTAKES dictionary lookup ................... SUCCESS [3.836s]
[INFO] Apache cTAKES context dependent tokenizer ......... SUCCESS [4.075s]
[INFO] Apache cTAKES Resources lvg ....................... SUCCESS [26.484s]
[INFO] Apache cTAKES LVG lexical tools ................... SUCCESS [3.867s]
[INFO] Apache cTAKES Resources ne-contexts ............... SUCCESS [1.529s]
[INFO] Apache cTAKES named entity contexts ............... SUCCESS [3.848s]
[INFO] Apache cTAKES Resources constituency-parser ....... SUCCESS [1.559s]
[INFO] Apache cTAKES Constituency Parser ................. SUCCESS [2.024s]
[INFO] Apache cTAKES Resources coreference ............... SUCCESS [1.672s]
[INFO] Apache cTAKES Resources relation-extractor ........ SUCCESS [1.350s]
[INFO] Apache cTAKES Resources dependency-parser ......... SUCCESS [3.512s]
[INFO] Apache cTAKES Dependency Parser ................... SUCCESS [28.095s]
[INFO] Apache cTAKES Relation Extractor .................. SUCCESS [9.304s]
[INFO] Apache cTAKES CoReference Resolver ................ SUCCESS [6.001s]
[INFO] Apache cTAKES Resources drug-ner .................. SUCCESS [1.464s]
[INFO] Apache cTAKES Drug NER ............................ SUCCESS [6.545s]
[INFO] Apache cTAKES Resources side-effect ............... SUCCESS [1.440s]
[INFO] Apache cTAKES Side Effects ........................ SUCCESS [7.402s]
[INFO] Apache cTAKES Resources smoking-status ............ SUCCESS [1.373s]
[INFO] Apache cTAKES Smoking Status ...................... SUCCESS [7.403s]
[INFO] Apache cTAKES Resources assertion ................. SUCCESS [1.620s]
[INFO] Apache cTAKES Assertion ........................... SUCCESS [6.453s]
[INFO] Apache cTAKES Resources assertion-zoner ........... SUCCESS [1.432s]
[INFO] Apache cTAKES Assertion's zoner ................... SUCCESS [2.124s]
[INFO] Apache cTAKES Resources temporal .................. SUCCESS [4.388s]
[INFO] Apache cTAKES Resources dictionary-lookup-fast-res  SUCCESS [2.434s]
[INFO] Apache cTAKES dictionary lookup fast .............. SUCCESS [10.960s]
[INFO] Apache cTAKES Resources ctakes-ytex-res ........... SUCCESS [1.360s]
[INFO] Apache cTAKES YTEX ................................ SUCCESS [7.354s]
[INFO] Apache cTAKES YTEX UIMA ........................... SUCCESS [8.153s]
[INFO] Apache cTAKES ctakes-clinical-pipeline ............ SUCCESS [5.825s]
[INFO] Apache cTAKES Temporal Information Extraction ..... FAILURE [1:12.225s]
[INFO] Apache cTAKES YTEX Web ............................ SKIPPED
[INFO] Apache cTAKES Distribution ........................ SKIPPED
[INFO] Apache cTAKES Regression-test ..................... SKIPPED
[INFO] Apache cTAKES template filler ..................... SKIPPED
[INFO] ctakes-examples ................................... SKIPPED
[INFO] ------------------------------------------------------------------------
[INFO] BUILD FAILURE
[INFO] ------------------------------------------------------------------------
[INFO] Total time: 6:00.281s
[INFO] Finished at: Mon Apr 25 22:38:36 UTC 2016
[INFO] Final Memory: 110M/693M
[INFO] ------------------------------------------------------------------------
[JENKINS] Archiving disabled
[JENKINS] Archiving disabled
[JENKINS] Archiving disabled
[JENKINS] Archiving disabled
[JENKINS] Archiving disabled
[JENKINS] Archiving disabled
[JENKINS] Archiving disabled
[JENKINS] Archiving disabled
[JENKINS] Archiving disabled
[JENKINS] Archiving disabled
[JENKINS] Archiving disabled
[JENKINS] Archiving disabled
[JENKINS] Archiving disabled
[JENKINS] Archiving disabled
[JENKINS] Archiving disabled
[JENKINS] Archiving disabled
[JENKINS] Archiving disabled
[JENKINS] Archiving disabled
[JENKINS] Archiving disabled
[JENKINS] Archiving disabled
[JENKINS] Archiving disabled
[JENKINS] Archiving disabled
[JENKINS] Archiving disabled
[JENKINS] Archiving disabled
[JENKINS] Archiving disabled
[JENKINS] Archiving disabled
[JENKINS] Archiving disabled
[JENKINS] Archiving disabled
[JENKINS] Archiving disabled
[JENKINS] Archiving disabled
[JENKINS] Archiving disabled
[JENKINS] Archiving disabled
[JENKINS] Archiving disabled
[JENKINS] Archiving disabled
[JENKINS] Archiving disabled
[JENKINS] Archiving disabled
[JENKINS] Archiving disabled
[JENKINS] Archiving disabled
[JENKINS] Archiving disabled
[JENKINS] Archiving disabled
[JENKINS] Archiving disabled
[JENKINS] Archiving disabled
[JENKINS] Archiving disabled
[JENKINS] Archiving disabled
[JENKINS] Archiving disabled
[JENKINS] Archiving disabled
[JENKINS] Archiving disabled
[JENKINS] Archiving disabled
Waiting for Jenkins to finish collecting data
[ERROR] Failed to execute goal org.apache.maven.plugins:maven-surefire-plugin:2.12.1:test
(default-test) on project ctakes-temporal: Execution default-test of goal org.apache.maven.plugins:maven-surefire-plugin:2.12.1:test
failed: The forked VM terminated without saying properly goodbye. VM crash or System.exit
called ? -> [Help 1]
[ERROR] 
[ERROR] To see the full stack trace of the errors, re-run Maven with the -e switch.
[ERROR] Re-run Maven using the -X switch to enable full debug logging.
[ERROR] 
[ERROR] For more information about the errors and possible solutions, please read the following
articles:
[ERROR] [Help 1] http://cwiki.apache.org/confluence/display/MAVEN/PluginExecutionException
[ERROR] 
[ERROR] After correcting the problems, you can resume the build with the command
[ERROR]   mvn <goals> -rf :ctakes-temporal
Sending e-mails to: notifications@ctakes.apache.org
channel stopped

Mime
View raw message