ctakes-notifications mailing list archives

Site index · List index
Message view « Date » · « Thread »
Top « Date » · « Thread »
From Apache Jenkins Server <jenk...@builds.apache.org>
Subject Build failed in Jenkins: ctakes-trunk-package » Apache cTAKES Temporal Information Extraction #412
Date Fri, 11 Mar 2016 12:15:18 GMT
See <https://builds.apache.org/job/ctakes-trunk-package/org.apache.ctakes$ctakes-temporal/412/changes>

Changes:

[clin] add the first version of cross-sentence temporal relation annotator for THYME data.

------------------------------------------
[...truncated 90 lines...]
<https://builds.apache.org/job/ctakes-trunk-package/org.apache.ctakes$ctakes-temporal/ws/src/main/java/org/apache/ctakes/temporal/ae/feature/UMLSBasedTokenFeaturesExtractor.java>:[99,53]
[unchecked] unchecked conversion
[ERROR]   required: Collection<? extends E>
  found:    List
  where E is a type-variable:
    E extends Object declared in interface List
<https://builds.apache.org/job/ctakes-trunk-package/org.apache.ctakes$ctakes-temporal/ws/src/main/java/org/apache/ctakes/temporal/ae/feature/UMLSBasedTokenFeaturesExtractor.java>:[100,19]
[unchecked] unchecked method invocation: method addAll in interface List is applied to given
types
[ERROR]   required: Collection<? extends E>
  found: List
  where E is a type-variable:
    E extends Object declared in interface List
<https://builds.apache.org/job/ctakes-trunk-package/org.apache.ctakes$ctakes-temporal/ws/src/main/java/org/apache/ctakes/temporal/ae/feature/UMLSBasedTokenFeaturesExtractor.java>:[100,47]
[unchecked] unchecked conversion
[ERROR]   required: Collection<? extends E>
  found:    List
  where E is a type-variable:
    E extends Object declared in interface List
<https://builds.apache.org/job/ctakes-trunk-package/org.apache.ctakes$ctakes-temporal/ws/src/main/java/org/apache/ctakes/temporal/ae/feature/UMLSBasedTokenFeaturesExtractor.java>:[111,65]
[unchecked] unchecked call to extract(JCas,T) as a member of the raw type FeatureExtractor1
[ERROR]   where T is a type-variable:
    T extends Annotation declared in interface FeatureExtractor1
<https://builds.apache.org/job/ctakes-trunk-package/org.apache.ctakes$ctakes-temporal/ws/src/main/java/org/apache/ctakes/temporal/ae/feature/UMLSBasedTokenFeaturesExtractor.java>:[111,19]
[unchecked] unchecked method invocation: method addAll in interface List is applied to given
types
[ERROR]   required: Collection<? extends E>
  found: List
  where E is a type-variable:
    E extends Object declared in interface List
<https://builds.apache.org/job/ctakes-trunk-package/org.apache.ctakes$ctakes-temporal/ws/src/main/java/org/apache/ctakes/temporal/ae/feature/UMLSBasedTokenFeaturesExtractor.java>:[111,65]
[unchecked] unchecked conversion
[ERROR]   required: Collection<? extends E>
  found:    List
  where E is a type-variable:
    E extends Object declared in interface List
<https://builds.apache.org/job/ctakes-trunk-package/org.apache.ctakes$ctakes-temporal/ws/src/main/java/org/apache/ctakes/temporal/ae/feature/UMLSBasedTokenFeaturesExtractor.java>:[112,53]
[unchecked] unchecked call to extractBetween(JCas,FOCUS_T,FOCUS_T) as a member of the raw
type CleartkExtractor
[ERROR]   where FOCUS_T is a type-variable:
    FOCUS_T extends Annotation declared in class CleartkExtractor
<https://builds.apache.org/job/ctakes-trunk-package/org.apache.ctakes$ctakes-temporal/ws/src/main/java/org/apache/ctakes/temporal/ae/feature/UMLSBasedTokenFeaturesExtractor.java>:[112,19]
[unchecked] unchecked method invocation: method addAll in interface List is applied to given
types
[ERROR]   required: Collection<? extends E>
  found: List
  where E is a type-variable:
    E extends Object declared in interface List
<https://builds.apache.org/job/ctakes-trunk-package/org.apache.ctakes$ctakes-temporal/ws/src/main/java/org/apache/ctakes/temporal/ae/feature/UMLSBasedTokenFeaturesExtractor.java>:[112,53]
[unchecked] unchecked conversion
[ERROR]   required: Collection<? extends E>
  found:    List
  where E is a type-variable:
    E extends Object declared in interface List
<https://builds.apache.org/job/ctakes-trunk-package/org.apache.ctakes$ctakes-temporal/ws/src/main/java/org/apache/ctakes/temporal/ae/feature/UMLSBasedTokenFeaturesExtractor.java>:[113,19]
[unchecked] unchecked method invocation: method addAll in interface List is applied to given
types
[ERROR]   required: Collection<? extends E>
  found: List
  where E is a type-variable:
    E extends Object declared in interface List
<https://builds.apache.org/job/ctakes-trunk-package/org.apache.ctakes$ctakes-temporal/ws/src/main/java/org/apache/ctakes/temporal/ae/feature/UMLSBasedTokenFeaturesExtractor.java>:[113,47]
[unchecked] unchecked conversion
[ERROR]   required: Collection<? extends E>
  found:    List
  where E is a type-variable:
    E extends Object declared in interface List
<https://builds.apache.org/job/ctakes-trunk-package/org.apache.ctakes$ctakes-temporal/ws/src/main/java/org/apache/ctakes/temporal/ae/feature/UMLSBasedTokenFeaturesExtractor.java>:[118,63]
[unchecked] unchecked call to extract(JCas,T) as a member of the raw type FeatureExtractor1
[ERROR]   where T is a type-variable:
    T extends Annotation declared in interface FeatureExtractor1
<https://builds.apache.org/job/ctakes-trunk-package/org.apache.ctakes$ctakes-temporal/ws/src/main/java/org/apache/ctakes/temporal/ae/feature/UMLSBasedTokenFeaturesExtractor.java>:[118,17]
[unchecked] unchecked method invocation: method addAll in interface List is applied to given
types
[ERROR]   required: Collection<? extends E>
  found: List
  where E is a type-variable:
    E extends Object declared in interface List
<https://builds.apache.org/job/ctakes-trunk-package/org.apache.ctakes$ctakes-temporal/ws/src/main/java/org/apache/ctakes/temporal/ae/feature/UMLSBasedTokenFeaturesExtractor.java>:[118,63]
[unchecked] unchecked conversion
[ERROR]   required: Collection<? extends E>
  found:    List
  where E is a type-variable:
    E extends Object declared in interface List
<https://builds.apache.org/job/ctakes-trunk-package/org.apache.ctakes$ctakes-temporal/ws/src/main/java/org/apache/ctakes/temporal/ae/feature/UMLSBasedTokenFeaturesExtractor.java>:[119,63]
[unchecked] unchecked call to extract(JCas,T) as a member of the raw type FeatureExtractor1
[ERROR]   where T is a type-variable:
    T extends Annotation declared in interface FeatureExtractor1
<https://builds.apache.org/job/ctakes-trunk-package/org.apache.ctakes$ctakes-temporal/ws/src/main/java/org/apache/ctakes/temporal/ae/feature/UMLSBasedTokenFeaturesExtractor.java>:[119,17]
[unchecked] unchecked method invocation: method addAll in interface List is applied to given
types
[ERROR]   required: Collection<? extends E>
  found: List
  where E is a type-variable:
    E extends Object declared in interface List
<https://builds.apache.org/job/ctakes-trunk-package/org.apache.ctakes$ctakes-temporal/ws/src/main/java/org/apache/ctakes/temporal/ae/feature/UMLSBasedTokenFeaturesExtractor.java>:[119,63]
[unchecked] unchecked conversion
[ERROR]   required: Collection<? extends E>
  found:    List
  where E is a type-variable:
    E extends Object declared in interface List
<https://builds.apache.org/job/ctakes-trunk-package/org.apache.ctakes$ctakes-temporal/ws/src/main/java/org/apache/ctakes/temporal/ae/feature/UMLSBasedTokenFeaturesExtractor.java>:[120,51]
[unchecked] unchecked call to extractBetween(JCas,FOCUS_T,FOCUS_T) as a member of the raw
type CleartkExtractor
[ERROR]   where FOCUS_T is a type-variable:
    FOCUS_T extends Annotation declared in class CleartkExtractor
<https://builds.apache.org/job/ctakes-trunk-package/org.apache.ctakes$ctakes-temporal/ws/src/main/java/org/apache/ctakes/temporal/ae/feature/UMLSBasedTokenFeaturesExtractor.java>:[120,17]
[unchecked] unchecked method invocation: method addAll in interface List is applied to given
types
[ERROR]   required: Collection<? extends E>
  found: List
  where E is a type-variable:
    E extends Object declared in interface List
<https://builds.apache.org/job/ctakes-trunk-package/org.apache.ctakes$ctakes-temporal/ws/src/main/java/org/apache/ctakes/temporal/ae/feature/UMLSBasedTokenFeaturesExtractor.java>:[120,51]
[unchecked] unchecked conversion
[ERROR]   required: Collection<? extends E>
  found:    List
  where E is a type-variable:
    E extends Object declared in interface List
<https://builds.apache.org/job/ctakes-trunk-package/org.apache.ctakes$ctakes-temporal/ws/src/main/java/org/apache/ctakes/temporal/ae/feature/UMLSBasedTokenFeaturesExtractor.java>:[121,17]
[unchecked] unchecked method invocation: method addAll in interface List is applied to given
types
[ERROR]   required: Collection<? extends E>
  found: List
  where E is a type-variable:
    E extends Object declared in interface List
<https://builds.apache.org/job/ctakes-trunk-package/org.apache.ctakes$ctakes-temporal/ws/src/main/java/org/apache/ctakes/temporal/ae/feature/UMLSBasedTokenFeaturesExtractor.java>:[121,45]
[unchecked] unchecked conversion
[ERROR]   required: Collection<? extends E>
  found:    List
  where E is a type-variable:
    E extends Object declared in interface List
<https://builds.apache.org/job/ctakes-trunk-package/org.apache.ctakes$ctakes-temporal/ws/src/main/java/org/apache/ctakes/temporal/ae/EventEventRelationSeedBasedAnnotator.java>:[141,27]
[unchecked] unchecked generic array creation for varargs parameter of type RelationFeaturesExtractor<IdentifiedAnnotation,IdentifiedAnnotation>[]
[ERROR] <https://builds.apache.org/job/ctakes-trunk-package/org.apache.ctakes$ctakes-temporal/ws/src/main/java/org/apache/ctakes/temporal/ae/ConsecutiveSentencesEventEventRelationAnnotator.java>:[58,30]
[deprecation] createPrimitiveDescription(Class<? extends AnalysisComponent>,Object...)
in AnalysisEngineFactory has been deprecated
[ERROR] <https://builds.apache.org/job/ctakes-trunk-package/org.apache.ctakes$ctakes-temporal/ws/src/main/java/org/apache/ctakes/temporal/ae/ConsecutiveSentencesEventEventRelationAnnotator.java>:[73,30]
[deprecation] createPrimitiveDescription(Class<? extends AnalysisComponent>,Object...)
in AnalysisEngineFactory has been deprecated
[ERROR] <https://builds.apache.org/job/ctakes-trunk-package/org.apache.ctakes$ctakes-temporal/ws/src/main/java/org/apache/ctakes/temporal/ae/ConsecutiveSentencesEventEventRelationAnnotator.java>:[83,27]
[unchecked] unchecked generic array creation for varargs parameter of type RelationFeaturesExtractor<IdentifiedAnnotation,IdentifiedAnnotation>[]
[ERROR] <https://builds.apache.org/job/ctakes-trunk-package/org.apache.ctakes$ctakes-temporal/ws/src/main/java/org/apache/ctakes/temporal/ae/TimexAdmissionTimeAnnotator.java>:[78,30]
[deprecation] createPrimitiveDescription(Class<? extends AnalysisComponent>,Object...)
in AnalysisEngineFactory has been deprecated
[ERROR] <https://builds.apache.org/job/ctakes-trunk-package/org.apache.ctakes$ctakes-temporal/ws/src/main/java/org/apache/ctakes/temporal/ae/TimexAdmissionTimeAnnotator.java>:[90,30]
[deprecation] createPrimitiveDescription(Class<? extends AnalysisComponent>,Object...)
in AnalysisEngineFactory has been deprecated
[ERROR] <https://builds.apache.org/job/ctakes-trunk-package/org.apache.ctakes$ctakes-temporal/ws/src/main/java/org/apache/ctakes/temporal/ae/TimexAdmissionTimeAnnotator.java>:[131,4]
[unchecked] unchecked call to TypePathExtractor(Class<T>,String) as a member of the
raw type TypePathExtractor
[ERROR]   where T is a type-variable:
    T extends Annotation declared in class TypePathExtractor
<https://builds.apache.org/job/ctakes-trunk-package/org.apache.ctakes$ctakes-temporal/ws/src/main/java/org/apache/ctakes/temporal/ae/TimexAdmissionTimeAnnotator.java>:[129,37]
[unchecked] unchecked call to CombinedExtractor1(FeatureExtractor1<T>,FeatureExtractor1<T>)
as a member of the raw type CombinedExtractor1
[ERROR]   where T is a type-variable:
    T extends Annotation declared in class CombinedExtractor1
<https://builds.apache.org/job/ctakes-trunk-package/org.apache.ctakes$ctakes-temporal/ws/src/main/java/org/apache/ctakes/temporal/ae/TimexAdmissionTimeAnnotator.java>:[132,26]
[unchecked] unchecked call to CleartkExtractor(Class<SEARCH_T>,FeatureExtractor1<SEARCH_T>,Context...)
as a member of the raw type CleartkExtractor
[ERROR]   where SEARCH_T is a type-variable:
    SEARCH_T extends Annotation declared in class CleartkExtractor
<https://builds.apache.org/job/ctakes-trunk-package/org.apache.ctakes$ctakes-temporal/ws/src/main/java/org/apache/ctakes/temporal/ae/TimexAdmissionTimeAnnotator.java>:[198,58]
[unchecked] unchecked call to extract(JCas,FOCUS_T) as a member of the raw type CleartkExtractor
[ERROR]   where FOCUS_T is a type-variable:
    FOCUS_T extends Annotation declared in class CleartkExtractor
<https://builds.apache.org/job/ctakes-trunk-package/org.apache.ctakes$ctakes-temporal/ws/src/main/java/org/apache/ctakes/temporal/ae/TimexAdmissionTimeAnnotator.java>:[198,58]
[unchecked] unchecked conversion
[ERROR]   required: List<Feature>
  found:    List
<https://builds.apache.org/job/ctakes-trunk-package/org.apache.ctakes$ctakes-temporal/ws/src/main/java/org/apache/ctakes/temporal/ae/feature/MultiTokenFeaturesExtractor.java>:[68,42]
[unchecked] unchecked call to CleartkExtractor(Class<SEARCH_T>,FeatureExtractor1<SEARCH_T>,Context...)
as a member of the raw type CleartkExtractor
[ERROR]   where SEARCH_T is a type-variable:
    SEARCH_T extends Annotation declared in class CleartkExtractor
<https://builds.apache.org/job/ctakes-trunk-package/org.apache.ctakes$ctakes-temporal/ws/src/main/java/org/apache/ctakes/temporal/ae/feature/MultiTokenFeaturesExtractor.java>:[82,3]
[unchecked] unchecked call to CombinedExtractor1(FeatureExtractor1<T>,FeatureExtractor1<T>)
as a member of the raw type CombinedExtractor1
[ERROR]   where T is a type-variable:
    T extends Annotation declared in class CombinedExtractor1
<https://builds.apache.org/job/ctakes-trunk-package/org.apache.ctakes$ctakes-temporal/ws/src/main/java/org/apache/ctakes/temporal/ae/feature/MultiTokenFeaturesExtractor.java>:[80,55]
[unchecked] unchecked call to NamingExtractor1(String,FeatureExtractor1<T>) as a member
of the raw type NamingExtractor1
[ERROR]   where T is a type-variable:
    T extends Annotation declared in class NamingExtractor1
<https://builds.apache.org/job/ctakes-trunk-package/org.apache.ctakes$ctakes-temporal/ws/src/main/java/org/apache/ctakes/temporal/ae/feature/MultiTokenFeaturesExtractor.java>:[89,3]
[unchecked] unchecked call to CombinedExtractor1(FeatureExtractor1<T>,FeatureExtractor1<T>)
as a member of the raw type CombinedExtractor1
[ERROR]   where T is a type-variable:
    T extends Annotation declared in class CombinedExtractor1
<https://builds.apache.org/job/ctakes-trunk-package/org.apache.ctakes$ctakes-temporal/ws/src/main/java/org/apache/ctakes/temporal/ae/feature/MultiTokenFeaturesExtractor.java>:[87,55]
[unchecked] unchecked call to NamingExtractor1(String,FeatureExtractor1<T>) as a member
of the raw type NamingExtractor1
[ERROR]   where T is a type-variable:
    T extends Annotation declared in class NamingExtractor1
<https://builds.apache.org/job/ctakes-trunk-package/org.apache.ctakes$ctakes-temporal/ws/src/main/java/org/apache/ctakes/temporal/ae/feature/MultiTokenFeaturesExtractor.java>:[96,3]
[unchecked] unchecked call to NamingExtractor1(String,FeatureExtractor1<T>) as a member
of the raw type NamingExtractor1
[ERROR]   where T is a type-variable:
    T extends Annotation declared in class NamingExtractor1
<https://builds.apache.org/job/ctakes-trunk-package/org.apache.ctakes$ctakes-temporal/ws/src/main/java/org/apache/ctakes/temporal/ae/feature/MultiTokenFeaturesExtractor.java>:[94,42]
[unchecked] unchecked call to CleartkExtractor(Class<SEARCH_T>,FeatureExtractor1<SEARCH_T>,Context...)
as a member of the raw type CleartkExtractor
[ERROR]   where SEARCH_T is a type-variable:
    SEARCH_T extends Annotation declared in class CleartkExtractor
<https://builds.apache.org/job/ctakes-trunk-package/org.apache.ctakes$ctakes-temporal/ws/src/main/java/org/apache/ctakes/temporal/ae/feature/MultiTokenFeaturesExtractor.java>:[107,44]
[unchecked] unchecked call to DistanceExtractor(String,Class<? extends Annotation>)
as a member of the raw type DistanceExtractor
[ERROR] <https://builds.apache.org/job/ctakes-trunk-package/org.apache.ctakes$ctakes-temporal/ws/src/main/java/org/apache/ctakes/temporal/ae/feature/MultiTokenFeaturesExtractor.java>:[154,57]
[unchecked] unchecked call to extract(JCas,T) as a member of the raw type FeatureExtractor1
[ERROR]   where T is a type-variable:
    T extends Annotation declared in interface FeatureExtractor1
<https://builds.apache.org/job/ctakes-trunk-package/org.apache.ctakes$ctakes-temporal/ws/src/main/java/org/apache/ctakes/temporal/ae/feature/MultiTokenFeaturesExtractor.java>:[154,18]
[unchecked] unchecked method invocation: method addAll in interface List is applied to given
types
[ERROR]   required: Collection<? extends E>
  found: List
  where E is a type-variable:
    E extends Object declared in interface List
<https://builds.apache.org/job/ctakes-trunk-package/org.apache.ctakes$ctakes-temporal/ws/src/main/java/org/apache/ctakes/temporal/ae/feature/MultiTokenFeaturesExtractor.java>:[154,57]
[unchecked] unchecked conversion
[ERROR]   required: Collection<? extends E>
  found:    List
  where E is a type-variable:
    E extends Object declared in interface List
<https://builds.apache.org/job/ctakes-trunk-package/org.apache.ctakes$ctakes-temporal/ws/src/main/java/org/apache/ctakes/temporal/ae/feature/MultiTokenFeaturesExtractor.java>:[156,53]
[unchecked] unchecked call to extractBetween(JCas,FOCUS_T,FOCUS_T) as a member of the raw
type CleartkExtractor
[ERROR]   where FOCUS_T is a type-variable:
    FOCUS_T extends Annotation declared in class CleartkExtractor
<https://builds.apache.org/job/ctakes-trunk-package/org.apache.ctakes$ctakes-temporal/ws/src/main/java/org/apache/ctakes/temporal/ae/feature/MultiTokenFeaturesExtractor.java>:[156,19]
[unchecked] unchecked method invocation: method addAll in interface List is applied to given
types
[ERROR]   required: Collection<? extends E>
  found: List
  where E is a type-variable:
    E extends Object declared in interface List
<https://builds.apache.org/job/ctakes-trunk-package/org.apache.ctakes$ctakes-temporal/ws/src/main/java/org/apache/ctakes/temporal/ae/feature/MultiTokenFeaturesExtractor.java>:[156,53]
[unchecked] unchecked conversion
[ERROR]   required: Collection<? extends E>
  found:    List
  where E is a type-variable:
    E extends Object declared in interface List
<https://builds.apache.org/job/ctakes-trunk-package/org.apache.ctakes$ctakes-temporal/ws/src/main/java/org/apache/ctakes/temporal/ae/feature/MultiTokenFeaturesExtractor.java>:[157,19]
[unchecked] unchecked method invocation: method addAll in interface List is applied to given
types
[ERROR]   required: Collection<? extends E>
  found: List
  where E is a type-variable:
    E extends Object declared in interface List
<https://builds.apache.org/job/ctakes-trunk-package/org.apache.ctakes$ctakes-temporal/ws/src/main/java/org/apache/ctakes/temporal/ae/feature/MultiTokenFeaturesExtractor.java>:[157,47]
[unchecked] unchecked conversion
[ERROR]   required: Collection<? extends E>
  found:    List
  where E is a type-variable:
    E extends Object declared in interface List
<https://builds.apache.org/job/ctakes-trunk-package/org.apache.ctakes$ctakes-temporal/ws/src/main/java/org/apache/ctakes/temporal/ae/feature/MultiTokenFeaturesExtractor.java>:[161,57]
[unchecked] unchecked call to extract(JCas,T) as a member of the raw type FeatureExtractor1
[ERROR]   where T is a type-variable:
    T extends Annotation declared in interface FeatureExtractor1
<https://builds.apache.org/job/ctakes-trunk-package/org.apache.ctakes$ctakes-temporal/ws/src/main/java/org/apache/ctakes/temporal/ae/feature/MultiTokenFeaturesExtractor.java>:[161,18]
[unchecked] unchecked method invocation: method addAll in interface List is applied to given
types
[ERROR]   required: Collection<? extends E>
  found: List
  where E is a type-variable:
    E extends Object declared in interface List
<https://builds.apache.org/job/ctakes-trunk-package/org.apache.ctakes$ctakes-temporal/ws/src/main/java/org/apache/ctakes/temporal/ae/feature/MultiTokenFeaturesExtractor.java>:[161,57]
[unchecked] unchecked conversion
[ERROR]   required: Collection<? extends E>
  found:    List
  where E is a type-variable:
    E extends Object declared in interface List
<https://builds.apache.org/job/ctakes-trunk-package/org.apache.ctakes$ctakes-temporal/ws/src/main/java/org/apache/ctakes/temporal/eval/EvaluationOfTimeSpans.java>:[290,23]
[deprecation] createAnnotatorDescription(File) in TimeAnnotator has been deprecated
[ERROR] <https://builds.apache.org/job/ctakes-trunk-package/org.apache.ctakes$ctakes-temporal/ws/src/main/java/org/apache/ctakes/temporal/ae/CRFTimeAnnotator.java>:[148,8]
[unchecked] unchecked call to TypePathExtractor(Class<T>,String) as a member of the
raw type TypePathExtractor
[ERROR]   where T is a type-variable:
    T extends Annotation declared in class TypePathExtractor
<https://builds.apache.org/job/ctakes-trunk-package/org.apache.ctakes$ctakes-temporal/ws/src/main/java/org/apache/ctakes/temporal/ae/CRFTimeAnnotator.java>:[144,39]
[unchecked] unchecked call to CombinedExtractor1(FeatureExtractor1<T>,FeatureExtractor1<T>,FeatureExtractor1<T>)
as a member of the raw type CombinedExtractor1
[ERROR]   where T is a type-variable:
    T extends Annotation declared in class CombinedExtractor1
<https://builds.apache.org/job/ctakes-trunk-package/org.apache.ctakes$ctakes-temporal/ws/src/main/java/org/apache/ctakes/temporal/ae/CRFTimeAnnotator.java>:[158,38]
[unchecked] unchecked call to CleartkExtractor(Class<SEARCH_T>,FeatureExtractor1<SEARCH_T>,Context...)
as a member of the raw type CleartkExtractor
[ERROR]   where SEARCH_T is a type-variable:
    SEARCH_T extends Annotation declared in class CleartkExtractor
<https://builds.apache.org/job/ctakes-trunk-package/org.apache.ctakes$ctakes-temporal/ws/src/main/java/org/apache/ctakes/temporal/ae/CRFTimeAnnotator.java>:[195,43]
[unchecked] unchecked call to extract(JCas,T) as a member of the raw type FeatureExtractor1
[ERROR]   where T is a type-variable:
    T extends Annotation declared in interface FeatureExtractor1
<https://builds.apache.org/job/ctakes-trunk-package/org.apache.ctakes$ctakes-temporal/ws/src/main/java/org/apache/ctakes/temporal/ae/CRFTimeAnnotator.java>:[195,25]
[unchecked] unchecked method invocation: method addAll in interface List is applied to given
types
[ERROR]   required: Collection<? extends E>
  found: List
  where E is a type-variable:
    E extends Object declared in interface List
<https://builds.apache.org/job/ctakes-trunk-package/org.apache.ctakes$ctakes-temporal/ws/src/main/java/org/apache/ctakes/temporal/ae/CRFTimeAnnotator.java>:[195,43]
[unchecked] unchecked conversion
[ERROR]   required: Collection<? extends E>
  found:    List
  where E is a type-variable:
    E extends Object declared in interface List
<https://builds.apache.org/job/ctakes-trunk-package/org.apache.ctakes$ctakes-temporal/ws/src/main/java/org/apache/ctakes/temporal/ae/CRFTimeAnnotator.java>:[199,49]
[unchecked] unchecked call to extractWithin(JCas,FOCUS_T,Annotation) as a member of the raw
type CleartkExtractor
[ERROR]   where FOCUS_T is a type-variable:
    FOCUS_T extends Annotation declared in class CleartkExtractor
<https://builds.apache.org/job/ctakes-trunk-package/org.apache.ctakes$ctakes-temporal/ws/src/main/java/org/apache/ctakes/temporal/ae/CRFTimeAnnotator.java>:[199,25]
[unchecked] unchecked method invocation: method addAll in interface List is applied to given
types
[ERROR]   required: Collection<? extends E>
  found: List
  where E is a type-variable:
    E extends Object declared in interface List
<https://builds.apache.org/job/ctakes-trunk-package/org.apache.ctakes$ctakes-temporal/ws/src/main/java/org/apache/ctakes/temporal/ae/CRFTimeAnnotator.java>:[199,49]
[unchecked] unchecked conversion
[ERROR]   required: Collection<? extends E>
  found:    List
  where E is a type-variable:
    E extends Object declared in interface List
<https://builds.apache.org/job/ctakes-trunk-package/org.apache.ctakes$ctakes-temporal/ws/src/main/java/org/apache/ctakes/temporal/ae/EventTimeRelationAnnotator.java>:[122,27]
[unchecked] unchecked generic array creation for varargs parameter of type RelationFeaturesExtractor<IdentifiedAnnotation,IdentifiedAnnotation>[]
[ERROR] <https://builds.apache.org/job/ctakes-trunk-package/org.apache.ctakes$ctakes-temporal/ws/src/main/java/org/apache/ctakes/temporal/ae/TemporalRelationExtractorAnnotator.java>:[92,29]
[unchecked] unchecked generic array creation for varargs parameter of type RelationFeaturesExtractor<IdentifiedAnnotation,IdentifiedAnnotation>[]
[ERROR] <https://builds.apache.org/job/ctakes-trunk-package/org.apache.ctakes$ctakes-temporal/ws/src/main/java/org/apache/ctakes/temporal/ae/EventEventRelationAnnotator.java>:[131,27]
[unchecked] unchecked generic array creation for varargs parameter of type RelationFeaturesExtractor<IdentifiedAnnotation,IdentifiedAnnotation>[]
[ERROR] <https://builds.apache.org/job/ctakes-trunk-package/org.apache.ctakes$ctakes-temporal/ws/src/main/java/org/apache/ctakes/temporal/ae/MetaTimeAnnotator.java>:[75,38]
[deprecation] createEnsembleDescription(File,String) in BackwardsTimeAnnotator has been deprecated
[ERROR] <https://builds.apache.org/job/ctakes-trunk-package/org.apache.ctakes$ctakes-temporal/ws/src/main/java/org/apache/ctakes/temporal/ae/MetaTimeAnnotator.java>:[78,46]
[deprecation] createEnsembleDescription(File,String) in ConstituencyBasedTimeAnnotator has
been deprecated
[ERROR] <https://builds.apache.org/job/ctakes-trunk-package/org.apache.ctakes$ctakes-temporal/ws/src/main/java/org/apache/ctakes/temporal/ae/MetaTimeAnnotator.java>:[81,32]
[deprecation] createEnsembleDescription(File,String) in CRFTimeAnnotator has been deprecated
[ERROR] <https://builds.apache.org/job/ctakes-trunk-package/org.apache.ctakes$ctakes-temporal/ws/src/main/java/org/apache/ctakes/temporal/ae/MetaTimeAnnotator.java>:[104,38]
[deprecation] createEnsembleDescription(File,String) in BackwardsTimeAnnotator has been deprecated
[ERROR] <https://builds.apache.org/job/ctakes-trunk-package/org.apache.ctakes$ctakes-temporal/ws/src/main/java/org/apache/ctakes/temporal/ae/MetaTimeAnnotator.java>:[107,46]
[deprecation] createEnsembleDescription(File,String) in ConstituencyBasedTimeAnnotator has
been deprecated
[ERROR] <https://builds.apache.org/job/ctakes-trunk-package/org.apache.ctakes$ctakes-temporal/ws/src/main/java/org/apache/ctakes/temporal/ae/MetaTimeAnnotator.java>:[110,32]
[deprecation] createEnsembleDescription(File,String) in CRFTimeAnnotator has been deprecated
[ERROR] <https://builds.apache.org/job/ctakes-trunk-package/org.apache.ctakes$ctakes-temporal/ws/src/main/java/org/apache/ctakes/temporal/ae/EventAnnotator.java>:[206,8]
[unchecked] unchecked call to TypePathExtractor(Class<T>,String) as a member of the
raw type TypePathExtractor
[ERROR]   where T is a type-variable:
    T extends Annotation declared in class TypePathExtractor
<https://builds.apache.org/job/ctakes-trunk-package/org.apache.ctakes$ctakes-temporal/ws/src/main/java/org/apache/ctakes/temporal/ae/EventAnnotator.java>:[203,33]
[unchecked] unchecked call to CombinedExtractor1(FeatureExtractor1<T>,FeatureExtractor1<T>,FeatureExtractor1<T>)
as a member of the raw type CombinedExtractor1
[ERROR]   where T is a type-variable:
    T extends Annotation declared in class CombinedExtractor1
<https://builds.apache.org/job/ctakes-trunk-package/org.apache.ctakes$ctakes-temporal/ws/src/main/java/org/apache/ctakes/temporal/ae/EventAnnotator.java>:[207,35]
[unchecked] unchecked call to CleartkExtractor(Class<SEARCH_T>,FeatureExtractor1<SEARCH_T>,Context...)
as a member of the raw type CleartkExtractor
[ERROR]   where SEARCH_T is a type-variable:
    SEARCH_T extends Annotation declared in class CleartkExtractor
<https://builds.apache.org/job/ctakes-trunk-package/org.apache.ctakes$ctakes-temporal/ws/src/main/java/org/apache/ctakes/temporal/ae/CrossSentenceTemporalRelationAnnotator.java>:[39,23]
error: cannot find symbol
[INFO] 101 errors 
[INFO] -------------------------------------------------------------

Mime
View raw message