ctakes-notifications mailing list archives

Site index · List index
Message view « Date » · « Thread »
Top « Date » · « Thread »
From Apache Jenkins Server <jenk...@builds.apache.org>
Subject Build failed in Jenkins: ctakes-trunk-compiletest #781
Date Thu, 10 Mar 2016 23:04:36 GMT
See <https://builds.apache.org/job/ctakes-trunk-compiletest/781/changes>

Changes:

[clin] add the first version of cross-sentence temporal relation annotator for THYME data.

------------------------------------------
[...truncated 15203 lines...]
[ERROR] where T is a type-variable:
[ERROR] T extends Annotation declared in class CombinedExtractor1
[ERROR] <https://builds.apache.org/job/ctakes-trunk-compiletest/ws/ctakes-temporal/src/main/java/org/apache/ctakes/temporal/ae/TimexDischargeTimeAnnotator.java>:[130,26]
[unchecked] unchecked call to CleartkExtractor(Class<SEARCH_T>,FeatureExtractor1<SEARCH_T>,Context...)
as a member of the raw type CleartkExtractor
[ERROR] where SEARCH_T is a type-variable:
[ERROR] SEARCH_T extends Annotation declared in class CleartkExtractor
[ERROR] <https://builds.apache.org/job/ctakes-trunk-compiletest/ws/ctakes-temporal/src/main/java/org/apache/ctakes/temporal/ae/TimexDischargeTimeAnnotator.java>:[198,59]
[unchecked] unchecked call to extract(JCas,FOCUS_T) as a member of the raw type CleartkExtractor
[ERROR] where FOCUS_T is a type-variable:
[ERROR] FOCUS_T extends Annotation declared in class CleartkExtractor
[ERROR] <https://builds.apache.org/job/ctakes-trunk-compiletest/ws/ctakes-temporal/src/main/java/org/apache/ctakes/temporal/ae/TimexDischargeTimeAnnotator.java>:[198,59]
[unchecked] unchecked conversion
[ERROR] required: List<Feature>
[ERROR] found:    List
[ERROR] <https://builds.apache.org/job/ctakes-trunk-compiletest/ws/ctakes-temporal/src/main/java/org/apache/ctakes/temporal/ae/EventAnnotator.java>:[206,8]
[unchecked] unchecked call to TypePathExtractor(Class<T>,String) as a member of the
raw type TypePathExtractor
[ERROR] where T is a type-variable:
[ERROR] T extends Annotation declared in class TypePathExtractor
[ERROR] <https://builds.apache.org/job/ctakes-trunk-compiletest/ws/ctakes-temporal/src/main/java/org/apache/ctakes/temporal/ae/EventAnnotator.java>:[203,33]
[unchecked] unchecked call to CombinedExtractor1(FeatureExtractor1<T>,FeatureExtractor1<T>,FeatureExtractor1<T>)
as a member of the raw type CombinedExtractor1
[ERROR] where T is a type-variable:
[ERROR] T extends Annotation declared in class CombinedExtractor1
[ERROR] <https://builds.apache.org/job/ctakes-trunk-compiletest/ws/ctakes-temporal/src/main/java/org/apache/ctakes/temporal/ae/EventAnnotator.java>:[207,35]
[unchecked] unchecked call to CleartkExtractor(Class<SEARCH_T>,FeatureExtractor1<SEARCH_T>,Context...)
as a member of the raw type CleartkExtractor
[ERROR] where SEARCH_T is a type-variable:
[ERROR] SEARCH_T extends Annotation declared in class CleartkExtractor
[ERROR] <https://builds.apache.org/job/ctakes-trunk-compiletest/ws/ctakes-temporal/src/main/java/org/apache/ctakes/temporal/ae/EventAnnotator.java>:[321,58]
[unchecked] unchecked call to extract(JCas,T) as a member of the raw type FeatureExtractor1
[ERROR] where T is a type-variable:
[ERROR] T extends Annotation declared in interface FeatureExtractor1
[ERROR] <https://builds.apache.org/job/ctakes-trunk-compiletest/ws/ctakes-temporal/src/main/java/org/apache/ctakes/temporal/ae/EventAnnotator.java>:[321,23]
[unchecked] unchecked method invocation: method addAll in interface List is applied to given
types
[ERROR] required: Collection<? extends E>
[ERROR] found: List
[ERROR] where E is a type-variable:
[ERROR] E extends Object declared in interface List
[ERROR] <https://builds.apache.org/job/ctakes-trunk-compiletest/ws/ctakes-temporal/src/main/java/org/apache/ctakes/temporal/ae/EventAnnotator.java>:[321,58]
[unchecked] unchecked conversion
[ERROR] required: Collection<? extends E>
[ERROR] found:    List
[ERROR] where E is a type-variable:
[ERROR] E extends Object declared in interface List
[ERROR] <https://builds.apache.org/job/ctakes-trunk-compiletest/ws/ctakes-temporal/src/main/java/org/apache/ctakes/temporal/ae/EventAnnotator.java>:[324,66]
[unchecked] unchecked call to extractWithin(JCas,FOCUS_T,Annotation) as a member of the raw
type CleartkExtractor
[ERROR] where FOCUS_T is a type-variable:
[ERROR] FOCUS_T extends Annotation declared in class CleartkExtractor
[ERROR] <https://builds.apache.org/job/ctakes-trunk-compiletest/ws/ctakes-temporal/src/main/java/org/apache/ctakes/temporal/ae/EventAnnotator.java>:[324,23]
[unchecked] unchecked method invocation: method addAll in interface List is applied to given
types
[ERROR] required: Collection<? extends E>
[ERROR] found: List
[ERROR] where E is a type-variable:
[ERROR] E extends Object declared in interface List
[ERROR] <https://builds.apache.org/job/ctakes-trunk-compiletest/ws/ctakes-temporal/src/main/java/org/apache/ctakes/temporal/ae/EventAnnotator.java>:[324,66]
[unchecked] unchecked conversion
[ERROR] required: Collection<? extends E>
[ERROR] found:    List
[ERROR] where E is a type-variable:
[ERROR] E extends Object declared in interface List
[ERROR] <https://builds.apache.org/job/ctakes-trunk-compiletest/ws/ctakes-temporal/src/main/java/org/apache/ctakes/temporal/ae/feature/UMLSBasedTokenFeaturesExtractor.java>:[38,42]
[unchecked] unchecked call to CleartkExtractor(Class<SEARCH_T>,FeatureExtractor1<SEARCH_T>,Context...)
as a member of the raw type CleartkExtractor
[ERROR] where SEARCH_T is a type-variable:
[ERROR] SEARCH_T extends Annotation declared in class CleartkExtractor
[ERROR] <https://builds.apache.org/job/ctakes-trunk-compiletest/ws/ctakes-temporal/src/main/java/org/apache/ctakes/temporal/ae/feature/UMLSBasedTokenFeaturesExtractor.java>:[50,62]
[unchecked] unchecked call to NamingExtractor1(String,FeatureExtractor1<T>) as a member
of the raw type NamingExtractor1
[ERROR] where T is a type-variable:
[ERROR] T extends Annotation declared in class NamingExtractor1
[ERROR] <https://builds.apache.org/job/ctakes-trunk-compiletest/ws/ctakes-temporal/src/main/java/org/apache/ctakes/temporal/ae/feature/UMLSBasedTokenFeaturesExtractor.java>:[54,62]
[unchecked] unchecked call to NamingExtractor1(String,FeatureExtractor1<T>) as a member
of the raw type NamingExtractor1
[ERROR] where T is a type-variable:
[ERROR] T extends Annotation declared in class NamingExtractor1
[ERROR] <https://builds.apache.org/job/ctakes-trunk-compiletest/ws/ctakes-temporal/src/main/java/org/apache/ctakes/temporal/ae/feature/UMLSBasedTokenFeaturesExtractor.java>:[60,62]
[unchecked] unchecked call to NamingExtractor1(String,FeatureExtractor1<T>) as a member
of the raw type NamingExtractor1
[ERROR] where T is a type-variable:
[ERROR] T extends Annotation declared in class NamingExtractor1
[ERROR] <https://builds.apache.org/job/ctakes-trunk-compiletest/ws/ctakes-temporal/src/main/java/org/apache/ctakes/temporal/ae/feature/UMLSBasedTokenFeaturesExtractor.java>:[64,62]
[unchecked] unchecked call to NamingExtractor1(String,FeatureExtractor1<T>) as a member
of the raw type NamingExtractor1
[ERROR] where T is a type-variable:
[ERROR] T extends Annotation declared in class NamingExtractor1
[ERROR] <https://builds.apache.org/job/ctakes-trunk-compiletest/ws/ctakes-temporal/src/main/java/org/apache/ctakes/temporal/ae/feature/UMLSBasedTokenFeaturesExtractor.java>:[73,3]
[unchecked] unchecked call to NamingExtractor1(String,FeatureExtractor1<T>) as a member
of the raw type NamingExtractor1
[ERROR] where T is a type-variable:
[ERROR] T extends Annotation declared in class NamingExtractor1
[ERROR] <https://builds.apache.org/job/ctakes-trunk-compiletest/ws/ctakes-temporal/src/main/java/org/apache/ctakes/temporal/ae/feature/UMLSBasedTokenFeaturesExtractor.java>:[71,42]
[unchecked] unchecked call to CleartkExtractor(Class<SEARCH_T>,FeatureExtractor1<SEARCH_T>,Context...)
as a member of the raw type CleartkExtractor
[ERROR] where SEARCH_T is a type-variable:
[ERROR] SEARCH_T extends Annotation declared in class CleartkExtractor
[ERROR] <https://builds.apache.org/job/ctakes-trunk-compiletest/ws/ctakes-temporal/src/main/java/org/apache/ctakes/temporal/ae/feature/UMLSBasedTokenFeaturesExtractor.java>:[81,44]
[unchecked] unchecked call to DistanceExtractor(String,Class<? extends Annotation>)
as a member of the raw type DistanceExtractor
[ERROR] <https://builds.apache.org/job/ctakes-trunk-compiletest/ws/ctakes-temporal/src/main/java/org/apache/ctakes/temporal/ae/feature/UMLSBasedTokenFeaturesExtractor.java>:[98,65]
[unchecked] unchecked call to extract(JCas,T) as a member of the raw type FeatureExtractor1
[ERROR] where T is a type-variable:
[ERROR] T extends Annotation declared in interface FeatureExtractor1
[ERROR] <https://builds.apache.org/job/ctakes-trunk-compiletest/ws/ctakes-temporal/src/main/java/org/apache/ctakes/temporal/ae/feature/UMLSBasedTokenFeaturesExtractor.java>:[98,19]
[unchecked] unchecked method invocation: method addAll in interface List is applied to given
types
[ERROR] required: Collection<? extends E>
[ERROR] found: List
[ERROR] where E is a type-variable:
[ERROR] E extends Object declared in interface List
[ERROR] <https://builds.apache.org/job/ctakes-trunk-compiletest/ws/ctakes-temporal/src/main/java/org/apache/ctakes/temporal/ae/feature/UMLSBasedTokenFeaturesExtractor.java>:[98,65]
[unchecked] unchecked conversion
[ERROR] required: Collection<? extends E>
[ERROR] found:    List
[ERROR] where E is a type-variable:
[ERROR] E extends Object declared in interface List
[ERROR] <https://builds.apache.org/job/ctakes-trunk-compiletest/ws/ctakes-temporal/src/main/java/org/apache/ctakes/temporal/ae/feature/UMLSBasedTokenFeaturesExtractor.java>:[99,53]
[unchecked] unchecked call to extractBetween(JCas,FOCUS_T,FOCUS_T) as a member of the raw
type CleartkExtractor
[ERROR] where FOCUS_T is a type-variable:
[ERROR] FOCUS_T extends Annotation declared in class CleartkExtractor
[ERROR] <https://builds.apache.org/job/ctakes-trunk-compiletest/ws/ctakes-temporal/src/main/java/org/apache/ctakes/temporal/ae/feature/UMLSBasedTokenFeaturesExtractor.java>:[99,19]
[unchecked] unchecked method invocation: method addAll in interface List is applied to given
types
[ERROR] required: Collection<? extends E>
[ERROR] found: List
[ERROR] where E is a type-variable:
[ERROR] E extends Object declared in interface List
[ERROR] <https://builds.apache.org/job/ctakes-trunk-compiletest/ws/ctakes-temporal/src/main/java/org/apache/ctakes/temporal/ae/feature/UMLSBasedTokenFeaturesExtractor.java>:[99,53]
[unchecked] unchecked conversion
[ERROR] required: Collection<? extends E>
[ERROR] found:    List
[ERROR] where E is a type-variable:
[ERROR] E extends Object declared in interface List
[ERROR] <https://builds.apache.org/job/ctakes-trunk-compiletest/ws/ctakes-temporal/src/main/java/org/apache/ctakes/temporal/ae/feature/UMLSBasedTokenFeaturesExtractor.java>:[100,19]
[unchecked] unchecked method invocation: method addAll in interface List is applied to given
types
[ERROR] required: Collection<? extends E>
[ERROR] found: List
[ERROR] where E is a type-variable:
[ERROR] E extends Object declared in interface List
[ERROR] <https://builds.apache.org/job/ctakes-trunk-compiletest/ws/ctakes-temporal/src/main/java/org/apache/ctakes/temporal/ae/feature/UMLSBasedTokenFeaturesExtractor.java>:[100,47]
[unchecked] unchecked conversion
[ERROR] required: Collection<? extends E>
[ERROR] found:    List
[ERROR] where E is a type-variable:
[ERROR] E extends Object declared in interface List
[ERROR] <https://builds.apache.org/job/ctakes-trunk-compiletest/ws/ctakes-temporal/src/main/java/org/apache/ctakes/temporal/ae/feature/UMLSBasedTokenFeaturesExtractor.java>:[111,65]
[unchecked] unchecked call to extract(JCas,T) as a member of the raw type FeatureExtractor1
[ERROR] where T is a type-variable:
[ERROR] T extends Annotation declared in interface FeatureExtractor1
[ERROR] <https://builds.apache.org/job/ctakes-trunk-compiletest/ws/ctakes-temporal/src/main/java/org/apache/ctakes/temporal/ae/feature/UMLSBasedTokenFeaturesExtractor.java>:[111,19]
[unchecked] unchecked method invocation: method addAll in interface List is applied to given
types
[ERROR] required: Collection<? extends E>
[ERROR] found: List
[ERROR] where E is a type-variable:
[ERROR] E extends Object declared in interface List
[ERROR] <https://builds.apache.org/job/ctakes-trunk-compiletest/ws/ctakes-temporal/src/main/java/org/apache/ctakes/temporal/ae/feature/UMLSBasedTokenFeaturesExtractor.java>:[111,65]
[unchecked] unchecked conversion
[ERROR] required: Collection<? extends E>
[ERROR] found:    List
[ERROR] where E is a type-variable:
[ERROR] E extends Object declared in interface List
[ERROR] <https://builds.apache.org/job/ctakes-trunk-compiletest/ws/ctakes-temporal/src/main/java/org/apache/ctakes/temporal/ae/feature/UMLSBasedTokenFeaturesExtractor.java>:[112,53]
[unchecked] unchecked call to extractBetween(JCas,FOCUS_T,FOCUS_T) as a member of the raw
type CleartkExtractor
[ERROR] where FOCUS_T is a type-variable:
[ERROR] FOCUS_T extends Annotation declared in class CleartkExtractor
[ERROR] <https://builds.apache.org/job/ctakes-trunk-compiletest/ws/ctakes-temporal/src/main/java/org/apache/ctakes/temporal/ae/feature/UMLSBasedTokenFeaturesExtractor.java>:[112,19]
[unchecked] unchecked method invocation: method addAll in interface List is applied to given
types
[ERROR] required: Collection<? extends E>
[ERROR] found: List
[ERROR] where E is a type-variable:
[ERROR] E extends Object declared in interface List
[ERROR] <https://builds.apache.org/job/ctakes-trunk-compiletest/ws/ctakes-temporal/src/main/java/org/apache/ctakes/temporal/ae/feature/UMLSBasedTokenFeaturesExtractor.java>:[112,53]
[unchecked] unchecked conversion
[ERROR] required: Collection<? extends E>
[ERROR] found:    List
[ERROR] where E is a type-variable:
[ERROR] E extends Object declared in interface List
[ERROR] <https://builds.apache.org/job/ctakes-trunk-compiletest/ws/ctakes-temporal/src/main/java/org/apache/ctakes/temporal/ae/feature/UMLSBasedTokenFeaturesExtractor.java>:[113,19]
[unchecked] unchecked method invocation: method addAll in interface List is applied to given
types
[ERROR] required: Collection<? extends E>
[ERROR] found: List
[ERROR] where E is a type-variable:
[ERROR] E extends Object declared in interface List
[ERROR] <https://builds.apache.org/job/ctakes-trunk-compiletest/ws/ctakes-temporal/src/main/java/org/apache/ctakes/temporal/ae/feature/UMLSBasedTokenFeaturesExtractor.java>:[113,47]
[unchecked] unchecked conversion
[ERROR] required: Collection<? extends E>
[ERROR] found:    List
[ERROR] where E is a type-variable:
[ERROR] E extends Object declared in interface List
[ERROR] <https://builds.apache.org/job/ctakes-trunk-compiletest/ws/ctakes-temporal/src/main/java/org/apache/ctakes/temporal/ae/feature/UMLSBasedTokenFeaturesExtractor.java>:[118,63]
[unchecked] unchecked call to extract(JCas,T) as a member of the raw type FeatureExtractor1
[ERROR] where T is a type-variable:
[ERROR] T extends Annotation declared in interface FeatureExtractor1
[ERROR] <https://builds.apache.org/job/ctakes-trunk-compiletest/ws/ctakes-temporal/src/main/java/org/apache/ctakes/temporal/ae/feature/UMLSBasedTokenFeaturesExtractor.java>:[118,17]
[unchecked] unchecked method invocation: method addAll in interface List is applied to given
types
[ERROR] required: Collection<? extends E>
[ERROR] found: List
[ERROR] where E is a type-variable:
[ERROR] E extends Object declared in interface List
[ERROR] <https://builds.apache.org/job/ctakes-trunk-compiletest/ws/ctakes-temporal/src/main/java/org/apache/ctakes/temporal/ae/feature/UMLSBasedTokenFeaturesExtractor.java>:[118,63]
[unchecked] unchecked conversion
[ERROR] required: Collection<? extends E>
[ERROR] found:    List
[ERROR] where E is a type-variable:
[ERROR] E extends Object declared in interface List
[ERROR] <https://builds.apache.org/job/ctakes-trunk-compiletest/ws/ctakes-temporal/src/main/java/org/apache/ctakes/temporal/ae/feature/UMLSBasedTokenFeaturesExtractor.java>:[119,63]
[unchecked] unchecked call to extract(JCas,T) as a member of the raw type FeatureExtractor1
[ERROR] where T is a type-variable:
[ERROR] T extends Annotation declared in interface FeatureExtractor1
[ERROR] <https://builds.apache.org/job/ctakes-trunk-compiletest/ws/ctakes-temporal/src/main/java/org/apache/ctakes/temporal/ae/feature/UMLSBasedTokenFeaturesExtractor.java>:[119,17]
[unchecked] unchecked method invocation: method addAll in interface List is applied to given
types
[ERROR] required: Collection<? extends E>
[ERROR] found: List
[ERROR] where E is a type-variable:
[ERROR] E extends Object declared in interface List
[ERROR] <https://builds.apache.org/job/ctakes-trunk-compiletest/ws/ctakes-temporal/src/main/java/org/apache/ctakes/temporal/ae/feature/UMLSBasedTokenFeaturesExtractor.java>:[119,63]
[unchecked] unchecked conversion
[ERROR] required: Collection<? extends E>
[ERROR] found:    List
[ERROR] where E is a type-variable:
[ERROR] E extends Object declared in interface List
[ERROR] <https://builds.apache.org/job/ctakes-trunk-compiletest/ws/ctakes-temporal/src/main/java/org/apache/ctakes/temporal/ae/feature/UMLSBasedTokenFeaturesExtractor.java>:[120,51]
[unchecked] unchecked call to extractBetween(JCas,FOCUS_T,FOCUS_T) as a member of the raw
type CleartkExtractor
[ERROR] where FOCUS_T is a type-variable:
[ERROR] FOCUS_T extends Annotation declared in class CleartkExtractor
[ERROR] <https://builds.apache.org/job/ctakes-trunk-compiletest/ws/ctakes-temporal/src/main/java/org/apache/ctakes/temporal/ae/feature/UMLSBasedTokenFeaturesExtractor.java>:[120,17]
[unchecked] unchecked method invocation: method addAll in interface List is applied to given
types
[ERROR] required: Collection<? extends E>
[ERROR] found: List
[ERROR] where E is a type-variable:
[ERROR] E extends Object declared in interface List
[ERROR] <https://builds.apache.org/job/ctakes-trunk-compiletest/ws/ctakes-temporal/src/main/java/org/apache/ctakes/temporal/ae/feature/UMLSBasedTokenFeaturesExtractor.java>:[120,51]
[unchecked] unchecked conversion
[ERROR] required: Collection<? extends E>
[ERROR] found:    List
[ERROR] where E is a type-variable:
[ERROR] E extends Object declared in interface List
[ERROR] <https://builds.apache.org/job/ctakes-trunk-compiletest/ws/ctakes-temporal/src/main/java/org/apache/ctakes/temporal/ae/feature/UMLSBasedTokenFeaturesExtractor.java>:[121,17]
[unchecked] unchecked method invocation: method addAll in interface List is applied to given
types
[ERROR] required: Collection<? extends E>
[ERROR] found: List
[ERROR] where E is a type-variable:
[ERROR] E extends Object declared in interface List
[ERROR] <https://builds.apache.org/job/ctakes-trunk-compiletest/ws/ctakes-temporal/src/main/java/org/apache/ctakes/temporal/ae/feature/UMLSBasedTokenFeaturesExtractor.java>:[121,45]
[unchecked] unchecked conversion
[ERROR] required: Collection<? extends E>
[ERROR] found:    List
[ERROR] where E is a type-variable:
[ERROR] E extends Object declared in interface List
[ERROR] <https://builds.apache.org/job/ctakes-trunk-compiletest/ws/ctakes-temporal/src/main/java/org/apache/ctakes/temporal/ae/TimeAnnotator.java>:[188,4]
[unchecked] unchecked call to TypePathExtractor(Class<T>,String) as a member of the
raw type TypePathExtractor
[ERROR] where T is a type-variable:
[ERROR] T extends Annotation declared in class TypePathExtractor
[ERROR] <https://builds.apache.org/job/ctakes-trunk-compiletest/ws/ctakes-temporal/src/main/java/org/apache/ctakes/temporal/ae/TimeAnnotator.java>:[184,37]
[unchecked] unchecked call to CombinedExtractor1(FeatureExtractor1<T>,FeatureExtractor1<T>,FeatureExtractor1<T>,FeatureExtractor1<T>,FeatureExtractor1<T>)
as a member of the raw type CombinedExtractor1
[ERROR] where T is a type-variable:
[ERROR] T extends Annotation declared in class CombinedExtractor1
[ERROR] <https://builds.apache.org/job/ctakes-trunk-compiletest/ws/ctakes-temporal/src/main/java/org/apache/ctakes/temporal/ae/TimeAnnotator.java>:[198,36]
[unchecked] unchecked call to CleartkExtractor(Class<SEARCH_T>,FeatureExtractor1<SEARCH_T>,Context...)
as a member of the raw type CleartkExtractor
[ERROR] where SEARCH_T is a type-variable:
[ERROR] SEARCH_T extends Annotation declared in class CleartkExtractor
[ERROR] <https://builds.apache.org/job/ctakes-trunk-compiletest/ws/ctakes-temporal/src/main/java/org/apache/ctakes/temporal/ae/TimeAnnotator.java>:[251,38]
[unchecked] unchecked call to extract(JCas,T) as a member of the raw type FeatureExtractor1
[ERROR] where T is a type-variable:
[ERROR] T extends Annotation declared in interface FeatureExtractor1
[ERROR] <https://builds.apache.org/job/ctakes-trunk-compiletest/ws/ctakes-temporal/src/main/java/org/apache/ctakes/temporal/ae/TimeAnnotator.java>:[251,20]
[unchecked] unchecked method invocation: method addAll in interface List is applied to given
types
[ERROR] required: Collection<? extends E>
[ERROR] found: List
[ERROR] where E is a type-variable:
[ERROR] E extends Object declared in interface List
[ERROR] <https://builds.apache.org/job/ctakes-trunk-compiletest/ws/ctakes-temporal/src/main/java/org/apache/ctakes/temporal/ae/TimeAnnotator.java>:[251,38]
[unchecked] unchecked conversion
[ERROR] required: Collection<? extends E>
[ERROR] found:    List
[ERROR] where E is a type-variable:
[ERROR] E extends Object declared in interface List
[ERROR] <https://builds.apache.org/job/ctakes-trunk-compiletest/ws/ctakes-temporal/src/main/java/org/apache/ctakes/temporal/ae/TimeAnnotator.java>:[255,44]
[unchecked] unchecked call to extractWithin(JCas,FOCUS_T,Annotation) as a member of the raw
type CleartkExtractor
[ERROR] where FOCUS_T is a type-variable:
[ERROR] FOCUS_T extends Annotation declared in class CleartkExtractor
[ERROR] <https://builds.apache.org/job/ctakes-trunk-compiletest/ws/ctakes-temporal/src/main/java/org/apache/ctakes/temporal/ae/TimeAnnotator.java>:[255,20]
[unchecked] unchecked method invocation: method addAll in interface List is applied to given
types
[ERROR] required: Collection<? extends E>
[ERROR] found: List
[ERROR] where E is a type-variable:
[ERROR] E extends Object declared in interface List
[ERROR] <https://builds.apache.org/job/ctakes-trunk-compiletest/ws/ctakes-temporal/src/main/java/org/apache/ctakes/temporal/ae/TimeAnnotator.java>:[255,44]
[unchecked] unchecked conversion
[ERROR] required: Collection<? extends E>
[ERROR] found:    List
[ERROR] where E is a type-variable:
[ERROR] E extends Object declared in interface List
[ERROR] <https://builds.apache.org/job/ctakes-trunk-compiletest/ws/ctakes-temporal/src/main/java/org/apache/ctakes/temporal/ae/ContextualModalityAnnotator.java>:[94,8]
[unchecked] unchecked call to TypePathExtractor(Class<T>,String) as a member of the
raw type TypePathExtractor
[ERROR] where T is a type-variable:
[ERROR] T extends Annotation declared in class TypePathExtractor
[ERROR] <https://builds.apache.org/job/ctakes-trunk-compiletest/ws/ctakes-temporal/src/main/java/org/apache/ctakes/temporal/ae/ContextualModalityAnnotator.java>:[92,39]
[unchecked] unchecked call to CombinedExtractor1(FeatureExtractor1<T>,FeatureExtractor1<T>)
as a member of the raw type CombinedExtractor1
[ERROR] where T is a type-variable:
[ERROR] T extends Annotation declared in class CombinedExtractor1
[ERROR] <https://builds.apache.org/job/ctakes-trunk-compiletest/ws/ctakes-temporal/src/main/java/org/apache/ctakes/temporal/ae/ContextualModalityAnnotator.java>:[96,28]
[unchecked] unchecked call to CleartkExtractor(Class<SEARCH_T>,FeatureExtractor1<SEARCH_T>,Context...)
as a member of the raw type CleartkExtractor
[ERROR] where SEARCH_T is a type-variable:
[ERROR] SEARCH_T extends Annotation declared in class CleartkExtractor
[ERROR] <https://builds.apache.org/job/ctakes-trunk-compiletest/ws/ctakes-temporal/src/main/java/org/apache/ctakes/temporal/ae/ContextualModalityAnnotator.java>:[109,62]
[unchecked] unchecked call to extract(JCas,FOCUS_T) as a member of the raw type CleartkExtractor
[ERROR] where FOCUS_T is a type-variable:
[ERROR] FOCUS_T extends Annotation declared in class CleartkExtractor
[ERROR] <https://builds.apache.org/job/ctakes-trunk-compiletest/ws/ctakes-temporal/src/main/java/org/apache/ctakes/temporal/ae/CrossSentenceTemporalRelationAnnotator.java>:[39,23]
error: cannot find symbol
[ERROR] -> [Help 1]
[ERROR] 
[ERROR] To see the full stack trace of the errors, re-run Maven with the -e switch.
[ERROR] Re-run Maven using the -X switch to enable full debug logging.
[ERROR] 
[ERROR] For more information about the errors and possible solutions, please read the following
articles:
[ERROR] [Help 1] http://cwiki.apache.org/confluence/display/MAVEN/MojoFailureException
[ERROR] 
[ERROR] After correcting the problems, you can resume the build with the command
[ERROR]   mvn <goals> -rf :ctakes-temporal
Sending e-mails to: notifications@ctakes.apache.org clin@yelp.com
channel stopped

Mime
View raw message