ctakes-notifications mailing list archives

Site index · List index
Message view « Date » · « Thread »
Top « Date » · « Thread »
From Apache Jenkins Server <jenk...@builds.apache.org>
Subject Build failed in Jenkins: ctakes-trunk-compiletest #741
Date Tue, 24 Nov 2015 19:49:07 GMT
See <https://builds.apache.org/job/ctakes-trunk-compiletest/741/>

------------------------------------------
[...truncated 4641 lines...]
[INFO] 
[INFO] --- maven-resources-plugin:2.5:resources (default-resources) @ ctakes-utils ---
[debug] execute contextualize
[INFO] Using 'UTF-8' encoding to copy filtered resources.
[INFO] skip non existing resourceDirectory <https://builds.apache.org/job/ctakes-trunk-compiletest/ws/ctakes-utils/src/main/resources>
[INFO] Copying 3 resources
[INFO] 
[INFO] --- maven-compiler-plugin:2.4:compile (default-compile) @ ctakes-utils ---
[INFO] Compiling 30 source files to <https://builds.apache.org/job/ctakes-trunk-compiletest/ws/ctakes-utils/target/classes>
[WARNING] <https://builds.apache.org/job/ctakes-trunk-compiletest/ws/ctakes-utils/src/main/java/org/apache/ctakes/utils/wiki/WikiIndex.java>:[92,28]
[deprecation] open(Directory) in IndexReader has been deprecated
[WARNING] <https://builds.apache.org/job/ctakes-trunk-compiletest/ws/ctakes-utils/src/main/java/org/apache/ctakes/utils/wiki/WikiIndex.java>:[293,60]
[deprecation] LUCENE_30 in Version has been deprecated
[INFO] 
[INFO] --- maven-remote-resources-plugin:1.4:process (default) @ ctakes-utils ---
[INFO] 
[INFO] --- maven-resources-plugin:2.5:resources (default-resources) @ ctakes-utils ---
[debug] execute contextualize
[INFO] Using 'UTF-8' encoding to copy filtered resources.
[INFO] skip non existing resourceDirectory <https://builds.apache.org/job/ctakes-trunk-compiletest/ws/ctakes-utils/src/main/resources>
[INFO] Copying 3 resources
[INFO] Copying 3 resources
[INFO] 
[INFO] --- maven-compiler-plugin:2.4:compile (default-compile) @ ctakes-utils ---
[INFO] Nothing to compile - all classes are up to date
[INFO] 
[INFO] --- maven-resources-plugin:2.5:testResources (default-testResources) @ ctakes-utils
---
[debug] execute contextualize
[INFO] Using 'UTF-8' encoding to copy filtered resources.
[INFO] skip non existing resourceDirectory <https://builds.apache.org/job/ctakes-trunk-compiletest/ws/ctakes-utils/src/test/resources>
[INFO] Copying 3 resources
[INFO] Copying 3 resources
[INFO] 
[INFO] --- maven-compiler-plugin:2.4:testCompile (default-testCompile) @ ctakes-utils ---
[INFO] No sources to compile
[INFO] 
[INFO] --- maven-surefire-plugin:2.12.1:test (default-test) @ ctakes-utils ---
[INFO] Surefire report directory: <https://builds.apache.org/job/ctakes-trunk-compiletest/ws/ctakes-utils/target/surefire-reports>

-------------------------------------------------------
 T E S T S
-------------------------------------------------------

Results :

Tests run: 0, Failures: 0, Errors: 0, Skipped: 0

[JENKINS] Recording test results
[JENKINS] Archiving disabled
[INFO]                                                                         
[INFO] ------------------------------------------------------------------------
[INFO] Building Apache cTAKES Resources core 3.2.3-SNAPSHOT
[INFO] ------------------------------------------------------------------------
[INFO] 
[INFO] --- maven-clean-plugin:2.4.1:clean (default-clean) @ ctakes-core-res ---
[INFO] 
[INFO] --- maven-remote-resources-plugin:1.4:process (default) @ ctakes-core-res ---
[INFO] 
[INFO] --- maven-resources-plugin:2.5:resources (default-resources) @ ctakes-core-res ---
[debug] execute contextualize
[INFO] Using 'UTF-8' encoding to copy filtered resources.
[INFO] Copying 16 resources
[INFO] Copying 3 resources
[INFO] 
[INFO] --- maven-compiler-plugin:2.4:compile (default-compile) @ ctakes-core-res ---
[INFO] No sources to compile
[INFO] 
[INFO] --- maven-remote-resources-plugin:1.4:process (default) @ ctakes-core-res ---
[INFO] 
[INFO] --- maven-resources-plugin:2.5:resources (default-resources) @ ctakes-core-res ---
[debug] execute contextualize
[INFO] Using 'UTF-8' encoding to copy filtered resources.
[INFO] Copying 16 resources
[INFO] Copying 3 resources
[INFO] Copying 3 resources
[INFO] 
[INFO] --- maven-compiler-plugin:2.4:compile (default-compile) @ ctakes-core-res ---
[INFO] No sources to compile
[INFO] 
[INFO] --- maven-resources-plugin:2.5:testResources (default-testResources) @ ctakes-core-res
---
[debug] execute contextualize
[INFO] Using 'UTF-8' encoding to copy filtered resources.
[INFO] skip non existing resourceDirectory <https://builds.apache.org/job/ctakes-trunk-compiletest/ws/ctakes-core-res/src/test/resources>
[INFO] Copying 3 resources
[INFO] Copying 3 resources
[INFO] 
[INFO] --- maven-compiler-plugin:2.4:testCompile (default-testCompile) @ ctakes-core-res ---
[INFO] No sources to compile
[INFO] 
[INFO] --- maven-surefire-plugin:2.12.1:test (default-test) @ ctakes-core-res ---
[INFO] Surefire report directory: <https://builds.apache.org/job/ctakes-trunk-compiletest/ws/ctakes-core-res/target/surefire-reports>

-------------------------------------------------------
 T E S T S
-------------------------------------------------------

Results :

Tests run: 0, Failures: 0, Errors: 0, Skipped: 0

[JENKINS] Recording test results
[JENKINS] Archiving disabled
[INFO]                                                                         
[INFO] ------------------------------------------------------------------------
[INFO] Building Apache cTAKES core 3.2.3-SNAPSHOT
[INFO] ------------------------------------------------------------------------
[INFO] 
[INFO] --- maven-clean-plugin:2.4.1:clean (default-clean) @ ctakes-core ---
[INFO] 
[INFO] --- maven-remote-resources-plugin:1.4:process (default) @ ctakes-core ---
[INFO] 
[INFO] --- maven-resources-plugin:2.5:resources (default-resources) @ ctakes-core ---
[debug] execute contextualize
[INFO] Using 'UTF-8' encoding to copy filtered resources.
[INFO] skip non existing resourceDirectory <https://builds.apache.org/job/ctakes-trunk-compiletest/ws/ctakes-core/src/main/resources>
[INFO] Copying 3 resources
[INFO] 
[INFO] --- maven-compiler-plugin:2.4:compile (default-compile) @ ctakes-core ---
[INFO] Compiling 166 source files to <https://builds.apache.org/job/ctakes-trunk-compiletest/ws/ctakes-core/target/classes>
[INFO] -------------------------------------------------------------
[ERROR] COMPILATION ERROR : 
[INFO] -------------------------------------------------------------
[ERROR] <https://builds.apache.org/job/ctakes-trunk-compiletest/ws/ctakes-core/src/main/java/org/apache/ctakes/core/util/OntologyConceptUtil.java>:[37,19]
error: lambda expressions are not supported in -source 1.7
[ERROR]   (use -source 8 or higher to enable lambda expressions)
<https://builds.apache.org/job/ctakes-trunk-compiletest/ws/ctakes-core/src/main/java/org/apache/ctakes/core/util/OntologyConceptUtil.java>:[82,40]
error: method references are not supported in -source 1.7
[INFO] 2 errors 
[INFO] -------------------------------------------------------------
[JENKINS] Archiving disabled
[INFO] ------------------------------------------------------------------------
[INFO] Reactor Summary:
[INFO] 
[INFO] Apache cTAKES ..................................... SUCCESS [1.017s]
[INFO] Apache cTAKES common type system .................. SUCCESS [9.223s]
[INFO] Apache cTAKES utils ............................... SUCCESS [2.058s]
[INFO] Apache cTAKES Resources core ...................... SUCCESS [0.647s]
[INFO] Apache cTAKES core ................................ FAILURE [0.570s]
[INFO] Apache cTAKES Resources pos-tagger ................ SKIPPED
[INFO] Apache cTAKES part-of-speech tagger ............... SKIPPED
[INFO] Apache cTAKES Resources ctakes-chunker-res ........ SKIPPED
[INFO] Apache cTAKES chunker ............................. SKIPPED
[INFO] Apache cTAKES document preprocessor ............... SKIPPED
[INFO] Apache cTAKES Resources dictionary-lookup ......... SKIPPED
[INFO] Apache cTAKES dictionary lookup ................... SKIPPED
[INFO] Apache cTAKES context dependent tokenizer ......... SKIPPED
[INFO] Apache cTAKES Resources lvg ....................... SKIPPED
[INFO] Apache cTAKES LVG lexical tools ................... SKIPPED
[INFO] Apache cTAKES Resources ne-contexts ............... SKIPPED
[INFO] Apache cTAKES named entity contexts ............... SKIPPED
[INFO] Apache cTAKES Resources constituency-parser ....... SKIPPED
[INFO] Apache cTAKES Constituency Parser ................. SKIPPED
[INFO] Apache cTAKES Resources coreference ............... SKIPPED
[INFO] Apache cTAKES Resources relation-extractor ........ SKIPPED
[INFO] Apache cTAKES Resources dependency-parser ......... SKIPPED
[INFO] Apache cTAKES Dependency Parser ................... SKIPPED
[INFO] Apache cTAKES Relation Extractor .................. SKIPPED
[INFO] Apache cTAKES CoReference Resolver ................ SKIPPED
[INFO] Apache cTAKES Resources drug-ner .................. SKIPPED
[INFO] Apache cTAKES Drug NER ............................ SKIPPED
[INFO] Apache cTAKES Resources side-effect ............... SKIPPED
[INFO] Apache cTAKES Side Effects ........................ SKIPPED
[INFO] Apache cTAKES Resources smoking-status ............ SKIPPED
[INFO] Apache cTAKES Smoking Status ...................... SKIPPED
[INFO] Apache cTAKES Resources assertion ................. SKIPPED
[INFO] Apache cTAKES Assertion ........................... SKIPPED
[INFO] Apache cTAKES Resources assertion-zoner ........... SKIPPED
[INFO] Apache cTAKES Assertion's zoner ................... SKIPPED
[INFO] Apache cTAKES Resources temporal .................. SKIPPED
[INFO] Apache cTAKES Resources dictionary-lookup-fast-res  SKIPPED
[INFO] Apache cTAKES dictionary lookup fast .............. SKIPPED
[INFO] Apache cTAKES Resources ctakes-ytex-res ........... SKIPPED
[INFO] Apache cTAKES YTEX ................................ SKIPPED
[INFO] Apache cTAKES YTEX UIMA ........................... SKIPPED
[INFO] Apache cTAKES ctakes-clinical-pipeline ............ SKIPPED
[INFO] Apache cTAKES Temporal Information Extraction ..... SKIPPED
[INFO] Apache cTAKES YTEX Web ............................ SKIPPED
[INFO] Apache cTAKES Distribution ........................ SKIPPED
[INFO] Apache cTAKES Regression-test ..................... SKIPPED
[INFO] Apache cTAKES template filler ..................... SKIPPED
[INFO] ctakes-examples ................................... SKIPPED
[INFO] ------------------------------------------------------------------------
[INFO] BUILD FAILURE
[INFO] ------------------------------------------------------------------------
[INFO] Total time: 14.978s
[INFO] Finished at: Tue Nov 24 19:49:05 UTC 2015
[INFO] Final Memory: 37M/469M
[INFO] ------------------------------------------------------------------------
[JENKINS] Archiving disabled
[JENKINS] Archiving disabled
[JENKINS] Archiving disabled
[JENKINS] Archiving disabled
[JENKINS] Archiving disabled
[JENKINS] Archiving disabled
[JENKINS] Archiving disabled
[JENKINS] Archiving disabled
[JENKINS] Archiving disabled
[JENKINS] Archiving disabled
[JENKINS] Archiving disabled
[JENKINS] Archiving disabled
[JENKINS] Archiving disabled
[JENKINS] Archiving disabled
[JENKINS] Archiving disabled
[JENKINS] Archiving disabled
[JENKINS] Archiving disabled
[JENKINS] Archiving disabled
[JENKINS] Archiving disabled
[JENKINS] Archiving disabled
[JENKINS] Archiving disabled
[JENKINS] Archiving disabled
[JENKINS] Archiving disabled
[JENKINS] Archiving disabled
[JENKINS] Archiving disabled
[JENKINS] Archiving disabled
[JENKINS] Archiving disabled
[JENKINS] Archiving disabled
[JENKINS] Archiving disabled
[JENKINS] Archiving disabled
[JENKINS] Archiving disabled
[JENKINS] Archiving disabled
[JENKINS] Archiving disabled
[JENKINS] Archiving disabled
[JENKINS] Archiving disabled
[JENKINS] Archiving disabled
[JENKINS] Archiving disabled
[JENKINS] Archiving disabled
[JENKINS] Archiving disabled
[JENKINS] Archiving disabled
[JENKINS] Archiving disabled
[JENKINS] Archiving disabled
[JENKINS] Archiving disabled
[JENKINS] Archiving disabled
[JENKINS] Archiving disabled
[JENKINS] Archiving disabled
[JENKINS] Archiving disabled
[JENKINS] Archiving disabled
Waiting for Jenkins to finish collecting data
[ERROR] Failed to execute goal org.apache.maven.plugins:maven-compiler-plugin:2.4:compile
(default-compile) on project ctakes-core: Compilation failure: Compilation failure:
[ERROR] <https://builds.apache.org/job/ctakes-trunk-compiletest/ws/ctakes-core/src/main/java/org/apache/ctakes/core/util/OntologyConceptUtil.java>:[37,19]
error: lambda expressions are not supported in -source 1.7
[ERROR] (use -source 8 or higher to enable lambda expressions)
[ERROR] <https://builds.apache.org/job/ctakes-trunk-compiletest/ws/ctakes-core/src/main/java/org/apache/ctakes/core/util/OntologyConceptUtil.java>:[82,40]
error: method references are not supported in -source 1.7
[ERROR] -> [Help 1]
[ERROR] 
[ERROR] To see the full stack trace of the errors, re-run Maven with the -e switch.
[ERROR] Re-run Maven using the -X switch to enable full debug logging.
[ERROR] 
[ERROR] For more information about the errors and possible solutions, please read the following
articles:
[ERROR] [Help 1] http://cwiki.apache.org/confluence/display/MAVEN/MojoFailureException
[ERROR] 
[ERROR] After correcting the problems, you can resume the build with the command
[ERROR]   mvn <goals> -rf :ctakes-core
Sending e-mails to: notifications@ctakes.apache.org
channel stopped

Mime
View raw message