ctakes-notifications mailing list archives

Site index · List index
Message view « Date » · « Thread »
Top « Date » · « Thread »
From Apache Jenkins Server <jenk...@builds.apache.org>
Subject Build failed in Jenkins: ctakes-trunk-compiletest » Apache cTAKES core #739
Date Tue, 24 Nov 2015 05:34:43 GMT
See <https://builds.apache.org/job/ctakes-trunk-compiletest/org.apache.ctakes$ctakes-core/739/changes>

Changes:

[seanfinan] Refactored for OntologyConceptUtil rename

[seanfinan] IdentifiedAnnotationUtil renamed OntologyConceptUtil
OntologyConceptUtilTester added
OntologyConceptUtil added more methods to get collections of cuis, tuis, codes
OntologyConceptUtil added methods to get IdentifiedAnnotation by cui, tui, code

[seanfinan] DefaultTextSpan declared @Immutable, added toString() that returns "begin, end"

------------------------------------------
[INFO]                                                                         
[INFO] ------------------------------------------------------------------------
[INFO] Building Apache cTAKES core 3.2.3-SNAPSHOT
[INFO] ------------------------------------------------------------------------
[INFO] 
[INFO] --- maven-clean-plugin:2.4.1:clean (default-clean) @ ctakes-core ---
[INFO] 
[INFO] --- maven-remote-resources-plugin:1.4:process (default) @ ctakes-core ---
[INFO] 
[INFO] --- maven-resources-plugin:2.5:resources (default-resources) @ ctakes-core ---
[debug] execute contextualize
[INFO] Using 'UTF-8' encoding to copy filtered resources.
[INFO] skip non existing resourceDirectory <https://builds.apache.org/job/ctakes-trunk-compiletest/org.apache.ctakes$ctakes-core/ws/src/main/resources>
[INFO] Copying 3 resources
[INFO] 
[INFO] --- maven-compiler-plugin:2.4:compile (default-compile) @ ctakes-core ---
[INFO] Compiling 166 source files to <https://builds.apache.org/job/ctakes-trunk-compiletest/org.apache.ctakes$ctakes-core/ws/target/classes>
[INFO] -------------------------------------------------------------
[ERROR] COMPILATION ERROR : 
[INFO] -------------------------------------------------------------
[ERROR] <https://builds.apache.org/job/ctakes-trunk-compiletest/org.apache.ctakes$ctakes-core/ws/src/main/java/org/apache/ctakes/core/util/OntologyConceptUtil.java>:[37,20]
error: illegal start of expression
[ERROR] <https://builds.apache.org/job/ctakes-trunk-compiletest/org.apache.ctakes$ctakes-core/ws/src/main/java/org/apache/ctakes/core/util/OntologyConceptUtil.java>:[40,20]
error: illegal start of expression
[ERROR] <https://builds.apache.org/job/ctakes-trunk-compiletest/org.apache.ctakes$ctakes-core/ws/src/main/java/org/apache/ctakes/core/util/OntologyConceptUtil.java>:[43,20]
error: illegal start of expression
[ERROR] <https://builds.apache.org/job/ctakes-trunk-compiletest/org.apache.ctakes$ctakes-core/ws/src/main/java/org/apache/ctakes/core/util/OntologyConceptUtil.java>:[46,17]
error: ')' expected
[ERROR] <https://builds.apache.org/job/ctakes-trunk-compiletest/org.apache.ctakes$ctakes-core/ws/src/main/java/org/apache/ctakes/core/util/OntologyConceptUtil.java>:[46,23]
error: ';' expected
[ERROR] <https://builds.apache.org/job/ctakes-trunk-compiletest/org.apache.ctakes$ctakes-core/ws/src/main/java/org/apache/ctakes/core/util/OntologyConceptUtil.java>:[52,23]
error: illegal start of expression
[ERROR] <https://builds.apache.org/job/ctakes-trunk-compiletest/org.apache.ctakes$ctakes-core/ws/src/main/java/org/apache/ctakes/core/util/OntologyConceptUtil.java>:[55,23]
error: illegal start of expression
[ERROR] <https://builds.apache.org/job/ctakes-trunk-compiletest/org.apache.ctakes$ctakes-core/ws/src/main/java/org/apache/ctakes/core/util/OntologyConceptUtil.java>:[59,16]
error: illegal start of expression
[ERROR] <https://builds.apache.org/job/ctakes-trunk-compiletest/org.apache.ctakes$ctakes-core/ws/src/main/java/org/apache/ctakes/core/util/OntologyConceptUtil.java>:[82,38]
error: ')' expected
[ERROR] <https://builds.apache.org/job/ctakes-trunk-compiletest/org.apache.ctakes$ctakes-core/ws/src/main/java/org/apache/ctakes/core/util/OntologyConceptUtil.java>:[82,39]
error: illegal start of expression
[ERROR] <https://builds.apache.org/job/ctakes-trunk-compiletest/org.apache.ctakes$ctakes-core/ws/src/main/java/org/apache/ctakes/core/util/OntologyConceptUtil.java>:[82,50]
error: ';' expected
[ERROR] <https://builds.apache.org/job/ctakes-trunk-compiletest/org.apache.ctakes$ctakes-core/ws/src/main/java/org/apache/ctakes/core/util/OntologyConceptUtil.java>:[83,22]
error: illegal start of expression
[ERROR] <https://builds.apache.org/job/ctakes-trunk-compiletest/org.apache.ctakes$ctakes-core/ws/src/main/java/org/apache/ctakes/core/util/OntologyConceptUtil.java>:[99,29]
error: ')' expected
[ERROR] <https://builds.apache.org/job/ctakes-trunk-compiletest/org.apache.ctakes$ctakes-core/ws/src/main/java/org/apache/ctakes/core/util/OntologyConceptUtil.java>:[99,30]
error: illegal start of expression
[ERROR] <https://builds.apache.org/job/ctakes-trunk-compiletest/org.apache.ctakes$ctakes-core/ws/src/main/java/org/apache/ctakes/core/util/OntologyConceptUtil.java>:[99,37]
error: ';' expected
[ERROR] <https://builds.apache.org/job/ctakes-trunk-compiletest/org.apache.ctakes$ctakes-core/ws/src/main/java/org/apache/ctakes/core/util/OntologyConceptUtil.java>:[110,29]
error: ')' expected
[ERROR] <https://builds.apache.org/job/ctakes-trunk-compiletest/org.apache.ctakes$ctakes-core/ws/src/main/java/org/apache/ctakes/core/util/OntologyConceptUtil.java>:[110,30]
error: illegal start of expression
[ERROR] <https://builds.apache.org/job/ctakes-trunk-compiletest/org.apache.ctakes$ctakes-core/ws/src/main/java/org/apache/ctakes/core/util/OntologyConceptUtil.java>:[110,37]
error: ';' expected
[ERROR] <https://builds.apache.org/job/ctakes-trunk-compiletest/org.apache.ctakes$ctakes-core/ws/src/main/java/org/apache/ctakes/core/util/OntologyConceptUtil.java>:[120,42]
error: ')' expected
[ERROR] <https://builds.apache.org/job/ctakes-trunk-compiletest/org.apache.ctakes$ctakes-core/ws/src/main/java/org/apache/ctakes/core/util/OntologyConceptUtil.java>:[120,43]
error: illegal start of expression
[ERROR] <https://builds.apache.org/job/ctakes-trunk-compiletest/org.apache.ctakes$ctakes-core/ws/src/main/java/org/apache/ctakes/core/util/OntologyConceptUtil.java>:[120,54]
error: ';' expected
[ERROR] <https://builds.apache.org/job/ctakes-trunk-compiletest/org.apache.ctakes$ctakes-core/ws/src/main/java/org/apache/ctakes/core/util/OntologyConceptUtil.java>:[122,22]
error: illegal start of expression
[ERROR] <https://builds.apache.org/job/ctakes-trunk-compiletest/org.apache.ctakes$ctakes-core/ws/src/main/java/org/apache/ctakes/core/util/OntologyConceptUtil.java>:[125,55]
error: ')' expected
[ERROR] <https://builds.apache.org/job/ctakes-trunk-compiletest/org.apache.ctakes$ctakes-core/ws/src/main/java/org/apache/ctakes/core/util/OntologyConceptUtil.java>:[125,56]
error: ';' expected
[ERROR] <https://builds.apache.org/job/ctakes-trunk-compiletest/org.apache.ctakes$ctakes-core/ws/src/main/java/org/apache/ctakes/core/util/OntologyConceptUtil.java>:[125,57]
error: not a statement
[ERROR] <https://builds.apache.org/job/ctakes-trunk-compiletest/org.apache.ctakes$ctakes-core/ws/src/main/java/org/apache/ctakes/core/util/OntologyConceptUtil.java>:[125,72]
error: ';' expected
[ERROR] <https://builds.apache.org/job/ctakes-trunk-compiletest/org.apache.ctakes$ctakes-core/ws/src/main/java/org/apache/ctakes/core/util/OntologyConceptUtil.java>:[125,74]
error: not a statement
[ERROR] <https://builds.apache.org/job/ctakes-trunk-compiletest/org.apache.ctakes$ctakes-core/ws/src/main/java/org/apache/ctakes/core/util/OntologyConceptUtil.java>:[125,86]
error: ';' expected
[ERROR] <https://builds.apache.org/job/ctakes-trunk-compiletest/org.apache.ctakes$ctakes-core/ws/src/main/java/org/apache/ctakes/core/util/OntologyConceptUtil.java>:[125,88]
error: not a statement
[ERROR] <https://builds.apache.org/job/ctakes-trunk-compiletest/org.apache.ctakes$ctakes-core/ws/src/main/java/org/apache/ctakes/core/util/OntologyConceptUtil.java>:[125,97]
error: ';' expected
[ERROR] <https://builds.apache.org/job/ctakes-trunk-compiletest/org.apache.ctakes$ctakes-core/ws/src/main/java/org/apache/ctakes/core/util/OntologyConceptUtil.java>:[134,42]
error: ')' expected
[ERROR] <https://builds.apache.org/job/ctakes-trunk-compiletest/org.apache.ctakes$ctakes-core/ws/src/main/java/org/apache/ctakes/core/util/OntologyConceptUtil.java>:[134,43]
error: illegal start of expression
[ERROR] <https://builds.apache.org/job/ctakes-trunk-compiletest/org.apache.ctakes$ctakes-core/ws/src/main/java/org/apache/ctakes/core/util/OntologyConceptUtil.java>:[134,54]
error: ';' expected
[ERROR] <https://builds.apache.org/job/ctakes-trunk-compiletest/org.apache.ctakes$ctakes-core/ws/src/main/java/org/apache/ctakes/core/util/OntologyConceptUtil.java>:[136,22]
error: illegal start of expression
[ERROR] <https://builds.apache.org/job/ctakes-trunk-compiletest/org.apache.ctakes$ctakes-core/ws/src/main/java/org/apache/ctakes/core/util/OntologyConceptUtil.java>:[139,33]
error: ')' expected
[ERROR] <https://builds.apache.org/job/ctakes-trunk-compiletest/org.apache.ctakes$ctakes-core/ws/src/main/java/org/apache/ctakes/core/util/OntologyConceptUtil.java>:[139,34]
error: illegal start of expression
[ERROR] <https://builds.apache.org/job/ctakes-trunk-compiletest/org.apache.ctakes$ctakes-core/ws/src/main/java/org/apache/ctakes/core/util/OntologyConceptUtil.java>:[139,42]
error: ';' expected
[ERROR] <https://builds.apache.org/job/ctakes-trunk-compiletest/org.apache.ctakes$ctakes-core/ws/src/main/java/org/apache/ctakes/core/util/OntologyConceptUtil.java>:[151,42]
error: ')' expected
[ERROR] <https://builds.apache.org/job/ctakes-trunk-compiletest/org.apache.ctakes$ctakes-core/ws/src/main/java/org/apache/ctakes/core/util/OntologyConceptUtil.java>:[151,43]
error: illegal start of expression
[ERROR] <https://builds.apache.org/job/ctakes-trunk-compiletest/org.apache.ctakes$ctakes-core/ws/src/main/java/org/apache/ctakes/core/util/OntologyConceptUtil.java>:[151,54]
error: ';' expected
[ERROR] <https://builds.apache.org/job/ctakes-trunk-compiletest/org.apache.ctakes$ctakes-core/ws/src/main/java/org/apache/ctakes/core/util/OntologyConceptUtil.java>:[153,22]
error: illegal start of expression
[ERROR] <https://builds.apache.org/job/ctakes-trunk-compiletest/org.apache.ctakes$ctakes-core/ws/src/main/java/org/apache/ctakes/core/util/OntologyConceptUtil.java>:[154,30]
error: illegal start of expression
[ERROR] <https://builds.apache.org/job/ctakes-trunk-compiletest/org.apache.ctakes$ctakes-core/ws/src/main/java/org/apache/ctakes/core/util/OntologyConceptUtil.java>:[156,33]
error: ')' expected
[ERROR] <https://builds.apache.org/job/ctakes-trunk-compiletest/org.apache.ctakes$ctakes-core/ws/src/main/java/org/apache/ctakes/core/util/OntologyConceptUtil.java>:[156,34]
error: illegal start of expression
[ERROR] <https://builds.apache.org/job/ctakes-trunk-compiletest/org.apache.ctakes$ctakes-core/ws/src/main/java/org/apache/ctakes/core/util/OntologyConceptUtil.java>:[156,42]
error: ';' expected
[ERROR] <https://builds.apache.org/job/ctakes-trunk-compiletest/org.apache.ctakes$ctakes-core/ws/src/main/java/org/apache/ctakes/core/util/OntologyConceptUtil.java>:[194,37]
error: ')' expected
[ERROR] <https://builds.apache.org/job/ctakes-trunk-compiletest/org.apache.ctakes$ctakes-core/ws/src/main/java/org/apache/ctakes/core/util/OntologyConceptUtil.java>:[194,38]
error: illegal start of expression
[ERROR] <https://builds.apache.org/job/ctakes-trunk-compiletest/org.apache.ctakes$ctakes-core/ws/src/main/java/org/apache/ctakes/core/util/OntologyConceptUtil.java>:[194,53]
error: ';' expected
[ERROR] <https://builds.apache.org/job/ctakes-trunk-compiletest/org.apache.ctakes$ctakes-core/ws/src/main/java/org/apache/ctakes/core/util/OntologyConceptUtil.java>:[196,49]
error: ')' expected
[ERROR] <https://builds.apache.org/job/ctakes-trunk-compiletest/org.apache.ctakes$ctakes-core/ws/src/main/java/org/apache/ctakes/core/util/OntologyConceptUtil.java>:[196,50]
error: ';' expected
[ERROR] <https://builds.apache.org/job/ctakes-trunk-compiletest/org.apache.ctakes$ctakes-core/ws/src/main/java/org/apache/ctakes/core/util/OntologyConceptUtil.java>:[196,51]
error: not a statement
[ERROR] <https://builds.apache.org/job/ctakes-trunk-compiletest/org.apache.ctakes$ctakes-core/ws/src/main/java/org/apache/ctakes/core/util/OntologyConceptUtil.java>:[196,57]
error: ';' expected
[ERROR] <https://builds.apache.org/job/ctakes-trunk-compiletest/org.apache.ctakes$ctakes-core/ws/src/main/java/org/apache/ctakes/core/util/OntologyConceptUtil.java>:[196,62]
error: not a statement
[ERROR] <https://builds.apache.org/job/ctakes-trunk-compiletest/org.apache.ctakes$ctakes-core/ws/src/main/java/org/apache/ctakes/core/util/OntologyConceptUtil.java>:[196,68]
error: ';' expected
[ERROR] <https://builds.apache.org/job/ctakes-trunk-compiletest/org.apache.ctakes$ctakes-core/ws/src/main/java/org/apache/ctakes/core/util/OntologyConceptUtil.java>:[196,70]
error: not a statement
[ERROR] <https://builds.apache.org/job/ctakes-trunk-compiletest/org.apache.ctakes$ctakes-core/ws/src/main/java/org/apache/ctakes/core/util/OntologyConceptUtil.java>:[196,78]
error: ';' expected
[ERROR] <https://builds.apache.org/job/ctakes-trunk-compiletest/org.apache.ctakes$ctakes-core/ws/src/main/java/org/apache/ctakes/core/util/OntologyConceptUtil.java>:[196,80]
error: not a statement
[ERROR] <https://builds.apache.org/job/ctakes-trunk-compiletest/org.apache.ctakes$ctakes-core/ws/src/main/java/org/apache/ctakes/core/util/OntologyConceptUtil.java>:[196,89]
error: ';' expected
[ERROR] <https://builds.apache.org/job/ctakes-trunk-compiletest/org.apache.ctakes$ctakes-core/ws/src/main/java/org/apache/ctakes/core/util/OntologyConceptUtil.java>:[206,37]
error: ')' expected
[ERROR] <https://builds.apache.org/job/ctakes-trunk-compiletest/org.apache.ctakes$ctakes-core/ws/src/main/java/org/apache/ctakes/core/util/OntologyConceptUtil.java>:[206,38]
error: illegal start of expression
[ERROR] <https://builds.apache.org/job/ctakes-trunk-compiletest/org.apache.ctakes$ctakes-core/ws/src/main/java/org/apache/ctakes/core/util/OntologyConceptUtil.java>:[206,47]
error: ';' expected
[ERROR] <https://builds.apache.org/job/ctakes-trunk-compiletest/org.apache.ctakes$ctakes-core/ws/src/main/java/org/apache/ctakes/core/util/OntologyConceptUtil.java>:[207,32]
error: ')' expected
[ERROR] <https://builds.apache.org/job/ctakes-trunk-compiletest/org.apache.ctakes$ctakes-core/ws/src/main/java/org/apache/ctakes/core/util/OntologyConceptUtil.java>:[207,33]
error: illegal start of expression
[ERROR] <https://builds.apache.org/job/ctakes-trunk-compiletest/org.apache.ctakes$ctakes-core/ws/src/main/java/org/apache/ctakes/core/util/OntologyConceptUtil.java>:[207,40]
error: ';' expected
[ERROR] <https://builds.apache.org/job/ctakes-trunk-compiletest/org.apache.ctakes$ctakes-core/ws/src/main/java/org/apache/ctakes/core/util/OntologyConceptUtil.java>:[220,30]
error: illegal start of expression
[ERROR] <https://builds.apache.org/job/ctakes-trunk-compiletest/org.apache.ctakes$ctakes-core/ws/src/main/java/org/apache/ctakes/core/util/OntologyConceptUtil.java>:[221,32]
error: ')' expected
[ERROR] <https://builds.apache.org/job/ctakes-trunk-compiletest/org.apache.ctakes$ctakes-core/ws/src/main/java/org/apache/ctakes/core/util/OntologyConceptUtil.java>:[221,33]
error: illegal start of expression
[ERROR] <https://builds.apache.org/job/ctakes-trunk-compiletest/org.apache.ctakes$ctakes-core/ws/src/main/java/org/apache/ctakes/core/util/OntologyConceptUtil.java>:[221,40]
error: ';' expected
[ERROR] <https://builds.apache.org/job/ctakes-trunk-compiletest/org.apache.ctakes$ctakes-core/ws/src/main/java/org/apache/ctakes/core/util/OntologyConceptUtil.java>:[239,33]
error: illegal start of expression
[ERROR] <https://builds.apache.org/job/ctakes-trunk-compiletest/org.apache.ctakes$ctakes-core/ws/src/main/java/org/apache/ctakes/core/util/OntologyConceptUtil.java>:[252,33]
error: illegal start of expression
[ERROR] <https://builds.apache.org/job/ctakes-trunk-compiletest/org.apache.ctakes$ctakes-core/ws/src/main/java/org/apache/ctakes/core/util/OntologyConceptUtil.java>:[265,33]
error: illegal start of expression
[INFO] 71 errors 
[INFO] -------------------------------------------------------------
[JENKINS] Archiving disabled

Mime
View raw message