ctakes-notifications mailing list archives

Site index · List index
Message view « Date » · « Thread »
Top « Date » · « Thread »
From Apache Jenkins Server <jenk...@builds.apache.org>
Subject Build failed in Jenkins: ctakes-trunk-package #386
Date Tue, 24 Nov 2015 11:50:22 GMT
See <https://builds.apache.org/job/ctakes-trunk-package/386/changes>

Changes:

[seanfinan] Refactored for OntologyConceptUtil rename

[seanfinan] IdentifiedAnnotationUtil renamed OntologyConceptUtil
OntologyConceptUtilTester added
OntologyConceptUtil added more methods to get collections of cuis, tuis, codes
OntologyConceptUtil added methods to get IdentifiedAnnotation by cui, tui, code

[seanfinan] DefaultTextSpan declared @Immutable, added toString() that returns "begin, end"

------------------------------------------
[...truncated 629 lines...]
[ERROR] <https://builds.apache.org/job/ctakes-trunk-package/ws/ctakes-core/src/main/java/org/apache/ctakes/core/util/OntologyConceptUtil.java>:[120,43]
error: illegal start of expression
[ERROR] <https://builds.apache.org/job/ctakes-trunk-package/ws/ctakes-core/src/main/java/org/apache/ctakes/core/util/OntologyConceptUtil.java>:[120,54]
error: ';' expected
[ERROR] <https://builds.apache.org/job/ctakes-trunk-package/ws/ctakes-core/src/main/java/org/apache/ctakes/core/util/OntologyConceptUtil.java>:[122,22]
error: illegal start of expression
[ERROR] <https://builds.apache.org/job/ctakes-trunk-package/ws/ctakes-core/src/main/java/org/apache/ctakes/core/util/OntologyConceptUtil.java>:[125,55]
error: ')' expected
[ERROR] <https://builds.apache.org/job/ctakes-trunk-package/ws/ctakes-core/src/main/java/org/apache/ctakes/core/util/OntologyConceptUtil.java>:[125,56]
error: ';' expected
[ERROR] <https://builds.apache.org/job/ctakes-trunk-package/ws/ctakes-core/src/main/java/org/apache/ctakes/core/util/OntologyConceptUtil.java>:[125,57]
error: not a statement
[ERROR] <https://builds.apache.org/job/ctakes-trunk-package/ws/ctakes-core/src/main/java/org/apache/ctakes/core/util/OntologyConceptUtil.java>:[125,72]
error: ';' expected
[ERROR] <https://builds.apache.org/job/ctakes-trunk-package/ws/ctakes-core/src/main/java/org/apache/ctakes/core/util/OntologyConceptUtil.java>:[125,74]
error: not a statement
[ERROR] <https://builds.apache.org/job/ctakes-trunk-package/ws/ctakes-core/src/main/java/org/apache/ctakes/core/util/OntologyConceptUtil.java>:[125,86]
error: ';' expected
[ERROR] <https://builds.apache.org/job/ctakes-trunk-package/ws/ctakes-core/src/main/java/org/apache/ctakes/core/util/OntologyConceptUtil.java>:[125,88]
error: not a statement
[ERROR] <https://builds.apache.org/job/ctakes-trunk-package/ws/ctakes-core/src/main/java/org/apache/ctakes/core/util/OntologyConceptUtil.java>:[125,97]
error: ';' expected
[ERROR] <https://builds.apache.org/job/ctakes-trunk-package/ws/ctakes-core/src/main/java/org/apache/ctakes/core/util/OntologyConceptUtil.java>:[134,42]
error: ')' expected
[ERROR] <https://builds.apache.org/job/ctakes-trunk-package/ws/ctakes-core/src/main/java/org/apache/ctakes/core/util/OntologyConceptUtil.java>:[134,43]
error: illegal start of expression
[ERROR] <https://builds.apache.org/job/ctakes-trunk-package/ws/ctakes-core/src/main/java/org/apache/ctakes/core/util/OntologyConceptUtil.java>:[134,54]
error: ';' expected
[ERROR] <https://builds.apache.org/job/ctakes-trunk-package/ws/ctakes-core/src/main/java/org/apache/ctakes/core/util/OntologyConceptUtil.java>:[136,22]
error: illegal start of expression
[ERROR] <https://builds.apache.org/job/ctakes-trunk-package/ws/ctakes-core/src/main/java/org/apache/ctakes/core/util/OntologyConceptUtil.java>:[139,33]
error: ')' expected
[ERROR] <https://builds.apache.org/job/ctakes-trunk-package/ws/ctakes-core/src/main/java/org/apache/ctakes/core/util/OntologyConceptUtil.java>:[139,34]
error: illegal start of expression
[ERROR] <https://builds.apache.org/job/ctakes-trunk-package/ws/ctakes-core/src/main/java/org/apache/ctakes/core/util/OntologyConceptUtil.java>:[139,42]
error: ';' expected
[ERROR] <https://builds.apache.org/job/ctakes-trunk-package/ws/ctakes-core/src/main/java/org/apache/ctakes/core/util/OntologyConceptUtil.java>:[151,42]
error: ')' expected
[ERROR] <https://builds.apache.org/job/ctakes-trunk-package/ws/ctakes-core/src/main/java/org/apache/ctakes/core/util/OntologyConceptUtil.java>:[151,43]
error: illegal start of expression
[ERROR] <https://builds.apache.org/job/ctakes-trunk-package/ws/ctakes-core/src/main/java/org/apache/ctakes/core/util/OntologyConceptUtil.java>:[151,54]
error: ';' expected
[ERROR] <https://builds.apache.org/job/ctakes-trunk-package/ws/ctakes-core/src/main/java/org/apache/ctakes/core/util/OntologyConceptUtil.java>:[153,22]
error: illegal start of expression
[ERROR] <https://builds.apache.org/job/ctakes-trunk-package/ws/ctakes-core/src/main/java/org/apache/ctakes/core/util/OntologyConceptUtil.java>:[154,30]
error: illegal start of expression
[ERROR] <https://builds.apache.org/job/ctakes-trunk-package/ws/ctakes-core/src/main/java/org/apache/ctakes/core/util/OntologyConceptUtil.java>:[156,33]
error: ')' expected
[ERROR] <https://builds.apache.org/job/ctakes-trunk-package/ws/ctakes-core/src/main/java/org/apache/ctakes/core/util/OntologyConceptUtil.java>:[156,34]
error: illegal start of expression
[ERROR] <https://builds.apache.org/job/ctakes-trunk-package/ws/ctakes-core/src/main/java/org/apache/ctakes/core/util/OntologyConceptUtil.java>:[156,42]
error: ';' expected
[ERROR] <https://builds.apache.org/job/ctakes-trunk-package/ws/ctakes-core/src/main/java/org/apache/ctakes/core/util/OntologyConceptUtil.java>:[194,37]
error: ')' expected
[ERROR] <https://builds.apache.org/job/ctakes-trunk-package/ws/ctakes-core/src/main/java/org/apache/ctakes/core/util/OntologyConceptUtil.java>:[194,38]
error: illegal start of expression
[ERROR] <https://builds.apache.org/job/ctakes-trunk-package/ws/ctakes-core/src/main/java/org/apache/ctakes/core/util/OntologyConceptUtil.java>:[194,53]
error: ';' expected
[ERROR] <https://builds.apache.org/job/ctakes-trunk-package/ws/ctakes-core/src/main/java/org/apache/ctakes/core/util/OntologyConceptUtil.java>:[196,49]
error: ')' expected
[ERROR] <https://builds.apache.org/job/ctakes-trunk-package/ws/ctakes-core/src/main/java/org/apache/ctakes/core/util/OntologyConceptUtil.java>:[196,50]
error: ';' expected
[ERROR] <https://builds.apache.org/job/ctakes-trunk-package/ws/ctakes-core/src/main/java/org/apache/ctakes/core/util/OntologyConceptUtil.java>:[196,51]
error: not a statement
[ERROR] <https://builds.apache.org/job/ctakes-trunk-package/ws/ctakes-core/src/main/java/org/apache/ctakes/core/util/OntologyConceptUtil.java>:[196,57]
error: ';' expected
[ERROR] <https://builds.apache.org/job/ctakes-trunk-package/ws/ctakes-core/src/main/java/org/apache/ctakes/core/util/OntologyConceptUtil.java>:[196,62]
error: not a statement
[ERROR] <https://builds.apache.org/job/ctakes-trunk-package/ws/ctakes-core/src/main/java/org/apache/ctakes/core/util/OntologyConceptUtil.java>:[196,68]
error: ';' expected
[ERROR] <https://builds.apache.org/job/ctakes-trunk-package/ws/ctakes-core/src/main/java/org/apache/ctakes/core/util/OntologyConceptUtil.java>:[196,70]
error: not a statement
[ERROR] <https://builds.apache.org/job/ctakes-trunk-package/ws/ctakes-core/src/main/java/org/apache/ctakes/core/util/OntologyConceptUtil.java>:[196,78]
error: ';' expected
[ERROR] <https://builds.apache.org/job/ctakes-trunk-package/ws/ctakes-core/src/main/java/org/apache/ctakes/core/util/OntologyConceptUtil.java>:[196,80]
error: not a statement
[ERROR] <https://builds.apache.org/job/ctakes-trunk-package/ws/ctakes-core/src/main/java/org/apache/ctakes/core/util/OntologyConceptUtil.java>:[196,89]
error: ';' expected
[ERROR] <https://builds.apache.org/job/ctakes-trunk-package/ws/ctakes-core/src/main/java/org/apache/ctakes/core/util/OntologyConceptUtil.java>:[206,37]
error: ')' expected
[ERROR] <https://builds.apache.org/job/ctakes-trunk-package/ws/ctakes-core/src/main/java/org/apache/ctakes/core/util/OntologyConceptUtil.java>:[206,38]
error: illegal start of expression
[ERROR] <https://builds.apache.org/job/ctakes-trunk-package/ws/ctakes-core/src/main/java/org/apache/ctakes/core/util/OntologyConceptUtil.java>:[206,47]
error: ';' expected
[ERROR] <https://builds.apache.org/job/ctakes-trunk-package/ws/ctakes-core/src/main/java/org/apache/ctakes/core/util/OntologyConceptUtil.java>:[207,32]
error: ')' expected
[ERROR] <https://builds.apache.org/job/ctakes-trunk-package/ws/ctakes-core/src/main/java/org/apache/ctakes/core/util/OntologyConceptUtil.java>:[207,33]
error: illegal start of expression
[ERROR] <https://builds.apache.org/job/ctakes-trunk-package/ws/ctakes-core/src/main/java/org/apache/ctakes/core/util/OntologyConceptUtil.java>:[207,40]
error: ';' expected
[ERROR] <https://builds.apache.org/job/ctakes-trunk-package/ws/ctakes-core/src/main/java/org/apache/ctakes/core/util/OntologyConceptUtil.java>:[220,30]
error: illegal start of expression
[ERROR] <https://builds.apache.org/job/ctakes-trunk-package/ws/ctakes-core/src/main/java/org/apache/ctakes/core/util/OntologyConceptUtil.java>:[221,32]
error: ')' expected
[ERROR] <https://builds.apache.org/job/ctakes-trunk-package/ws/ctakes-core/src/main/java/org/apache/ctakes/core/util/OntologyConceptUtil.java>:[221,33]
error: illegal start of expression
[ERROR] <https://builds.apache.org/job/ctakes-trunk-package/ws/ctakes-core/src/main/java/org/apache/ctakes/core/util/OntologyConceptUtil.java>:[221,40]
error: ';' expected
[ERROR] <https://builds.apache.org/job/ctakes-trunk-package/ws/ctakes-core/src/main/java/org/apache/ctakes/core/util/OntologyConceptUtil.java>:[239,33]
error: illegal start of expression
[ERROR] <https://builds.apache.org/job/ctakes-trunk-package/ws/ctakes-core/src/main/java/org/apache/ctakes/core/util/OntologyConceptUtil.java>:[252,33]
error: illegal start of expression
[ERROR] <https://builds.apache.org/job/ctakes-trunk-package/ws/ctakes-core/src/main/java/org/apache/ctakes/core/util/OntologyConceptUtil.java>:[265,33]
error: illegal start of expression
[INFO] 71 errors 
[INFO] -------------------------------------------------------------
[INFO] ------------------------------------------------------------------------
[INFO] Reactor Summary:
[INFO] 
[INFO] Apache cTAKES ..................................... SUCCESS [2.715s]
[INFO] Apache cTAKES common type system .................. SUCCESS [7.083s]
[INFO] Apache cTAKES utils ............................... SUCCESS [2.279s]
[INFO] Apache cTAKES Resources core ...................... SUCCESS [0.592s]
[INFO] Apache cTAKES core ................................ FAILURE [2.156s]
[INFO] Apache cTAKES Resources pos-tagger ................ SKIPPED
[INFO] Apache cTAKES part-of-speech tagger ............... SKIPPED
[INFO] Apache cTAKES Resources ctakes-chunker-res ........ SKIPPED
[INFO] Apache cTAKES chunker ............................. SKIPPED
[INFO] Apache cTAKES document preprocessor ............... SKIPPED
[INFO] Apache cTAKES Resources dictionary-lookup ......... SKIPPED
[INFO] Apache cTAKES dictionary lookup ................... SKIPPED
[INFO] Apache cTAKES context dependent tokenizer ......... SKIPPED
[INFO] Apache cTAKES Resources lvg ....................... SKIPPED
[INFO] Apache cTAKES LVG lexical tools ................... SKIPPED
[INFO] Apache cTAKES Resources ne-contexts ............... SKIPPED
[INFO] Apache cTAKES named entity contexts ............... SKIPPED
[INFO] Apache cTAKES Resources constituency-parser ....... SKIPPED
[INFO] Apache cTAKES Constituency Parser ................. SKIPPED
[INFO] Apache cTAKES Resources coreference ............... SKIPPED
[INFO] Apache cTAKES Resources relation-extractor ........ SKIPPED
[INFO] Apache cTAKES Resources dependency-parser ......... SKIPPED
[INFO] Apache cTAKES Dependency Parser ................... SKIPPED
[INFO] Apache cTAKES Relation Extractor .................. SKIPPED
[INFO] Apache cTAKES CoReference Resolver ................ SKIPPED
[INFO] Apache cTAKES Resources drug-ner .................. SKIPPED
[INFO] Apache cTAKES Drug NER ............................ SKIPPED
[INFO] Apache cTAKES Resources side-effect ............... SKIPPED
[INFO] Apache cTAKES Side Effects ........................ SKIPPED
[INFO] Apache cTAKES Resources smoking-status ............ SKIPPED
[INFO] Apache cTAKES Smoking Status ...................... SKIPPED
[INFO] Apache cTAKES Resources assertion ................. SKIPPED
[INFO] Apache cTAKES Assertion ........................... SKIPPED
[INFO] Apache cTAKES Resources assertion-zoner ........... SKIPPED
[INFO] Apache cTAKES Assertion's zoner ................... SKIPPED
[INFO] Apache cTAKES Resources temporal .................. SKIPPED
[INFO] Apache cTAKES Resources dictionary-lookup-fast-res  SKIPPED
[INFO] Apache cTAKES dictionary lookup fast .............. SKIPPED
[INFO] Apache cTAKES Resources ctakes-ytex-res ........... SKIPPED
[INFO] Apache cTAKES YTEX ................................ SKIPPED
[INFO] Apache cTAKES YTEX UIMA ........................... SKIPPED
[INFO] Apache cTAKES ctakes-clinical-pipeline ............ SKIPPED
[INFO] Apache cTAKES Temporal Information Extraction ..... SKIPPED
[INFO] Apache cTAKES YTEX Web ............................ SKIPPED
[INFO] Apache cTAKES Distribution ........................ SKIPPED
[INFO] Apache cTAKES Regression-test ..................... SKIPPED
[INFO] Apache cTAKES template filler ..................... SKIPPED
[INFO] ctakes-examples ................................... SKIPPED
[INFO] ------------------------------------------------------------------------
[INFO] BUILD FAILURE
[INFO] ------------------------------------------------------------------------
[INFO] Total time: 18.455s
[INFO] Finished at: Tue Nov 24 11:49:20 UTC 2015
[INFO] Final Memory: 33M/225M
[INFO] ------------------------------------------------------------------------
Waiting for Jenkins to finish collecting data
[ERROR] Failed to execute goal org.apache.maven.plugins:maven-compiler-plugin:2.4:compile
(default-compile) on project ctakes-core: Compilation failure: Compilation failure:
[ERROR] <https://builds.apache.org/job/ctakes-trunk-package/ws/ctakes-core/src/main/java/org/apache/ctakes/core/util/OntologyConceptUtil.java>:[37,20]
error: illegal start of expression
[ERROR] <https://builds.apache.org/job/ctakes-trunk-package/ws/ctakes-core/src/main/java/org/apache/ctakes/core/util/OntologyConceptUtil.java>:[40,20]
error: illegal start of expression
[ERROR] <https://builds.apache.org/job/ctakes-trunk-package/ws/ctakes-core/src/main/java/org/apache/ctakes/core/util/OntologyConceptUtil.java>:[43,20]
error: illegal start of expression
[ERROR] <https://builds.apache.org/job/ctakes-trunk-package/ws/ctakes-core/src/main/java/org/apache/ctakes/core/util/OntologyConceptUtil.java>:[46,17]
error: ')' expected
[ERROR] <https://builds.apache.org/job/ctakes-trunk-package/ws/ctakes-core/src/main/java/org/apache/ctakes/core/util/OntologyConceptUtil.java>:[46,23]
error: ';' expected
[ERROR] <https://builds.apache.org/job/ctakes-trunk-package/ws/ctakes-core/src/main/java/org/apache/ctakes/core/util/OntologyConceptUtil.java>:[52,23]
error: illegal start of expression
[ERROR] <https://builds.apache.org/job/ctakes-trunk-package/ws/ctakes-core/src/main/java/org/apache/ctakes/core/util/OntologyConceptUtil.java>:[55,23]
error: illegal start of expression
[ERROR] <https://builds.apache.org/job/ctakes-trunk-package/ws/ctakes-core/src/main/java/org/apache/ctakes/core/util/OntologyConceptUtil.java>:[59,16]
error: illegal start of expression
[ERROR] <https://builds.apache.org/job/ctakes-trunk-package/ws/ctakes-core/src/main/java/org/apache/ctakes/core/util/OntologyConceptUtil.java>:[82,38]
error: ')' expected
[ERROR] <https://builds.apache.org/job/ctakes-trunk-package/ws/ctakes-core/src/main/java/org/apache/ctakes/core/util/OntologyConceptUtil.java>:[82,39]
error: illegal start of expression
[ERROR] <https://builds.apache.org/job/ctakes-trunk-package/ws/ctakes-core/src/main/java/org/apache/ctakes/core/util/OntologyConceptUtil.java>:[82,50]
error: ';' expected
[ERROR] <https://builds.apache.org/job/ctakes-trunk-package/ws/ctakes-core/src/main/java/org/apache/ctakes/core/util/OntologyConceptUtil.java>:[83,22]
error: illegal start of expression
[ERROR] <https://builds.apache.org/job/ctakes-trunk-package/ws/ctakes-core/src/main/java/org/apache/ctakes/core/util/OntologyConceptUtil.java>:[99,29]
error: ')' expected
[ERROR] <https://builds.apache.org/job/ctakes-trunk-package/ws/ctakes-core/src/main/java/org/apache/ctakes/core/util/OntologyConceptUtil.java>:[99,30]
error: illegal start of expression
[ERROR] <https://builds.apache.org/job/ctakes-trunk-package/ws/ctakes-core/src/main/java/org/apache/ctakes/core/util/OntologyConceptUtil.java>:[99,37]
error: ';' expected
[ERROR] <https://builds.apache.org/job/ctakes-trunk-package/ws/ctakes-core/src/main/java/org/apache/ctakes/core/util/OntologyConceptUtil.java>:[110,29]
error: ')' expected
[ERROR] <https://builds.apache.org/job/ctakes-trunk-package/ws/ctakes-core/src/main/java/org/apache/ctakes/core/util/OntologyConceptUtil.java>:[110,30]
error: illegal start of expression
[ERROR] <https://builds.apache.org/job/ctakes-trunk-package/ws/ctakes-core/src/main/java/org/apache/ctakes/core/util/OntologyConceptUtil.java>:[110,37]
error: ';' expected
[ERROR] <https://builds.apache.org/job/ctakes-trunk-package/ws/ctakes-core/src/main/java/org/apache/ctakes/core/util/OntologyConceptUtil.java>:[120,42]
error: ')' expected
[ERROR] <https://builds.apache.org/job/ctakes-trunk-package/ws/ctakes-core/src/main/java/org/apache/ctakes/core/util/OntologyConceptUtil.java>:[120,43]
error: illegal start of expression
[ERROR] <https://builds.apache.org/job/ctakes-trunk-package/ws/ctakes-core/src/main/java/org/apache/ctakes/core/util/OntologyConceptUtil.java>:[120,54]
error: ';' expected
[ERROR] <https://builds.apache.org/job/ctakes-trunk-package/ws/ctakes-core/src/main/java/org/apache/ctakes/core/util/OntologyConceptUtil.java>:[122,22]
error: illegal start of expression
[ERROR] <https://builds.apache.org/job/ctakes-trunk-package/ws/ctakes-core/src/main/java/org/apache/ctakes/core/util/OntologyConceptUtil.java>:[125,55]
error: ')' expected
[ERROR] <https://builds.apache.org/job/ctakes-trunk-package/ws/ctakes-core/src/main/java/org/apache/ctakes/core/util/OntologyConceptUtil.java>:[125,56]
error: ';' expected
[ERROR] <https://builds.apache.org/job/ctakes-trunk-package/ws/ctakes-core/src/main/java/org/apache/ctakes/core/util/OntologyConceptUtil.java>:[125,57]
error: not a statement
[ERROR] <https://builds.apache.org/job/ctakes-trunk-package/ws/ctakes-core/src/main/java/org/apache/ctakes/core/util/OntologyConceptUtil.java>:[125,72]
error: ';' expected
[ERROR] <https://builds.apache.org/job/ctakes-trunk-package/ws/ctakes-core/src/main/java/org/apache/ctakes/core/util/OntologyConceptUtil.java>:[125,74]
error: not a statement
[ERROR] <https://builds.apache.org/job/ctakes-trunk-package/ws/ctakes-core/src/main/java/org/apache/ctakes/core/util/OntologyConceptUtil.java>:[125,86]
error: ';' expected
[ERROR] <https://builds.apache.org/job/ctakes-trunk-package/ws/ctakes-core/src/main/java/org/apache/ctakes/core/util/OntologyConceptUtil.java>:[125,88]
error: not a statement
[ERROR] <https://builds.apache.org/job/ctakes-trunk-package/ws/ctakes-core/src/main/java/org/apache/ctakes/core/util/OntologyConceptUtil.java>:[125,97]
error: ';' expected
[ERROR] <https://builds.apache.org/job/ctakes-trunk-package/ws/ctakes-core/src/main/java/org/apache/ctakes/core/util/OntologyConceptUtil.java>:[134,42]
error: ')' expected
[ERROR] <https://builds.apache.org/job/ctakes-trunk-package/ws/ctakes-core/src/main/java/org/apache/ctakes/core/util/OntologyConceptUtil.java>:[134,43]
error: illegal start of expression
[ERROR] <https://builds.apache.org/job/ctakes-trunk-package/ws/ctakes-core/src/main/java/org/apache/ctakes/core/util/OntologyConceptUtil.java>:[134,54]
error: ';' expected
[ERROR] <https://builds.apache.org/job/ctakes-trunk-package/ws/ctakes-core/src/main/java/org/apache/ctakes/core/util/OntologyConceptUtil.java>:[136,22]
error: illegal start of expression
[ERROR] <https://builds.apache.org/job/ctakes-trunk-package/ws/ctakes-core/src/main/java/org/apache/ctakes/core/util/OntologyConceptUtil.java>:[139,33]
error: ')' expected
[ERROR] <https://builds.apache.org/job/ctakes-trunk-package/ws/ctakes-core/src/main/java/org/apache/ctakes/core/util/OntologyConceptUtil.java>:[139,34]
error: illegal start of expression
[ERROR] <https://builds.apache.org/job/ctakes-trunk-package/ws/ctakes-core/src/main/java/org/apache/ctakes/core/util/OntologyConceptUtil.java>:[139,42]
error: ';' expected
[ERROR] <https://builds.apache.org/job/ctakes-trunk-package/ws/ctakes-core/src/main/java/org/apache/ctakes/core/util/OntologyConceptUtil.java>:[151,42]
error: ')' expected
[ERROR] <https://builds.apache.org/job/ctakes-trunk-package/ws/ctakes-core/src/main/java/org/apache/ctakes/core/util/OntologyConceptUtil.java>:[151,43]
error: illegal start of expression
[ERROR] <https://builds.apache.org/job/ctakes-trunk-package/ws/ctakes-core/src/main/java/org/apache/ctakes/core/util/OntologyConceptUtil.java>:[151,54]
error: ';' expected
[ERROR] <https://builds.apache.org/job/ctakes-trunk-package/ws/ctakes-core/src/main/java/org/apache/ctakes/core/util/OntologyConceptUtil.java>:[153,22]
error: illegal start of expression
[ERROR] <https://builds.apache.org/job/ctakes-trunk-package/ws/ctakes-core/src/main/java/org/apache/ctakes/core/util/OntologyConceptUtil.java>:[154,30]
error: illegal start of expression
[ERROR] <https://builds.apache.org/job/ctakes-trunk-package/ws/ctakes-core/src/main/java/org/apache/ctakes/core/util/OntologyConceptUtil.java>:[156,33]
error: ')' expected
[ERROR] <https://builds.apache.org/job/ctakes-trunk-package/ws/ctakes-core/src/main/java/org/apache/ctakes/core/util/OntologyConceptUtil.java>:[156,34]
error: illegal start of expression
[ERROR] <https://builds.apache.org/job/ctakes-trunk-package/ws/ctakes-core/src/main/java/org/apache/ctakes/core/util/OntologyConceptUtil.java>:[156,42]
error: ';' expected
[ERROR] <https://builds.apache.org/job/ctakes-trunk-package/ws/ctakes-core/src/main/java/org/apache/ctakes/core/util/OntologyConceptUtil.java>:[194,37]
error: ')' expected
[ERROR] <https://builds.apache.org/job/ctakes-trunk-package/ws/ctakes-core/src/main/java/org/apache/ctakes/core/util/OntologyConceptUtil.java>:[194,38]
error: illegal start of expression
[ERROR] <https://builds.apache.org/job/ctakes-trunk-package/ws/ctakes-core/src/main/java/org/apache/ctakes/core/util/OntologyConceptUtil.java>:[194,53]
error: ';' expected
[ERROR] <https://builds.apache.org/job/ctakes-trunk-package/ws/ctakes-core/src/main/java/org/apache/ctakes/core/util/OntologyConceptUtil.java>:[196,49]
error: ')' expected
[ERROR] <https://builds.apache.org/job/ctakes-trunk-package/ws/ctakes-core/src/main/java/org/apache/ctakes/core/util/OntologyConceptUtil.java>:[196,50]
error: ';' expected
[ERROR] <https://builds.apache.org/job/ctakes-trunk-package/ws/ctakes-core/src/main/java/org/apache/ctakes/core/util/OntologyConceptUtil.java>:[196,51]
error: not a statement
[ERROR] <https://builds.apache.org/job/ctakes-trunk-package/ws/ctakes-core/src/main/java/org/apache/ctakes/core/util/OntologyConceptUtil.java>:[196,57]
error: ';' expected
[ERROR] <https://builds.apache.org/job/ctakes-trunk-package/ws/ctakes-core/src/main/java/org/apache/ctakes/core/util/OntologyConceptUtil.java>:[196,62]
error: not a statement
[ERROR] <https://builds.apache.org/job/ctakes-trunk-package/ws/ctakes-core/src/main/java/org/apache/ctakes/core/util/OntologyConceptUtil.java>:[196,68]
error: ';' expected
[ERROR] <https://builds.apache.org/job/ctakes-trunk-package/ws/ctakes-core/src/main/java/org/apache/ctakes/core/util/OntologyConceptUtil.java>:[196,70]
error: not a statement
[ERROR] <https://builds.apache.org/job/ctakes-trunk-package/ws/ctakes-core/src/main/java/org/apache/ctakes/core/util/OntologyConceptUtil.java>:[196,78]
error: ';' expected
[ERROR] <https://builds.apache.org/job/ctakes-trunk-package/ws/ctakes-core/src/main/java/org/apache/ctakes/core/util/OntologyConceptUtil.java>:[196,80]
error: not a statement
[ERROR] <https://builds.apache.org/job/ctakes-trunk-package/ws/ctakes-core/src/main/java/org/apache/ctakes/core/util/OntologyConceptUtil.java>:[196,89]
error: ';' expected
[ERROR] <https://builds.apache.org/job/ctakes-trunk-package/ws/ctakes-core/src/main/java/org/apache/ctakes/core/util/OntologyConceptUtil.java>:[206,37]
error: ')' expected
[ERROR] <https://builds.apache.org/job/ctakes-trunk-package/ws/ctakes-core/src/main/java/org/apache/ctakes/core/util/OntologyConceptUtil.java>:[206,38]
error: illegal start of expression
[ERROR] <https://builds.apache.org/job/ctakes-trunk-package/ws/ctakes-core/src/main/java/org/apache/ctakes/core/util/OntologyConceptUtil.java>:[206,47]
error: ';' expected
[ERROR] <https://builds.apache.org/job/ctakes-trunk-package/ws/ctakes-core/src/main/java/org/apache/ctakes/core/util/OntologyConceptUtil.java>:[207,32]
error: ')' expected
[ERROR] <https://builds.apache.org/job/ctakes-trunk-package/ws/ctakes-core/src/main/java/org/apache/ctakes/core/util/OntologyConceptUtil.java>:[207,33]
error: illegal start of expression
[ERROR] <https://builds.apache.org/job/ctakes-trunk-package/ws/ctakes-core/src/main/java/org/apache/ctakes/core/util/OntologyConceptUtil.java>:[207,40]
error: ';' expected
[ERROR] <https://builds.apache.org/job/ctakes-trunk-package/ws/ctakes-core/src/main/java/org/apache/ctakes/core/util/OntologyConceptUtil.java>:[220,30]
error: illegal start of expression
[ERROR] <https://builds.apache.org/job/ctakes-trunk-package/ws/ctakes-core/src/main/java/org/apache/ctakes/core/util/OntologyConceptUtil.java>:[221,32]
error: ')' expected
[ERROR] <https://builds.apache.org/job/ctakes-trunk-package/ws/ctakes-core/src/main/java/org/apache/ctakes/core/util/OntologyConceptUtil.java>:[221,33]
error: illegal start of expression
[ERROR] <https://builds.apache.org/job/ctakes-trunk-package/ws/ctakes-core/src/main/java/org/apache/ctakes/core/util/OntologyConceptUtil.java>:[221,40]
error: ';' expected
[ERROR] <https://builds.apache.org/job/ctakes-trunk-package/ws/ctakes-core/src/main/java/org/apache/ctakes/core/util/OntologyConceptUtil.java>:[239,33]
error: illegal start of expression
[ERROR] <https://builds.apache.org/job/ctakes-trunk-package/ws/ctakes-core/src/main/java/org/apache/ctakes/core/util/OntologyConceptUtil.java>:[252,33]
error: illegal start of expression
[ERROR] <https://builds.apache.org/job/ctakes-trunk-package/ws/ctakes-core/src/main/java/org/apache/ctakes/core/util/OntologyConceptUtil.java>:[265,33]
error: illegal start of expression
[ERROR] -> [Help 1]
[ERROR] 
[ERROR] To see the full stack trace of the errors, re-run Maven with the -e switch.
[ERROR] Re-run Maven using the -X switch to enable full debug logging.
[ERROR] 
[ERROR] For more information about the errors and possible solutions, please read the following
articles:
[ERROR] [Help 1] http://cwiki.apache.org/confluence/display/MAVEN/MojoFailureException
[ERROR] 
[ERROR] After correcting the problems, you can resume the build with the command
[ERROR]   mvn <goals> -rf :ctakes-core
[JENKINS] Archiving <https://builds.apache.org/job/ctakes-trunk-package/ws/ctakes-core/pom.xml>
to org.apache.ctakes/ctakes-core/3.2.3-SNAPSHOT/ctakes-core-3.2.3-SNAPSHOT.pom
[JENKINS] Archiving <https://builds.apache.org/job/ctakes-trunk-package/ws/ctakes-ytex-res/pom.xml>
to org.apache.ctakes/ctakes-ytex-res/3.2.3-SNAPSHOT/ctakes-ytex-res-3.2.3-SNAPSHOT.pom
[JENKINS] Archiving <https://builds.apache.org/job/ctakes-trunk-package/ws/ctakes-coreference/pom.xml>
to org.apache.ctakes/ctakes-coreference/3.2.3-SNAPSHOT/ctakes-coreference-3.2.3-SNAPSHOT.pom
[JENKINS] Archiving <https://builds.apache.org/job/ctakes-trunk-package/ws/ctakes-dependency-parser/pom.xml>
to org.apache.ctakes/ctakes-dependency-parser/3.2.3-SNAPSHOT/ctakes-dependency-parser-3.2.3-SNAPSHOT.pom
[JENKINS] Archiving <https://builds.apache.org/job/ctakes-trunk-package/ws/ctakes-regression-test/pom.xml>
to org.apache.ctakes/ctakes-regression-test/3.2.3-SNAPSHOT/ctakes-regression-test-3.2.3-SNAPSHOT.pom
[JENKINS] Archiving <https://builds.apache.org/job/ctakes-trunk-package/ws/ctakes-ytex-uima/pom.xml>
to org.apache.ctakes/ctakes-ytex-uima/3.2.3-SNAPSHOT/ctakes-ytex-uima-3.2.3-SNAPSHOT.pom
[JENKINS] Archiving <https://builds.apache.org/job/ctakes-trunk-package/ws/ctakes-dictionary-lookup-res/pom.xml>
to org.apache.ctakes/ctakes-dictionary-lookup-res/3.2.3-SNAPSHOT/ctakes-dictionary-lookup-res-3.2.3-SNAPSHOT.pom
[JENKINS] Archiving <https://builds.apache.org/job/ctakes-trunk-package/ws/ctakes-ne-contexts/pom.xml>
to org.apache.ctakes/ctakes-ne-contexts/3.2.3-SNAPSHOT/ctakes-ne-contexts-3.2.3-SNAPSHOT.pom
[JENKINS] Archiving <https://builds.apache.org/job/ctakes-trunk-package/ws/ctakes-drug-ner/pom.xml>
to org.apache.ctakes/ctakes-drug-ner/3.2.3-SNAPSHOT/ctakes-drug-ner-3.2.3-SNAPSHOT.pom
[JENKINS] Archiving <https://builds.apache.org/job/ctakes-trunk-package/ws/ctakes-preprocessor/pom.xml>
to org.apache.ctakes/ctakes-preprocessor/3.2.3-SNAPSHOT/ctakes-preprocessor-3.2.3-SNAPSHOT.pom
[JENKINS] Archiving <https://builds.apache.org/job/ctakes-trunk-package/ws/ctakes-smoking-status/pom.xml>
to org.apache.ctakes/ctakes-smoking-status/3.2.3-SNAPSHOT/ctakes-smoking-status-3.2.3-SNAPSHOT.pom
[JENKINS] Archiving <https://builds.apache.org/job/ctakes-trunk-package/ws/ctakes-clinical-pipeline/pom.xml>
to org.apache.ctakes/ctakes-clinical-pipeline/3.2.3-SNAPSHOT/ctakes-clinical-pipeline-3.2.3-SNAPSHOT.pom
[JENKINS] Archiving <https://builds.apache.org/job/ctakes-trunk-package/ws/ctakes-chunker/pom.xml>
to org.apache.ctakes/ctakes-chunker/3.2.3-SNAPSHOT/ctakes-chunker-3.2.3-SNAPSHOT.pom
[JENKINS] Archiving <https://builds.apache.org/job/ctakes-trunk-package/ws/ctakes-temporal/pom.xml>
to org.apache.ctakes/ctakes-temporal/3.2.3-SNAPSHOT/ctakes-temporal-3.2.3-SNAPSHOT.pom
[JENKINS] Archiving <https://builds.apache.org/job/ctakes-trunk-package/ws/ctakes-smoking-status-res/pom.xml>
to org.apache.ctakes/ctakes-smoking-status-res/3.2.3-SNAPSHOT/ctakes-smoking-status-res-3.2.3-SNAPSHOT.pom
[JENKINS] Archiving <https://builds.apache.org/job/ctakes-trunk-package/ws/ctakes-coreference-res/pom.xml>
to org.apache.ctakes/ctakes-coreference-res/3.2.3-SNAPSHOT/ctakes-coreference-res-3.2.3-SNAPSHOT.pom
[JENKINS] Archiving <https://builds.apache.org/job/ctakes-trunk-package/ws/ctakes-core-res/pom.xml>
to org.apache.ctakes/ctakes-core-res/3.2.3-SNAPSHOT/ctakes-core-res-3.2.3-SNAPSHOT.pom
[JENKINS] Archiving <https://builds.apache.org/job/ctakes-trunk-package/ws/ctakes-core-res/target/ctakes-core-res-3.2.3-SNAPSHOT.jar>
to org.apache.ctakes/ctakes-core-res/3.2.3-SNAPSHOT/ctakes-core-res-3.2.3-SNAPSHOT.jar
Compressed 644.62 KB of artifacts by 79.4% relative to #385
[JENKINS] Archiving <https://builds.apache.org/job/ctakes-trunk-package/ws/pom.xml>
to org.apache.ctakes/ctakes/3.2.3-SNAPSHOT/ctakes-3.2.3-SNAPSHOT.pom
[JENKINS] Archiving <https://builds.apache.org/job/ctakes-trunk-package/ws/ctakes-dictionary-lookup/pom.xml>
to org.apache.ctakes/ctakes-dictionary-lookup/3.2.3-SNAPSHOT/ctakes-dictionary-lookup-3.2.3-SNAPSHOT.pom
[JENKINS] Archiving <https://builds.apache.org/job/ctakes-trunk-package/ws/ctakes-dictionary-lookup-fast/pom.xml>
to org.apache.ctakes/ctakes-dictionary-lookup-fast/3.2.3-SNAPSHOT/ctakes-dictionary-lookup-fast-3.2.3-SNAPSHOT.pom
[JENKINS] Archiving <https://builds.apache.org/job/ctakes-trunk-package/ws/ctakes-assertion-zoner-res/pom.xml>
to org.apache.ctakes/ctakes-assertion-zoner-res/3.2.3-SNAPSHOT/ctakes-assertion-zoner-res-3.2.3-SNAPSHOT.pom
[JENKINS] Archiving <https://builds.apache.org/job/ctakes-trunk-package/ws/ctakes-examples/pom.xml>
to org.apache.ctakes/ctakes-examples/3.2.3-SNAPSHOT/ctakes-examples-3.2.3-SNAPSHOT.pom
[JENKINS] Archiving <https://builds.apache.org/job/ctakes-trunk-package/ws/ctakes-utils/pom.xml>
to org.apache.ctakes/ctakes-utils/3.2.3-SNAPSHOT/ctakes-utils-3.2.3-SNAPSHOT.pom
[JENKINS] Archiving <https://builds.apache.org/job/ctakes-trunk-package/ws/ctakes-utils/target/ctakes-utils-3.2.3-SNAPSHOT.jar>
to org.apache.ctakes/ctakes-utils/3.2.3-SNAPSHOT/ctakes-utils-3.2.3-SNAPSHOT.jar
[JENKINS] Archiving <https://builds.apache.org/job/ctakes-trunk-package/ws/ctakes-side-effect-res/pom.xml>
to org.apache.ctakes/ctakes-side-effect-res/3.2.3-SNAPSHOT/ctakes-side-effect-res-3.2.3-SNAPSHOT.pom
[JENKINS] Archiving <https://builds.apache.org/job/ctakes-trunk-package/ws/ctakes-constituency-parser-res/pom.xml>
to org.apache.ctakes/ctakes-constituency-parser-res/3.2.3-SNAPSHOT/ctakes-constituency-parser-res-3.2.3-SNAPSHOT.pom
[JENKINS] Archiving <https://builds.apache.org/job/ctakes-trunk-package/ws/ctakes-lvg/pom.xml>
to org.apache.ctakes/ctakes-lvg/3.2.3-SNAPSHOT/ctakes-lvg-3.2.3-SNAPSHOT.pom
[JENKINS] Archiving <https://builds.apache.org/job/ctakes-trunk-package/ws/ctakes-ytex-web/pom.xml>
to org.apache.ctakes/ctakes-ytex-web/3.2.3-SNAPSHOT/ctakes-ytex-web-3.2.3-SNAPSHOT.pom
[JENKINS] Archiving <https://builds.apache.org/job/ctakes-trunk-package/ws/ctakes-lvg-res/pom.xml>
to org.apache.ctakes/ctakes-lvg-res/3.2.3-SNAPSHOT/ctakes-lvg-res-3.2.3-SNAPSHOT.pom
[JENKINS] Archiving <https://builds.apache.org/job/ctakes-trunk-package/ws/ctakes-assertion-res/pom.xml>
to org.apache.ctakes/ctakes-assertion-res/3.2.3-SNAPSHOT/ctakes-assertion-res-3.2.3-SNAPSHOT.pom
[JENKINS] Archiving <https://builds.apache.org/job/ctakes-trunk-package/ws/ctakes-dictionary-lookup-fast-res/pom.xml>
to org.apache.ctakes/ctakes-dictionary-lookup-fast-res/3.2.3-SNAPSHOT/ctakes-dictionary-lookup-fast-res-3.2.3-SNAPSHOT.pom
[JENKINS] Archiving <https://builds.apache.org/job/ctakes-trunk-package/ws/ctakes-dependency-parser-res/pom.xml>
to org.apache.ctakes/ctakes-dependency-parser-res/3.2.3-SNAPSHOT/ctakes-dependency-parser-res-3.2.3-SNAPSHOT.pom
[JENKINS] Archiving <https://builds.apache.org/job/ctakes-trunk-package/ws/ctakes-assertion/pom.xml>
to org.apache.ctakes/ctakes-assertion/3.2.3-SNAPSHOT/ctakes-assertion-3.2.3-SNAPSHOT.pom
[JENKINS] Archiving <https://builds.apache.org/job/ctakes-trunk-package/ws/ctakes-temporal-res/pom.xml>
to org.apache.ctakes/ctakes-temporal-res/3.2.3-SNAPSHOT/ctakes-temporal-res-3.2.3-SNAPSHOT.pom
[JENKINS] Archiving <https://builds.apache.org/job/ctakes-trunk-package/ws/ctakes-relation-extractor-res/pom.xml>
to org.apache.ctakes/ctakes-relation-extractor-res/3.2.3-SNAPSHOT/ctakes-relation-extractor-res-3.2.3-SNAPSHOT.pom
[JENKINS] Archiving <https://builds.apache.org/job/ctakes-trunk-package/ws/ctakes-pos-tagger/pom.xml>
to org.apache.ctakes/ctakes-pos-tagger/3.2.3-SNAPSHOT/ctakes-pos-tagger-3.2.3-SNAPSHOT.pom
[JENKINS] Archiving <https://builds.apache.org/job/ctakes-trunk-package/ws/ctakes-relation-extractor/pom.xml>
to org.apache.ctakes/ctakes-relation-extractor/3.2.3-SNAPSHOT/ctakes-relation-extractor-3.2.3-SNAPSHOT.pom
[JENKINS] Archiving <https://builds.apache.org/job/ctakes-trunk-package/ws/ctakes-ne-contexts-res/pom.xml>
to org.apache.ctakes/ctakes-ne-contexts-res/3.2.3-SNAPSHOT/ctakes-ne-contexts-res-3.2.3-SNAPSHOT.pom
[JENKINS] Archiving <https://builds.apache.org/job/ctakes-trunk-package/ws/ctakes-constituency-parser/pom.xml>
to org.apache.ctakes/ctakes-constituency-parser/3.2.3-SNAPSHOT/ctakes-constituency-parser-3.2.3-SNAPSHOT.pom
[JENKINS] Archiving <https://builds.apache.org/job/ctakes-trunk-package/ws/ctakes-assertion-zoner/pom.xml>
to org.apache.ctakes/ctakes-assertion-zoner/3.2.3-SNAPSHOT/ctakes-assertion-zoner-3.2.3-SNAPSHOT.pom
[JENKINS] Archiving <https://builds.apache.org/job/ctakes-trunk-package/ws/ctakes-drug-ner-res/pom.xml>
to org.apache.ctakes/ctakes-drug-ner-res/3.2.3-SNAPSHOT/ctakes-drug-ner-res-3.2.3-SNAPSHOT.pom
[JENKINS] Archiving <https://builds.apache.org/job/ctakes-trunk-package/ws/ctakes-pos-tagger-res/pom.xml>
to org.apache.ctakes/ctakes-pos-tagger-res/3.2.3-SNAPSHOT/ctakes-pos-tagger-res-3.2.3-SNAPSHOT.pom
[JENKINS] Archiving <https://builds.apache.org/job/ctakes-trunk-package/ws/ctakes-chunker-res/pom.xml>
to org.apache.ctakes/ctakes-chunker-res/3.2.3-SNAPSHOT/ctakes-chunker-res-3.2.3-SNAPSHOT.pom
[JENKINS] Archiving <https://builds.apache.org/job/ctakes-trunk-package/ws/ctakes-ytex/pom.xml>
to org.apache.ctakes/ctakes-ytex/3.2.3-SNAPSHOT/ctakes-ytex-3.2.3-SNAPSHOT.pom
[JENKINS] Archiving <https://builds.apache.org/job/ctakes-trunk-package/ws/ctakes-template-filler/pom.xml>
to org.apache.ctakes/ctakes-template-filler/3.2.3-SNAPSHOT/ctakes-template-filler-3.2.3-SNAPSHOT.pom
[JENKINS] Archiving <https://builds.apache.org/job/ctakes-trunk-package/ws/ctakes-distribution/pom.xml>
to org.apache.ctakes/ctakes-distribution/3.2.3-SNAPSHOT/ctakes-distribution-3.2.3-SNAPSHOT.pom
[JENKINS] Archiving <https://builds.apache.org/job/ctakes-trunk-package/ws/ctakes-type-system/pom.xml>
to org.apache.ctakes/ctakes-type-system/3.2.3-SNAPSHOT/ctakes-type-system-3.2.3-SNAPSHOT.pom
[JENKINS] Archiving <https://builds.apache.org/job/ctakes-trunk-package/ws/ctakes-type-system/target/ctakes-type-system-3.2.3-SNAPSHOT.jar>
to org.apache.ctakes/ctakes-type-system/3.2.3-SNAPSHOT/ctakes-type-system-3.2.3-SNAPSHOT.jar
[JENKINS] Archiving <https://builds.apache.org/job/ctakes-trunk-package/ws/ctakes-side-effect/pom.xml>
to org.apache.ctakes/ctakes-side-effect/3.2.3-SNAPSHOT/ctakes-side-effect-3.2.3-SNAPSHOT.pom
[JENKINS] Archiving <https://builds.apache.org/job/ctakes-trunk-package/ws/ctakes-context-tokenizer/pom.xml>
to org.apache.ctakes/ctakes-context-tokenizer/3.2.3-SNAPSHOT/ctakes-context-tokenizer-3.2.3-SNAPSHOT.pom
Sending e-mails to: notifications@ctakes.apache.org sean.finan@tch.harvard.edu
channel stopped

Mime
View raw message