ctakes-notifications mailing list archives

Site index · List index
Message view « Date » · « Thread »
Top « Date » · « Thread »
From Apache Jenkins Server <jenk...@builds.apache.org>
Subject Build failed in Jenkins: ctakes-trunk-compiletest #742
Date Tue, 24 Nov 2015 22:19:41 GMT
See <https://builds.apache.org/job/ctakes-trunk-compiletest/742/changes>

Changes:

[seanfinan] Switching to Java 8 (again)

------------------------------------------
[...truncated 4729 lines...]
[INFO] Surefire report directory: <https://builds.apache.org/job/ctakes-trunk-compiletest/ws/ctakes-core-res/target/surefire-reports>

-------------------------------------------------------
 T E S T S
-------------------------------------------------------

Results :

Tests run: 0, Failures: 0, Errors: 0, Skipped: 0

[JENKINS] Recording test results
[JENKINS] Archiving disabled
[INFO]                                                                         
[INFO] ------------------------------------------------------------------------
[INFO] Building Apache cTAKES core 3.2.3-SNAPSHOT
[INFO] ------------------------------------------------------------------------
[INFO] 
[INFO] --- maven-clean-plugin:2.4.1:clean (default-clean) @ ctakes-core ---
[INFO] 
[INFO] --- maven-remote-resources-plugin:1.4:process (default) @ ctakes-core ---
[INFO] 
[INFO] --- maven-resources-plugin:2.5:resources (default-resources) @ ctakes-core ---
[debug] execute contextualize
[INFO] Using 'UTF-8' encoding to copy filtered resources.
[INFO] skip non existing resourceDirectory <https://builds.apache.org/job/ctakes-trunk-compiletest/ws/ctakes-core/src/main/resources>
[INFO] Copying 3 resources
[INFO] 
[INFO] --- maven-compiler-plugin:2.4:compile (default-compile) @ ctakes-core ---
[INFO] Compiling 166 source files to <https://builds.apache.org/job/ctakes-trunk-compiletest/ws/ctakes-core/target/classes>
[INFO] -------------------------------------------------------------
[ERROR] COMPILATION ERROR : 
[INFO] -------------------------------------------------------------
[ERROR] <https://builds.apache.org/job/ctakes-trunk-compiletest/ws/ctakes-core/src/main/java/org/apache/ctakes/core/cc/pretty/plaintext/PrettyTextWriterUima.java>:[11,43]
error: package org.apache.ctakes.core.config does not exist
[ERROR] <https://builds.apache.org/job/ctakes-trunk-compiletest/ws/ctakes-core/src/main/java/org/apache/ctakes/core/cc/pretty/plaintext/PrettyTextWriterUima.java>:[11,0]
error: static import only from classes and interfaces
[ERROR] <https://builds.apache.org/job/ctakes-trunk-compiletest/ws/ctakes-core/src/main/java/org/apache/ctakes/core/sentence/SentenceDetectorCtakes.java>:[45,25]
[deprecation] HashSumEventStream in opennlp.tools.util has been deprecated
[ERROR] <https://builds.apache.org/job/ctakes-trunk-compiletest/ws/ctakes-core/src/main/java/org/apache/ctakes/core/cc/pretty/plaintext/PrettyTextWriterFit.java>:[16,43]
error: package org.apache.ctakes.core.config does not exist
[ERROR] <https://builds.apache.org/job/ctakes-trunk-compiletest/ws/ctakes-core/src/main/java/org/apache/ctakes/core/cc/pretty/plaintext/PrettyTextWriterFit.java>:[16,0]
error: static import only from classes and interfaces
[ERROR] <https://builds.apache.org/job/ctakes-trunk-compiletest/ws/ctakes-core/src/main/java/org/apache/ctakes/core/cc/pretty/plaintext/PrettyTextWriterFit.java>:[17,43]
error: package org.apache.ctakes.core.config does not exist
[ERROR] <https://builds.apache.org/job/ctakes-trunk-compiletest/ws/ctakes-core/src/main/java/org/apache/ctakes/core/cc/pretty/plaintext/PrettyTextWriterFit.java>:[17,0]
error: static import only from classes and interfaces
[ERROR] <https://builds.apache.org/job/ctakes-trunk-compiletest/ws/ctakes-core/src/main/java/org/apache/ctakes/core/cr/TextReader.java>:[34,33]
[deprecation] CasInitializer in org.apache.uima.collection has been deprecated
[ERROR] <https://builds.apache.org/job/ctakes-trunk-compiletest/ws/ctakes-core/src/main/java/org/apache/ctakes/core/cc/pretty/plaintext/PrettyTextWriterFit.java>:[36,16]
error: cannot find symbol
[ERROR]   symbol:   variable PARAM_OUTPUTDIR
  location: class PrettyTextWriterFit
<https://builds.apache.org/job/ctakes-trunk-compiletest/ws/ctakes-core/src/main/java/org/apache/ctakes/core/cc/pretty/plaintext/PrettyTextWriterFit.java>:[38,23]
error: cannot find symbol
[ERROR]   symbol:   variable DESC_OUTPUTDIR
  location: class PrettyTextWriterFit
<https://builds.apache.org/job/ctakes-trunk-compiletest/ws/ctakes-core/src/main/java/org/apache/ctakes/core/cc/pretty/plaintext/PrettyTextWriterUima.java>:[43,80]
error: cannot find symbol
[ERROR]   symbol:   variable PARAM_OUTPUTDIR
  location: class PrettyTextWriterUima
<https://builds.apache.org/job/ctakes-trunk-compiletest/ws/ctakes-core/src/main/java/org/apache/ctakes/core/cr/FilesInDirectoryCollectionReader.java>:[224,7]
[deprecation] getCasInitializer() in CollectionReader_ImplBase has been deprecated
[ERROR] <https://builds.apache.org/job/ctakes-trunk-compiletest/ws/ctakes-core/src/main/java/org/apache/ctakes/core/cr/FilesInDirectoryCollectionReader.java>:[226,4]
[deprecation] getCasInitializer() in CollectionReader_ImplBase has been deprecated
[ERROR] <https://builds.apache.org/job/ctakes-trunk-compiletest/ws/ctakes-core/src/main/java/org/apache/ctakes/core/cr/JdbcCollectionReader.java>:[179,25]
[unchecked] unchecked conversion
[ERROR] <https://builds.apache.org/job/ctakes-trunk-compiletest/ws/ctakes-core/src/main/java/org/apache/ctakes/core/cr/JdbcCollectionReader.java>:[276,20]
[deprecation] getCasInitializer() in CollectionReader_ImplBase has been deprecated
[ERROR] <https://builds.apache.org/job/ctakes-trunk-compiletest/ws/ctakes-core/src/main/java/org/apache/ctakes/core/cr/JdbcCollectionReader.java>:[279,20]
[deprecation] getCasInitializer() in CollectionReader_ImplBase has been deprecated
[ERROR] <https://builds.apache.org/job/ctakes-trunk-compiletest/ws/ctakes-core/src/main/java/org/apache/ctakes/core/ae/SentenceDetector.java>:[318,30]
[deprecation] train(String,ObjectStream<SentenceSample>,boolean,Dictionary,TrainingParameters)
in SentenceDetectorME has been deprecated
[ERROR] <https://builds.apache.org/job/ctakes-trunk-compiletest/ws/ctakes-core/src/main/java/org/apache/ctakes/core/sentence/SentenceDetectorCtakes.java>:[251,5]
[deprecation] HashSumEventStream in opennlp.tools.util has been deprecated
[ERROR] <https://builds.apache.org/job/ctakes-trunk-compiletest/ws/ctakes-core/src/main/java/org/apache/ctakes/core/sentence/SentenceDetectorCtakes.java>:[251,35]
[deprecation] HashSumEventStream in opennlp.tools.util has been deprecated
[ERROR] <https://builds.apache.org/job/ctakes-trunk-compiletest/ws/ctakes-core/src/main/java/org/apache/ctakes/core/util/ListIterable.java>:[34,50]
[unchecked] unchecked cast
[ERROR]   required: T
  found:    TOP
  where T is a type-variable:
    T extends Object declared in class FSListIterator
<https://builds.apache.org/job/ctakes-trunk-compiletest/ws/ctakes-core/src/main/java/org/apache/ctakes/core/cr/XmiCollectionReaderCtakes.java>:[80,18]
[unchecked] unchecked call to add(E) as a member of the raw type ArrayList
[ERROR]   where E is a type-variable:
    E extends Object declared in class ArrayList
<https://builds.apache.org/job/ctakes-trunk-compiletest/ws/ctakes-core/src/main/java/org/apache/ctakes/core/cc/pretty/plaintext/PrettyTextWriterFit.java>:[63,95]
error: cannot find symbol
[ERROR]   symbol:   variable PARAM_OUTPUTDIR
  location: class PrettyTextWriterFit
<https://builds.apache.org/job/ctakes-trunk-compiletest/ws/ctakes-core/src/main/java/org/apache/ctakes/core/cc/pretty/plaintext/PrettyTextWriterFit.java>:[102,12]
error: cannot find symbol
[ERROR]   symbol:   variable PARAM_OUTPUTDIR
  location: class PrettyTextWriterFit
<https://builds.apache.org/job/ctakes-trunk-compiletest/ws/ctakes-core/src/main/java/org/apache/ctakes/core/resource/LuceneIndexReaderResourceImpl.java>:[70,44]
[deprecation] open(Directory) in IndexReader has been deprecated
[ERROR] <https://builds.apache.org/job/ctakes-trunk-compiletest/ws/ctakes-core/src/main/java/org/apache/ctakes/core/resource/LuceneIndexReaderResourceImpl.java>:[75,44]
[deprecation] open(Directory) in IndexReader has been deprecated
[ERROR] <https://builds.apache.org/job/ctakes-trunk-compiletest/ws/ctakes-core/src/main/java/org/apache/ctakes/core/resource/StringIntegerMapResourceImpl.java>:[101,15]
[unchecked] getMap() in StringIntegerMapResourceImpl implements getMap() in StringIntegerMapResource
[ERROR]   return type requires unchecked conversion from Map to Map<String,Integer>
<https://builds.apache.org/job/ctakes-trunk-compiletest/ws/ctakes-core/src/main/java/org/apache/ctakes/core/cr/LinesFromFileCollectionReader.java>:[175,7]
[deprecation] getCasInitializer() in CollectionReader_ImplBase has been deprecated
[ERROR] <https://builds.apache.org/job/ctakes-trunk-compiletest/ws/ctakes-core/src/main/java/org/apache/ctakes/core/cr/LinesFromFileCollectionReader.java>:[178,4]
[deprecation] getCasInitializer() in CollectionReader_ImplBase has been deprecated
[ERROR] <https://builds.apache.org/job/ctakes-trunk-compiletest/ws/ctakes-core/src/main/java/org/apache/ctakes/core/cr/TextReader.java>:[86,4]
[deprecation] CasInitializer in org.apache.uima.collection has been deprecated
[ERROR] <https://builds.apache.org/job/ctakes-trunk-compiletest/ws/ctakes-core/src/main/java/org/apache/ctakes/core/cr/TextReader.java>:[86,36]
[deprecation] getCasInitializer() in CollectionReader_ImplBase has been deprecated
[INFO] 30 errors 
[INFO] -------------------------------------------------------------
[JENKINS] Archiving disabled
[INFO] ------------------------------------------------------------------------
[INFO] Reactor Summary:
[INFO] 
[INFO] Apache cTAKES ..................................... SUCCESS [3.392s]
[INFO] Apache cTAKES common type system .................. SUCCESS [9.226s]
[INFO] Apache cTAKES utils ............................... SUCCESS [3.799s]
[INFO] Apache cTAKES Resources core ...................... SUCCESS [3.180s]
[INFO] Apache cTAKES core ................................ FAILURE [5.155s]
[INFO] Apache cTAKES Resources pos-tagger ................ SKIPPED
[INFO] Apache cTAKES part-of-speech tagger ............... SKIPPED
[INFO] Apache cTAKES Resources ctakes-chunker-res ........ SKIPPED
[INFO] Apache cTAKES chunker ............................. SKIPPED
[INFO] Apache cTAKES document preprocessor ............... SKIPPED
[INFO] Apache cTAKES Resources dictionary-lookup ......... SKIPPED
[INFO] Apache cTAKES dictionary lookup ................... SKIPPED
[INFO] Apache cTAKES context dependent tokenizer ......... SKIPPED
[INFO] Apache cTAKES Resources lvg ....................... SKIPPED
[INFO] Apache cTAKES LVG lexical tools ................... SKIPPED
[INFO] Apache cTAKES Resources ne-contexts ............... SKIPPED
[INFO] Apache cTAKES named entity contexts ............... SKIPPED
[INFO] Apache cTAKES Resources constituency-parser ....... SKIPPED
[INFO] Apache cTAKES Constituency Parser ................. SKIPPED
[INFO] Apache cTAKES Resources coreference ............... SKIPPED
[INFO] Apache cTAKES Resources relation-extractor ........ SKIPPED
[INFO] Apache cTAKES Resources dependency-parser ......... SKIPPED
[INFO] Apache cTAKES Dependency Parser ................... SKIPPED
[INFO] Apache cTAKES Relation Extractor .................. SKIPPED
[INFO] Apache cTAKES CoReference Resolver ................ SKIPPED
[INFO] Apache cTAKES Resources drug-ner .................. SKIPPED
[INFO] Apache cTAKES Drug NER ............................ SKIPPED
[INFO] Apache cTAKES Resources side-effect ............... SKIPPED
[INFO] Apache cTAKES Side Effects ........................ SKIPPED
[INFO] Apache cTAKES Resources smoking-status ............ SKIPPED
[INFO] Apache cTAKES Smoking Status ...................... SKIPPED
[INFO] Apache cTAKES Resources assertion ................. SKIPPED
[INFO] Apache cTAKES Assertion ........................... SKIPPED
[INFO] Apache cTAKES Resources assertion-zoner ........... SKIPPED
[INFO] Apache cTAKES Assertion's zoner ................... SKIPPED
[INFO] Apache cTAKES Resources temporal .................. SKIPPED
[INFO] Apache cTAKES Resources dictionary-lookup-fast-res  SKIPPED
[INFO] Apache cTAKES dictionary lookup fast .............. SKIPPED
[INFO] Apache cTAKES Resources ctakes-ytex-res ........... SKIPPED
[INFO] Apache cTAKES YTEX ................................ SKIPPED
[INFO] Apache cTAKES YTEX UIMA ........................... SKIPPED
[INFO] Apache cTAKES ctakes-clinical-pipeline ............ SKIPPED
[INFO] Apache cTAKES Temporal Information Extraction ..... SKIPPED
[INFO] Apache cTAKES YTEX Web ............................ SKIPPED
[INFO] Apache cTAKES Distribution ........................ SKIPPED
[INFO] Apache cTAKES Regression-test ..................... SKIPPED
[INFO] Apache cTAKES template filler ..................... SKIPPED
[INFO] ctakes-examples ................................... SKIPPED
[INFO] ------------------------------------------------------------------------
[INFO] BUILD FAILURE
[INFO] ------------------------------------------------------------------------
[INFO] Total time: 37.607s
[INFO] Finished at: Tue Nov 24 22:18:35 UTC 2015
[INFO] Final Memory: 38M/486M
[INFO] ------------------------------------------------------------------------
[JENKINS] Archiving disabled
[JENKINS] Archiving disabled
[JENKINS] Archiving disabled
[JENKINS] Archiving disabled
[JENKINS] Archiving disabled
[JENKINS] Archiving disabled
[JENKINS] Archiving disabled
[JENKINS] Archiving disabled
[JENKINS] Archiving disabled
[JENKINS] Archiving disabled
[JENKINS] Archiving disabled
[JENKINS] Archiving disabled
[JENKINS] Archiving disabled
[JENKINS] Archiving disabled
[JENKINS] Archiving disabled
[JENKINS] Archiving disabled
[JENKINS] Archiving disabled
[JENKINS] Archiving disabled
[JENKINS] Archiving disabled
[JENKINS] Archiving disabled
[JENKINS] Archiving disabled
[JENKINS] Archiving disabled
[JENKINS] Archiving disabled
[JENKINS] Archiving disabled
[JENKINS] Archiving disabled
[JENKINS] Archiving disabled
[JENKINS] Archiving disabled
[JENKINS] Archiving disabled
[JENKINS] Archiving disabled
[JENKINS] Archiving disabled
[JENKINS] Archiving disabled
[JENKINS] Archiving disabled
[JENKINS] Archiving disabled
[JENKINS] Archiving disabled
[JENKINS] Archiving disabled
[JENKINS] Archiving disabled
[JENKINS] Archiving disabled
[JENKINS] Archiving disabled
[JENKINS] Archiving disabled
[JENKINS] Archiving disabled
[JENKINS] Archiving disabled
[JENKINS] Archiving disabled
[JENKINS] Archiving disabled
[JENKINS] Archiving disabled
[JENKINS] Archiving disabled
[JENKINS] Archiving disabled
[JENKINS] Archiving disabled
[JENKINS] Archiving disabled
Waiting for Jenkins to finish collecting data
[ERROR] Failed to execute goal org.apache.maven.plugins:maven-compiler-plugin:2.4:compile
(default-compile) on project ctakes-core: Compilation failure: Compilation failure:
[ERROR] <https://builds.apache.org/job/ctakes-trunk-compiletest/ws/ctakes-core/src/main/java/org/apache/ctakes/core/cc/pretty/plaintext/PrettyTextWriterUima.java>:[11,43]
error: package org.apache.ctakes.core.config does not exist
[ERROR] <https://builds.apache.org/job/ctakes-trunk-compiletest/ws/ctakes-core/src/main/java/org/apache/ctakes/core/cc/pretty/plaintext/PrettyTextWriterUima.java>:[11,0]
error: static import only from classes and interfaces
[ERROR] <https://builds.apache.org/job/ctakes-trunk-compiletest/ws/ctakes-core/src/main/java/org/apache/ctakes/core/sentence/SentenceDetectorCtakes.java>:[45,25]
[deprecation] HashSumEventStream in opennlp.tools.util has been deprecated
[ERROR] <https://builds.apache.org/job/ctakes-trunk-compiletest/ws/ctakes-core/src/main/java/org/apache/ctakes/core/cc/pretty/plaintext/PrettyTextWriterFit.java>:[16,43]
error: package org.apache.ctakes.core.config does not exist
[ERROR] <https://builds.apache.org/job/ctakes-trunk-compiletest/ws/ctakes-core/src/main/java/org/apache/ctakes/core/cc/pretty/plaintext/PrettyTextWriterFit.java>:[16,0]
error: static import only from classes and interfaces
[ERROR] <https://builds.apache.org/job/ctakes-trunk-compiletest/ws/ctakes-core/src/main/java/org/apache/ctakes/core/cc/pretty/plaintext/PrettyTextWriterFit.java>:[17,43]
error: package org.apache.ctakes.core.config does not exist
[ERROR] <https://builds.apache.org/job/ctakes-trunk-compiletest/ws/ctakes-core/src/main/java/org/apache/ctakes/core/cc/pretty/plaintext/PrettyTextWriterFit.java>:[17,0]
error: static import only from classes and interfaces
[ERROR] <https://builds.apache.org/job/ctakes-trunk-compiletest/ws/ctakes-core/src/main/java/org/apache/ctakes/core/cr/TextReader.java>:[34,33]
[deprecation] CasInitializer in org.apache.uima.collection has been deprecated
[ERROR] <https://builds.apache.org/job/ctakes-trunk-compiletest/ws/ctakes-core/src/main/java/org/apache/ctakes/core/cc/pretty/plaintext/PrettyTextWriterFit.java>:[36,16]
error: cannot find symbol
[ERROR] symbol:   variable PARAM_OUTPUTDIR
[ERROR] location: class PrettyTextWriterFit
[ERROR] <https://builds.apache.org/job/ctakes-trunk-compiletest/ws/ctakes-core/src/main/java/org/apache/ctakes/core/cc/pretty/plaintext/PrettyTextWriterFit.java>:[38,23]
error: cannot find symbol
[ERROR] symbol:   variable DESC_OUTPUTDIR
[ERROR] location: class PrettyTextWriterFit
[ERROR] <https://builds.apache.org/job/ctakes-trunk-compiletest/ws/ctakes-core/src/main/java/org/apache/ctakes/core/cc/pretty/plaintext/PrettyTextWriterUima.java>:[43,80]
error: cannot find symbol
[ERROR] symbol:   variable PARAM_OUTPUTDIR
[ERROR] location: class PrettyTextWriterUima
[ERROR] <https://builds.apache.org/job/ctakes-trunk-compiletest/ws/ctakes-core/src/main/java/org/apache/ctakes/core/cr/FilesInDirectoryCollectionReader.java>:[224,7]
[deprecation] getCasInitializer() in CollectionReader_ImplBase has been deprecated
[ERROR] <https://builds.apache.org/job/ctakes-trunk-compiletest/ws/ctakes-core/src/main/java/org/apache/ctakes/core/cr/FilesInDirectoryCollectionReader.java>:[226,4]
[deprecation] getCasInitializer() in CollectionReader_ImplBase has been deprecated
[ERROR] <https://builds.apache.org/job/ctakes-trunk-compiletest/ws/ctakes-core/src/main/java/org/apache/ctakes/core/cr/JdbcCollectionReader.java>:[179,25]
[unchecked] unchecked conversion
[ERROR] <https://builds.apache.org/job/ctakes-trunk-compiletest/ws/ctakes-core/src/main/java/org/apache/ctakes/core/cr/JdbcCollectionReader.java>:[276,20]
[deprecation] getCasInitializer() in CollectionReader_ImplBase has been deprecated
[ERROR] <https://builds.apache.org/job/ctakes-trunk-compiletest/ws/ctakes-core/src/main/java/org/apache/ctakes/core/cr/JdbcCollectionReader.java>:[279,20]
[deprecation] getCasInitializer() in CollectionReader_ImplBase has been deprecated
[ERROR] <https://builds.apache.org/job/ctakes-trunk-compiletest/ws/ctakes-core/src/main/java/org/apache/ctakes/core/ae/SentenceDetector.java>:[318,30]
[deprecation] train(String,ObjectStream<SentenceSample>,boolean,Dictionary,TrainingParameters)
in SentenceDetectorME has been deprecated
[ERROR] <https://builds.apache.org/job/ctakes-trunk-compiletest/ws/ctakes-core/src/main/java/org/apache/ctakes/core/sentence/SentenceDetectorCtakes.java>:[251,5]
[deprecation] HashSumEventStream in opennlp.tools.util has been deprecated
[ERROR] <https://builds.apache.org/job/ctakes-trunk-compiletest/ws/ctakes-core/src/main/java/org/apache/ctakes/core/sentence/SentenceDetectorCtakes.java>:[251,35]
[deprecation] HashSumEventStream in opennlp.tools.util has been deprecated
[ERROR] <https://builds.apache.org/job/ctakes-trunk-compiletest/ws/ctakes-core/src/main/java/org/apache/ctakes/core/util/ListIterable.java>:[34,50]
[unchecked] unchecked cast
[ERROR] required: T
[ERROR] found:    TOP
[ERROR] where T is a type-variable:
[ERROR] T extends Object declared in class FSListIterator
[ERROR] <https://builds.apache.org/job/ctakes-trunk-compiletest/ws/ctakes-core/src/main/java/org/apache/ctakes/core/cr/XmiCollectionReaderCtakes.java>:[80,18]
[unchecked] unchecked call to add(E) as a member of the raw type ArrayList
[ERROR] where E is a type-variable:
[ERROR] E extends Object declared in class ArrayList
[ERROR] <https://builds.apache.org/job/ctakes-trunk-compiletest/ws/ctakes-core/src/main/java/org/apache/ctakes/core/cc/pretty/plaintext/PrettyTextWriterFit.java>:[63,95]
error: cannot find symbol
[ERROR] symbol:   variable PARAM_OUTPUTDIR
[ERROR] location: class PrettyTextWriterFit
[ERROR] <https://builds.apache.org/job/ctakes-trunk-compiletest/ws/ctakes-core/src/main/java/org/apache/ctakes/core/cc/pretty/plaintext/PrettyTextWriterFit.java>:[102,12]
error: cannot find symbol
[ERROR] symbol:   variable PARAM_OUTPUTDIR
[ERROR] location: class PrettyTextWriterFit
[ERROR] <https://builds.apache.org/job/ctakes-trunk-compiletest/ws/ctakes-core/src/main/java/org/apache/ctakes/core/resource/LuceneIndexReaderResourceImpl.java>:[70,44]
[deprecation] open(Directory) in IndexReader has been deprecated
[ERROR] <https://builds.apache.org/job/ctakes-trunk-compiletest/ws/ctakes-core/src/main/java/org/apache/ctakes/core/resource/LuceneIndexReaderResourceImpl.java>:[75,44]
[deprecation] open(Directory) in IndexReader has been deprecated
[ERROR] <https://builds.apache.org/job/ctakes-trunk-compiletest/ws/ctakes-core/src/main/java/org/apache/ctakes/core/resource/StringIntegerMapResourceImpl.java>:[101,15]
[unchecked] getMap() in StringIntegerMapResourceImpl implements getMap() in StringIntegerMapResource
[ERROR] return type requires unchecked conversion from Map to Map<String,Integer>
[ERROR] <https://builds.apache.org/job/ctakes-trunk-compiletest/ws/ctakes-core/src/main/java/org/apache/ctakes/core/cr/LinesFromFileCollectionReader.java>:[175,7]
[deprecation] getCasInitializer() in CollectionReader_ImplBase has been deprecated
[ERROR] <https://builds.apache.org/job/ctakes-trunk-compiletest/ws/ctakes-core/src/main/java/org/apache/ctakes/core/cr/LinesFromFileCollectionReader.java>:[178,4]
[deprecation] getCasInitializer() in CollectionReader_ImplBase has been deprecated
[ERROR] <https://builds.apache.org/job/ctakes-trunk-compiletest/ws/ctakes-core/src/main/java/org/apache/ctakes/core/cr/TextReader.java>:[86,4]
[deprecation] CasInitializer in org.apache.uima.collection has been deprecated
[ERROR] <https://builds.apache.org/job/ctakes-trunk-compiletest/ws/ctakes-core/src/main/java/org/apache/ctakes/core/cr/TextReader.java>:[86,36]
[deprecation] getCasInitializer() in CollectionReader_ImplBase has been deprecated
[ERROR] -> [Help 1]
[ERROR] 
[ERROR] To see the full stack trace of the errors, re-run Maven with the -e switch.
[ERROR] Re-run Maven using the -X switch to enable full debug logging.
[ERROR] 
[ERROR] For more information about the errors and possible solutions, please read the following
articles:
[ERROR] [Help 1] http://cwiki.apache.org/confluence/display/MAVEN/MojoFailureException
[ERROR] 
[ERROR] After correcting the problems, you can resume the build with the command
[ERROR]   mvn <goals> -rf :ctakes-core
Sending e-mails to: notifications@ctakes.apache.org
channel stopped

Mime
View raw message