ctakes-notifications mailing list archives

Site index · List index
Message view « Date » · « Thread »
Top « Date » · « Thread »
From Apache Jenkins Server <jenk...@builds.apache.org>
Subject Build failed in Jenkins: ctakes-trunk-compiletest » Apache cTAKES core #742
Date Tue, 24 Nov 2015 22:19:15 GMT
See <https://builds.apache.org/job/ctakes-trunk-compiletest/org.apache.ctakes$ctakes-core/742/>

------------------------------------------
[INFO]                                                                         
[INFO] ------------------------------------------------------------------------
[INFO] Building Apache cTAKES core 3.2.3-SNAPSHOT
[INFO] ------------------------------------------------------------------------
[INFO] 
[INFO] --- maven-clean-plugin:2.4.1:clean (default-clean) @ ctakes-core ---
[INFO] 
[INFO] --- maven-remote-resources-plugin:1.4:process (default) @ ctakes-core ---
[INFO] 
[INFO] --- maven-resources-plugin:2.5:resources (default-resources) @ ctakes-core ---
[debug] execute contextualize
[INFO] Using 'UTF-8' encoding to copy filtered resources.
[INFO] skip non existing resourceDirectory <https://builds.apache.org/job/ctakes-trunk-compiletest/org.apache.ctakes$ctakes-core/ws/src/main/resources>
[INFO] Copying 3 resources
[INFO] 
[INFO] --- maven-compiler-plugin:2.4:compile (default-compile) @ ctakes-core ---
[INFO] Compiling 166 source files to <https://builds.apache.org/job/ctakes-trunk-compiletest/org.apache.ctakes$ctakes-core/ws/target/classes>
[INFO] -------------------------------------------------------------
[ERROR] COMPILATION ERROR : 
[INFO] -------------------------------------------------------------
[ERROR] <https://builds.apache.org/job/ctakes-trunk-compiletest/org.apache.ctakes$ctakes-core/ws/src/main/java/org/apache/ctakes/core/cc/pretty/plaintext/PrettyTextWriterUima.java>:[11,43]
error: package org.apache.ctakes.core.config does not exist
[ERROR] <https://builds.apache.org/job/ctakes-trunk-compiletest/org.apache.ctakes$ctakes-core/ws/src/main/java/org/apache/ctakes/core/cc/pretty/plaintext/PrettyTextWriterUima.java>:[11,0]
error: static import only from classes and interfaces
[ERROR] <https://builds.apache.org/job/ctakes-trunk-compiletest/org.apache.ctakes$ctakes-core/ws/src/main/java/org/apache/ctakes/core/sentence/SentenceDetectorCtakes.java>:[45,25]
[deprecation] HashSumEventStream in opennlp.tools.util has been deprecated
[ERROR] <https://builds.apache.org/job/ctakes-trunk-compiletest/org.apache.ctakes$ctakes-core/ws/src/main/java/org/apache/ctakes/core/cc/pretty/plaintext/PrettyTextWriterFit.java>:[16,43]
error: package org.apache.ctakes.core.config does not exist
[ERROR] <https://builds.apache.org/job/ctakes-trunk-compiletest/org.apache.ctakes$ctakes-core/ws/src/main/java/org/apache/ctakes/core/cc/pretty/plaintext/PrettyTextWriterFit.java>:[16,0]
error: static import only from classes and interfaces
[ERROR] <https://builds.apache.org/job/ctakes-trunk-compiletest/org.apache.ctakes$ctakes-core/ws/src/main/java/org/apache/ctakes/core/cc/pretty/plaintext/PrettyTextWriterFit.java>:[17,43]
error: package org.apache.ctakes.core.config does not exist
[ERROR] <https://builds.apache.org/job/ctakes-trunk-compiletest/org.apache.ctakes$ctakes-core/ws/src/main/java/org/apache/ctakes/core/cc/pretty/plaintext/PrettyTextWriterFit.java>:[17,0]
error: static import only from classes and interfaces
[ERROR] <https://builds.apache.org/job/ctakes-trunk-compiletest/org.apache.ctakes$ctakes-core/ws/src/main/java/org/apache/ctakes/core/cr/TextReader.java>:[34,33]
[deprecation] CasInitializer in org.apache.uima.collection has been deprecated
[ERROR] <https://builds.apache.org/job/ctakes-trunk-compiletest/org.apache.ctakes$ctakes-core/ws/src/main/java/org/apache/ctakes/core/cc/pretty/plaintext/PrettyTextWriterFit.java>:[36,16]
error: cannot find symbol
[ERROR]   symbol:   variable PARAM_OUTPUTDIR
  location: class PrettyTextWriterFit
<https://builds.apache.org/job/ctakes-trunk-compiletest/org.apache.ctakes$ctakes-core/ws/src/main/java/org/apache/ctakes/core/cc/pretty/plaintext/PrettyTextWriterFit.java>:[38,23]
error: cannot find symbol
[ERROR]   symbol:   variable DESC_OUTPUTDIR
  location: class PrettyTextWriterFit
<https://builds.apache.org/job/ctakes-trunk-compiletest/org.apache.ctakes$ctakes-core/ws/src/main/java/org/apache/ctakes/core/cc/pretty/plaintext/PrettyTextWriterUima.java>:[43,80]
error: cannot find symbol
[ERROR]   symbol:   variable PARAM_OUTPUTDIR
  location: class PrettyTextWriterUima
<https://builds.apache.org/job/ctakes-trunk-compiletest/org.apache.ctakes$ctakes-core/ws/src/main/java/org/apache/ctakes/core/cr/FilesInDirectoryCollectionReader.java>:[224,7]
[deprecation] getCasInitializer() in CollectionReader_ImplBase has been deprecated
[ERROR] <https://builds.apache.org/job/ctakes-trunk-compiletest/org.apache.ctakes$ctakes-core/ws/src/main/java/org/apache/ctakes/core/cr/FilesInDirectoryCollectionReader.java>:[226,4]
[deprecation] getCasInitializer() in CollectionReader_ImplBase has been deprecated
[ERROR] <https://builds.apache.org/job/ctakes-trunk-compiletest/org.apache.ctakes$ctakes-core/ws/src/main/java/org/apache/ctakes/core/cr/JdbcCollectionReader.java>:[179,25]
[unchecked] unchecked conversion
[ERROR] <https://builds.apache.org/job/ctakes-trunk-compiletest/org.apache.ctakes$ctakes-core/ws/src/main/java/org/apache/ctakes/core/cr/JdbcCollectionReader.java>:[276,20]
[deprecation] getCasInitializer() in CollectionReader_ImplBase has been deprecated
[ERROR] <https://builds.apache.org/job/ctakes-trunk-compiletest/org.apache.ctakes$ctakes-core/ws/src/main/java/org/apache/ctakes/core/cr/JdbcCollectionReader.java>:[279,20]
[deprecation] getCasInitializer() in CollectionReader_ImplBase has been deprecated
[ERROR] <https://builds.apache.org/job/ctakes-trunk-compiletest/org.apache.ctakes$ctakes-core/ws/src/main/java/org/apache/ctakes/core/ae/SentenceDetector.java>:[318,30]
[deprecation] train(String,ObjectStream<SentenceSample>,boolean,Dictionary,TrainingParameters)
in SentenceDetectorME has been deprecated
[ERROR] <https://builds.apache.org/job/ctakes-trunk-compiletest/org.apache.ctakes$ctakes-core/ws/src/main/java/org/apache/ctakes/core/sentence/SentenceDetectorCtakes.java>:[251,5]
[deprecation] HashSumEventStream in opennlp.tools.util has been deprecated
[ERROR] <https://builds.apache.org/job/ctakes-trunk-compiletest/org.apache.ctakes$ctakes-core/ws/src/main/java/org/apache/ctakes/core/sentence/SentenceDetectorCtakes.java>:[251,35]
[deprecation] HashSumEventStream in opennlp.tools.util has been deprecated
[ERROR] <https://builds.apache.org/job/ctakes-trunk-compiletest/org.apache.ctakes$ctakes-core/ws/src/main/java/org/apache/ctakes/core/util/ListIterable.java>:[34,50]
[unchecked] unchecked cast
[ERROR]   required: T
  found:    TOP
  where T is a type-variable:
    T extends Object declared in class FSListIterator
<https://builds.apache.org/job/ctakes-trunk-compiletest/org.apache.ctakes$ctakes-core/ws/src/main/java/org/apache/ctakes/core/cr/XmiCollectionReaderCtakes.java>:[80,18]
[unchecked] unchecked call to add(E) as a member of the raw type ArrayList
[ERROR]   where E is a type-variable:
    E extends Object declared in class ArrayList
<https://builds.apache.org/job/ctakes-trunk-compiletest/org.apache.ctakes$ctakes-core/ws/src/main/java/org/apache/ctakes/core/cc/pretty/plaintext/PrettyTextWriterFit.java>:[63,95]
error: cannot find symbol
[ERROR]   symbol:   variable PARAM_OUTPUTDIR
  location: class PrettyTextWriterFit
<https://builds.apache.org/job/ctakes-trunk-compiletest/org.apache.ctakes$ctakes-core/ws/src/main/java/org/apache/ctakes/core/cc/pretty/plaintext/PrettyTextWriterFit.java>:[102,12]
error: cannot find symbol
[ERROR]   symbol:   variable PARAM_OUTPUTDIR
  location: class PrettyTextWriterFit
<https://builds.apache.org/job/ctakes-trunk-compiletest/org.apache.ctakes$ctakes-core/ws/src/main/java/org/apache/ctakes/core/resource/LuceneIndexReaderResourceImpl.java>:[70,44]
[deprecation] open(Directory) in IndexReader has been deprecated
[ERROR] <https://builds.apache.org/job/ctakes-trunk-compiletest/org.apache.ctakes$ctakes-core/ws/src/main/java/org/apache/ctakes/core/resource/LuceneIndexReaderResourceImpl.java>:[75,44]
[deprecation] open(Directory) in IndexReader has been deprecated
[ERROR] <https://builds.apache.org/job/ctakes-trunk-compiletest/org.apache.ctakes$ctakes-core/ws/src/main/java/org/apache/ctakes/core/resource/StringIntegerMapResourceImpl.java>:[101,15]
[unchecked] getMap() in StringIntegerMapResourceImpl implements getMap() in StringIntegerMapResource
[ERROR]   return type requires unchecked conversion from Map to Map<String,Integer>
<https://builds.apache.org/job/ctakes-trunk-compiletest/org.apache.ctakes$ctakes-core/ws/src/main/java/org/apache/ctakes/core/cr/LinesFromFileCollectionReader.java>:[175,7]
[deprecation] getCasInitializer() in CollectionReader_ImplBase has been deprecated
[ERROR] <https://builds.apache.org/job/ctakes-trunk-compiletest/org.apache.ctakes$ctakes-core/ws/src/main/java/org/apache/ctakes/core/cr/LinesFromFileCollectionReader.java>:[178,4]
[deprecation] getCasInitializer() in CollectionReader_ImplBase has been deprecated
[ERROR] <https://builds.apache.org/job/ctakes-trunk-compiletest/org.apache.ctakes$ctakes-core/ws/src/main/java/org/apache/ctakes/core/cr/TextReader.java>:[86,4]
[deprecation] CasInitializer in org.apache.uima.collection has been deprecated
[ERROR] <https://builds.apache.org/job/ctakes-trunk-compiletest/org.apache.ctakes$ctakes-core/ws/src/main/java/org/apache/ctakes/core/cr/TextReader.java>:[86,36]
[deprecation] getCasInitializer() in CollectionReader_ImplBase has been deprecated
[INFO] 30 errors 
[INFO] -------------------------------------------------------------
[JENKINS] Archiving disabled

Mime
View raw message