ctakes-notifications mailing list archives

Site index · List index
Message view « Date » · « Thread »
Top « Date » · « Thread »
From Apache Jenkins Server <jenk...@builds.apache.org>
Subject Build failed in Jenkins: ctakes-trunk-compiletest » Apache cTAKES ctakes-clinical-pipeline #737
Date Mon, 16 Nov 2015 22:30:26 GMT
See <https://builds.apache.org/job/ctakes-trunk-compiletest/org.apache.ctakes$ctakes-clinical-pipeline/737/>

------------------------------------------
[INFO]                                                                         
[INFO] ------------------------------------------------------------------------
[INFO] Building Apache cTAKES ctakes-clinical-pipeline 3.2.3-SNAPSHOT
[INFO] ------------------------------------------------------------------------
[INFO] 
[INFO] --- maven-clean-plugin:2.4.1:clean (default-clean) @ ctakes-clinical-pipeline ---
[INFO] 
[INFO] --- maven-remote-resources-plugin:1.4:process (default) @ ctakes-clinical-pipeline
---
[INFO] 
[INFO] --- maven-resources-plugin:2.5:resources (default-resources) @ ctakes-clinical-pipeline
---
[debug] execute contextualize
[INFO] Using 'UTF-8' encoding to copy filtered resources.
[INFO] skip non existing resourceDirectory <https://builds.apache.org/job/ctakes-trunk-compiletest/org.apache.ctakes$ctakes-clinical-pipeline/ws/src/main/resources>
[INFO] Copying 3 resources
[INFO] 
[INFO] --- maven-compiler-plugin:2.4:compile (default-compile) @ ctakes-clinical-pipeline
---
[INFO] Compiling 5 source files to <https://builds.apache.org/job/ctakes-trunk-compiletest/org.apache.ctakes$ctakes-clinical-pipeline/ws/target/classes>
[INFO] -------------------------------------------------------------
[ERROR] COMPILATION ERROR : 
[INFO] -------------------------------------------------------------
[ERROR] <https://builds.apache.org/job/ctakes-trunk-compiletest/org.apache.ctakes$ctakes-clinical-pipeline/ws/src/main/java/org/apache/ctakes/clinicalpipeline/runtime/BagOfAnnotationsGenerator.java>:[92,55]
[unchecked] unchecked cast
[ERROR]   required: Class<T>
  found:    Type
  where T is a type-variable:
    T extends Annotation declared in class BagOfAnnotationsGenerator
<https://builds.apache.org/job/ctakes-trunk-compiletest/org.apache.ctakes$ctakes-clinical-pipeline/ws/src/main/java/org/apache/ctakes/clinicalpipeline/ClinicalPipelineFactory.java>:[107,58]
error: unreported exception MalformedURLException; must be caught or declared to be thrown
[ERROR] <https://builds.apache.org/job/ctakes-trunk-compiletest/org.apache.ctakes$ctakes-clinical-pipeline/ws/src/main/java/org/apache/ctakes/clinicalpipeline/ae/ExtractionPrepAnnotator.java>:[152,23]
[unchecked] unchecked call to add(E) as a member of the raw type Set
[INFO] 3 errors 
[INFO] -------------------------------------------------------------
[JENKINS] Archiving disabled

Mime
View raw message