ctakes-notifications mailing list archives

Site index · List index
Message view « Date » · « Thread »
Top « Date » · « Thread »
From Apache Jenkins Server <jenk...@builds.apache.org>
Subject Build failed in Jenkins: ctakes-trunk-compiletest #740
Date Tue, 24 Nov 2015 19:33:08 GMT
See <https://builds.apache.org/job/ctakes-trunk-compiletest/740/changes>

Changes:

[seanfinan] CTAKES-377 Switching to Java 8 in main pom

------------------------------------------
[...truncated 4775 lines...]
[ERROR] <https://builds.apache.org/job/ctakes-trunk-compiletest/ws/ctakes-core/src/main/java/org/apache/ctakes/core/util/OntologyConceptUtil.java>:[110,30]
error: illegal start of expression
[ERROR] <https://builds.apache.org/job/ctakes-trunk-compiletest/ws/ctakes-core/src/main/java/org/apache/ctakes/core/util/OntologyConceptUtil.java>:[110,37]
error: ';' expected
[ERROR] <https://builds.apache.org/job/ctakes-trunk-compiletest/ws/ctakes-core/src/main/java/org/apache/ctakes/core/util/OntologyConceptUtil.java>:[120,42]
error: ')' expected
[ERROR] <https://builds.apache.org/job/ctakes-trunk-compiletest/ws/ctakes-core/src/main/java/org/apache/ctakes/core/util/OntologyConceptUtil.java>:[120,43]
error: illegal start of expression
[ERROR] <https://builds.apache.org/job/ctakes-trunk-compiletest/ws/ctakes-core/src/main/java/org/apache/ctakes/core/util/OntologyConceptUtil.java>:[120,54]
error: ';' expected
[ERROR] <https://builds.apache.org/job/ctakes-trunk-compiletest/ws/ctakes-core/src/main/java/org/apache/ctakes/core/util/OntologyConceptUtil.java>:[122,22]
error: illegal start of expression
[ERROR] <https://builds.apache.org/job/ctakes-trunk-compiletest/ws/ctakes-core/src/main/java/org/apache/ctakes/core/util/OntologyConceptUtil.java>:[125,55]
error: ')' expected
[ERROR] <https://builds.apache.org/job/ctakes-trunk-compiletest/ws/ctakes-core/src/main/java/org/apache/ctakes/core/util/OntologyConceptUtil.java>:[125,56]
error: ';' expected
[ERROR] <https://builds.apache.org/job/ctakes-trunk-compiletest/ws/ctakes-core/src/main/java/org/apache/ctakes/core/util/OntologyConceptUtil.java>:[125,57]
error: not a statement
[ERROR] <https://builds.apache.org/job/ctakes-trunk-compiletest/ws/ctakes-core/src/main/java/org/apache/ctakes/core/util/OntologyConceptUtil.java>:[125,72]
error: ';' expected
[ERROR] <https://builds.apache.org/job/ctakes-trunk-compiletest/ws/ctakes-core/src/main/java/org/apache/ctakes/core/util/OntologyConceptUtil.java>:[125,74]
error: not a statement
[ERROR] <https://builds.apache.org/job/ctakes-trunk-compiletest/ws/ctakes-core/src/main/java/org/apache/ctakes/core/util/OntologyConceptUtil.java>:[125,86]
error: ';' expected
[ERROR] <https://builds.apache.org/job/ctakes-trunk-compiletest/ws/ctakes-core/src/main/java/org/apache/ctakes/core/util/OntologyConceptUtil.java>:[125,88]
error: not a statement
[ERROR] <https://builds.apache.org/job/ctakes-trunk-compiletest/ws/ctakes-core/src/main/java/org/apache/ctakes/core/util/OntologyConceptUtil.java>:[125,97]
error: ';' expected
[ERROR] <https://builds.apache.org/job/ctakes-trunk-compiletest/ws/ctakes-core/src/main/java/org/apache/ctakes/core/util/OntologyConceptUtil.java>:[134,42]
error: ')' expected
[ERROR] <https://builds.apache.org/job/ctakes-trunk-compiletest/ws/ctakes-core/src/main/java/org/apache/ctakes/core/util/OntologyConceptUtil.java>:[134,43]
error: illegal start of expression
[ERROR] <https://builds.apache.org/job/ctakes-trunk-compiletest/ws/ctakes-core/src/main/java/org/apache/ctakes/core/util/OntologyConceptUtil.java>:[134,54]
error: ';' expected
[ERROR] <https://builds.apache.org/job/ctakes-trunk-compiletest/ws/ctakes-core/src/main/java/org/apache/ctakes/core/util/OntologyConceptUtil.java>:[136,22]
error: illegal start of expression
[ERROR] <https://builds.apache.org/job/ctakes-trunk-compiletest/ws/ctakes-core/src/main/java/org/apache/ctakes/core/util/OntologyConceptUtil.java>:[139,33]
error: ')' expected
[ERROR] <https://builds.apache.org/job/ctakes-trunk-compiletest/ws/ctakes-core/src/main/java/org/apache/ctakes/core/util/OntologyConceptUtil.java>:[139,34]
error: illegal start of expression
[ERROR] <https://builds.apache.org/job/ctakes-trunk-compiletest/ws/ctakes-core/src/main/java/org/apache/ctakes/core/util/OntologyConceptUtil.java>:[139,42]
error: ';' expected
[ERROR] <https://builds.apache.org/job/ctakes-trunk-compiletest/ws/ctakes-core/src/main/java/org/apache/ctakes/core/util/OntologyConceptUtil.java>:[151,42]
error: ')' expected
[ERROR] <https://builds.apache.org/job/ctakes-trunk-compiletest/ws/ctakes-core/src/main/java/org/apache/ctakes/core/util/OntologyConceptUtil.java>:[151,43]
error: illegal start of expression
[ERROR] <https://builds.apache.org/job/ctakes-trunk-compiletest/ws/ctakes-core/src/main/java/org/apache/ctakes/core/util/OntologyConceptUtil.java>:[151,54]
error: ';' expected
[ERROR] <https://builds.apache.org/job/ctakes-trunk-compiletest/ws/ctakes-core/src/main/java/org/apache/ctakes/core/util/OntologyConceptUtil.java>:[153,22]
error: illegal start of expression
[ERROR] <https://builds.apache.org/job/ctakes-trunk-compiletest/ws/ctakes-core/src/main/java/org/apache/ctakes/core/util/OntologyConceptUtil.java>:[154,30]
error: illegal start of expression
[ERROR] <https://builds.apache.org/job/ctakes-trunk-compiletest/ws/ctakes-core/src/main/java/org/apache/ctakes/core/util/OntologyConceptUtil.java>:[156,33]
error: ')' expected
[ERROR] <https://builds.apache.org/job/ctakes-trunk-compiletest/ws/ctakes-core/src/main/java/org/apache/ctakes/core/util/OntologyConceptUtil.java>:[156,34]
error: illegal start of expression
[ERROR] <https://builds.apache.org/job/ctakes-trunk-compiletest/ws/ctakes-core/src/main/java/org/apache/ctakes/core/util/OntologyConceptUtil.java>:[156,42]
error: ';' expected
[ERROR] <https://builds.apache.org/job/ctakes-trunk-compiletest/ws/ctakes-core/src/main/java/org/apache/ctakes/core/util/OntologyConceptUtil.java>:[194,37]
error: ')' expected
[ERROR] <https://builds.apache.org/job/ctakes-trunk-compiletest/ws/ctakes-core/src/main/java/org/apache/ctakes/core/util/OntologyConceptUtil.java>:[194,38]
error: illegal start of expression
[ERROR] <https://builds.apache.org/job/ctakes-trunk-compiletest/ws/ctakes-core/src/main/java/org/apache/ctakes/core/util/OntologyConceptUtil.java>:[194,53]
error: ';' expected
[ERROR] <https://builds.apache.org/job/ctakes-trunk-compiletest/ws/ctakes-core/src/main/java/org/apache/ctakes/core/util/OntologyConceptUtil.java>:[196,49]
error: ')' expected
[ERROR] <https://builds.apache.org/job/ctakes-trunk-compiletest/ws/ctakes-core/src/main/java/org/apache/ctakes/core/util/OntologyConceptUtil.java>:[196,50]
error: ';' expected
[ERROR] <https://builds.apache.org/job/ctakes-trunk-compiletest/ws/ctakes-core/src/main/java/org/apache/ctakes/core/util/OntologyConceptUtil.java>:[196,51]
error: not a statement
[ERROR] <https://builds.apache.org/job/ctakes-trunk-compiletest/ws/ctakes-core/src/main/java/org/apache/ctakes/core/util/OntologyConceptUtil.java>:[196,57]
error: ';' expected
[ERROR] <https://builds.apache.org/job/ctakes-trunk-compiletest/ws/ctakes-core/src/main/java/org/apache/ctakes/core/util/OntologyConceptUtil.java>:[196,62]
error: not a statement
[ERROR] <https://builds.apache.org/job/ctakes-trunk-compiletest/ws/ctakes-core/src/main/java/org/apache/ctakes/core/util/OntologyConceptUtil.java>:[196,68]
error: ';' expected
[ERROR] <https://builds.apache.org/job/ctakes-trunk-compiletest/ws/ctakes-core/src/main/java/org/apache/ctakes/core/util/OntologyConceptUtil.java>:[196,70]
error: not a statement
[ERROR] <https://builds.apache.org/job/ctakes-trunk-compiletest/ws/ctakes-core/src/main/java/org/apache/ctakes/core/util/OntologyConceptUtil.java>:[196,78]
error: ';' expected
[ERROR] <https://builds.apache.org/job/ctakes-trunk-compiletest/ws/ctakes-core/src/main/java/org/apache/ctakes/core/util/OntologyConceptUtil.java>:[196,80]
error: not a statement
[ERROR] <https://builds.apache.org/job/ctakes-trunk-compiletest/ws/ctakes-core/src/main/java/org/apache/ctakes/core/util/OntologyConceptUtil.java>:[196,89]
error: ';' expected
[ERROR] <https://builds.apache.org/job/ctakes-trunk-compiletest/ws/ctakes-core/src/main/java/org/apache/ctakes/core/util/OntologyConceptUtil.java>:[206,37]
error: ')' expected
[ERROR] <https://builds.apache.org/job/ctakes-trunk-compiletest/ws/ctakes-core/src/main/java/org/apache/ctakes/core/util/OntologyConceptUtil.java>:[206,38]
error: illegal start of expression
[ERROR] <https://builds.apache.org/job/ctakes-trunk-compiletest/ws/ctakes-core/src/main/java/org/apache/ctakes/core/util/OntologyConceptUtil.java>:[206,47]
error: ';' expected
[ERROR] <https://builds.apache.org/job/ctakes-trunk-compiletest/ws/ctakes-core/src/main/java/org/apache/ctakes/core/util/OntologyConceptUtil.java>:[207,32]
error: ')' expected
[ERROR] <https://builds.apache.org/job/ctakes-trunk-compiletest/ws/ctakes-core/src/main/java/org/apache/ctakes/core/util/OntologyConceptUtil.java>:[207,33]
error: illegal start of expression
[ERROR] <https://builds.apache.org/job/ctakes-trunk-compiletest/ws/ctakes-core/src/main/java/org/apache/ctakes/core/util/OntologyConceptUtil.java>:[207,40]
error: ';' expected
[ERROR] <https://builds.apache.org/job/ctakes-trunk-compiletest/ws/ctakes-core/src/main/java/org/apache/ctakes/core/util/OntologyConceptUtil.java>:[220,30]
error: illegal start of expression
[ERROR] <https://builds.apache.org/job/ctakes-trunk-compiletest/ws/ctakes-core/src/main/java/org/apache/ctakes/core/util/OntologyConceptUtil.java>:[221,32]
error: ')' expected
[ERROR] <https://builds.apache.org/job/ctakes-trunk-compiletest/ws/ctakes-core/src/main/java/org/apache/ctakes/core/util/OntologyConceptUtil.java>:[221,33]
error: illegal start of expression
[ERROR] <https://builds.apache.org/job/ctakes-trunk-compiletest/ws/ctakes-core/src/main/java/org/apache/ctakes/core/util/OntologyConceptUtil.java>:[221,40]
error: ';' expected
[ERROR] <https://builds.apache.org/job/ctakes-trunk-compiletest/ws/ctakes-core/src/main/java/org/apache/ctakes/core/util/OntologyConceptUtil.java>:[239,33]
error: illegal start of expression
[ERROR] <https://builds.apache.org/job/ctakes-trunk-compiletest/ws/ctakes-core/src/main/java/org/apache/ctakes/core/util/OntologyConceptUtil.java>:[252,33]
error: illegal start of expression
[ERROR] <https://builds.apache.org/job/ctakes-trunk-compiletest/ws/ctakes-core/src/main/java/org/apache/ctakes/core/util/OntologyConceptUtil.java>:[265,33]
error: illegal start of expression
[INFO] 71 errors 
[INFO] -------------------------------------------------------------
[JENKINS] Archiving disabled
[INFO] ------------------------------------------------------------------------
[INFO] Reactor Summary:
[INFO] 
[INFO] Apache cTAKES ..................................... SUCCESS [1.410s]
[INFO] Apache cTAKES common type system .................. SUCCESS [11.544s]
[INFO] Apache cTAKES utils ............................... SUCCESS [2.422s]
[INFO] Apache cTAKES Resources core ...................... SUCCESS [0.590s]
[INFO] Apache cTAKES core ................................ FAILURE [1.656s]
[INFO] Apache cTAKES Resources pos-tagger ................ SKIPPED
[INFO] Apache cTAKES part-of-speech tagger ............... SKIPPED
[INFO] Apache cTAKES Resources ctakes-chunker-res ........ SKIPPED
[INFO] Apache cTAKES chunker ............................. SKIPPED
[INFO] Apache cTAKES document preprocessor ............... SKIPPED
[INFO] Apache cTAKES Resources dictionary-lookup ......... SKIPPED
[INFO] Apache cTAKES dictionary lookup ................... SKIPPED
[INFO] Apache cTAKES context dependent tokenizer ......... SKIPPED
[INFO] Apache cTAKES Resources lvg ....................... SKIPPED
[INFO] Apache cTAKES LVG lexical tools ................... SKIPPED
[INFO] Apache cTAKES Resources ne-contexts ............... SKIPPED
[INFO] Apache cTAKES named entity contexts ............... SKIPPED
[INFO] Apache cTAKES Resources constituency-parser ....... SKIPPED
[INFO] Apache cTAKES Constituency Parser ................. SKIPPED
[INFO] Apache cTAKES Resources coreference ............... SKIPPED
[INFO] Apache cTAKES Resources relation-extractor ........ SKIPPED
[INFO] Apache cTAKES Resources dependency-parser ......... SKIPPED
[INFO] Apache cTAKES Dependency Parser ................... SKIPPED
[INFO] Apache cTAKES Relation Extractor .................. SKIPPED
[INFO] Apache cTAKES CoReference Resolver ................ SKIPPED
[INFO] Apache cTAKES Resources drug-ner .................. SKIPPED
[INFO] Apache cTAKES Drug NER ............................ SKIPPED
[INFO] Apache cTAKES Resources side-effect ............... SKIPPED
[INFO] Apache cTAKES Side Effects ........................ SKIPPED
[INFO] Apache cTAKES Resources smoking-status ............ SKIPPED
[INFO] Apache cTAKES Smoking Status ...................... SKIPPED
[INFO] Apache cTAKES Resources assertion ................. SKIPPED
[INFO] Apache cTAKES Assertion ........................... SKIPPED
[INFO] Apache cTAKES Resources assertion-zoner ........... SKIPPED
[INFO] Apache cTAKES Assertion's zoner ................... SKIPPED
[INFO] Apache cTAKES Resources temporal .................. SKIPPED
[INFO] Apache cTAKES Resources dictionary-lookup-fast-res  SKIPPED
[INFO] Apache cTAKES dictionary lookup fast .............. SKIPPED
[INFO] Apache cTAKES Resources ctakes-ytex-res ........... SKIPPED
[INFO] Apache cTAKES YTEX ................................ SKIPPED
[INFO] Apache cTAKES YTEX UIMA ........................... SKIPPED
[INFO] Apache cTAKES ctakes-clinical-pipeline ............ SKIPPED
[INFO] Apache cTAKES Temporal Information Extraction ..... SKIPPED
[INFO] Apache cTAKES YTEX Web ............................ SKIPPED
[INFO] Apache cTAKES Distribution ........................ SKIPPED
[INFO] Apache cTAKES Regression-test ..................... SKIPPED
[INFO] Apache cTAKES template filler ..................... SKIPPED
[INFO] ctakes-examples ................................... SKIPPED
[INFO] ------------------------------------------------------------------------
[INFO] BUILD FAILURE
[INFO] ------------------------------------------------------------------------
[INFO] Total time: 20.553s
[INFO] Finished at: Tue Nov 24 19:33:05 UTC 2015
[INFO] Final Memory: 31M/283M
[INFO] ------------------------------------------------------------------------
[JENKINS] Archiving disabled
[JENKINS] Archiving disabled
[JENKINS] Archiving disabled
[JENKINS] Archiving disabled
[JENKINS] Archiving disabled
[JENKINS] Archiving disabled
[JENKINS] Archiving disabled
[JENKINS] Archiving disabled
[JENKINS] Archiving disabled
[JENKINS] Archiving disabled
[JENKINS] Archiving disabled
[JENKINS] Archiving disabled
[JENKINS] Archiving disabled
[JENKINS] Archiving disabled
[JENKINS] Archiving disabled
[JENKINS] Archiving disabled
[JENKINS] Archiving disabled
[JENKINS] Archiving disabled
[JENKINS] Archiving disabled
[JENKINS] Archiving disabled
[JENKINS] Archiving disabled
[JENKINS] Archiving disabled
[JENKINS] Archiving disabled
[JENKINS] Archiving disabled
[JENKINS] Archiving disabled
[JENKINS] Archiving disabled
[JENKINS] Archiving disabled
[JENKINS] Archiving disabled
[JENKINS] Archiving disabled
[JENKINS] Archiving disabled
[JENKINS] Archiving disabled
[JENKINS] Archiving disabled
[JENKINS] Archiving disabled
[JENKINS] Archiving disabled
[JENKINS] Archiving disabled
[JENKINS] Archiving disabled
[JENKINS] Archiving disabled
[JENKINS] Archiving disabled
[JENKINS] Archiving disabled
[JENKINS] Archiving disabled
[JENKINS] Archiving disabled
[JENKINS] Archiving disabled
[JENKINS] Archiving disabled
[JENKINS] Archiving disabled
[JENKINS] Archiving disabled
[JENKINS] Archiving disabled
[JENKINS] Archiving disabled
[JENKINS] Archiving disabled
Waiting for Jenkins to finish collecting data
[ERROR] Failed to execute goal org.apache.maven.plugins:maven-compiler-plugin:2.4:compile
(default-compile) on project ctakes-core: Compilation failure: Compilation failure:
[ERROR] <https://builds.apache.org/job/ctakes-trunk-compiletest/ws/ctakes-core/src/main/java/org/apache/ctakes/core/util/OntologyConceptUtil.java>:[37,20]
error: illegal start of expression
[ERROR] <https://builds.apache.org/job/ctakes-trunk-compiletest/ws/ctakes-core/src/main/java/org/apache/ctakes/core/util/OntologyConceptUtil.java>:[40,20]
error: illegal start of expression
[ERROR] <https://builds.apache.org/job/ctakes-trunk-compiletest/ws/ctakes-core/src/main/java/org/apache/ctakes/core/util/OntologyConceptUtil.java>:[43,20]
error: illegal start of expression
[ERROR] <https://builds.apache.org/job/ctakes-trunk-compiletest/ws/ctakes-core/src/main/java/org/apache/ctakes/core/util/OntologyConceptUtil.java>:[46,17]
error: ')' expected
[ERROR] <https://builds.apache.org/job/ctakes-trunk-compiletest/ws/ctakes-core/src/main/java/org/apache/ctakes/core/util/OntologyConceptUtil.java>:[46,23]
error: ';' expected
[ERROR] <https://builds.apache.org/job/ctakes-trunk-compiletest/ws/ctakes-core/src/main/java/org/apache/ctakes/core/util/OntologyConceptUtil.java>:[52,23]
error: illegal start of expression
[ERROR] <https://builds.apache.org/job/ctakes-trunk-compiletest/ws/ctakes-core/src/main/java/org/apache/ctakes/core/util/OntologyConceptUtil.java>:[55,23]
error: illegal start of expression
[ERROR] <https://builds.apache.org/job/ctakes-trunk-compiletest/ws/ctakes-core/src/main/java/org/apache/ctakes/core/util/OntologyConceptUtil.java>:[59,16]
error: illegal start of expression
[ERROR] <https://builds.apache.org/job/ctakes-trunk-compiletest/ws/ctakes-core/src/main/java/org/apache/ctakes/core/util/OntologyConceptUtil.java>:[82,38]
error: ')' expected
[ERROR] <https://builds.apache.org/job/ctakes-trunk-compiletest/ws/ctakes-core/src/main/java/org/apache/ctakes/core/util/OntologyConceptUtil.java>:[82,39]
error: illegal start of expression
[ERROR] <https://builds.apache.org/job/ctakes-trunk-compiletest/ws/ctakes-core/src/main/java/org/apache/ctakes/core/util/OntologyConceptUtil.java>:[82,50]
error: ';' expected
[ERROR] <https://builds.apache.org/job/ctakes-trunk-compiletest/ws/ctakes-core/src/main/java/org/apache/ctakes/core/util/OntologyConceptUtil.java>:[83,22]
error: illegal start of expression
[ERROR] <https://builds.apache.org/job/ctakes-trunk-compiletest/ws/ctakes-core/src/main/java/org/apache/ctakes/core/util/OntologyConceptUtil.java>:[99,29]
error: ')' expected
[ERROR] <https://builds.apache.org/job/ctakes-trunk-compiletest/ws/ctakes-core/src/main/java/org/apache/ctakes/core/util/OntologyConceptUtil.java>:[99,30]
error: illegal start of expression
[ERROR] <https://builds.apache.org/job/ctakes-trunk-compiletest/ws/ctakes-core/src/main/java/org/apache/ctakes/core/util/OntologyConceptUtil.java>:[99,37]
error: ';' expected
[ERROR] <https://builds.apache.org/job/ctakes-trunk-compiletest/ws/ctakes-core/src/main/java/org/apache/ctakes/core/util/OntologyConceptUtil.java>:[110,29]
error: ')' expected
[ERROR] <https://builds.apache.org/job/ctakes-trunk-compiletest/ws/ctakes-core/src/main/java/org/apache/ctakes/core/util/OntologyConceptUtil.java>:[110,30]
error: illegal start of expression
[ERROR] <https://builds.apache.org/job/ctakes-trunk-compiletest/ws/ctakes-core/src/main/java/org/apache/ctakes/core/util/OntologyConceptUtil.java>:[110,37]
error: ';' expected
[ERROR] <https://builds.apache.org/job/ctakes-trunk-compiletest/ws/ctakes-core/src/main/java/org/apache/ctakes/core/util/OntologyConceptUtil.java>:[120,42]
error: ')' expected
[ERROR] <https://builds.apache.org/job/ctakes-trunk-compiletest/ws/ctakes-core/src/main/java/org/apache/ctakes/core/util/OntologyConceptUtil.java>:[120,43]
error: illegal start of expression
[ERROR] <https://builds.apache.org/job/ctakes-trunk-compiletest/ws/ctakes-core/src/main/java/org/apache/ctakes/core/util/OntologyConceptUtil.java>:[120,54]
error: ';' expected
[ERROR] <https://builds.apache.org/job/ctakes-trunk-compiletest/ws/ctakes-core/src/main/java/org/apache/ctakes/core/util/OntologyConceptUtil.java>:[122,22]
error: illegal start of expression
[ERROR] <https://builds.apache.org/job/ctakes-trunk-compiletest/ws/ctakes-core/src/main/java/org/apache/ctakes/core/util/OntologyConceptUtil.java>:[125,55]
error: ')' expected
[ERROR] <https://builds.apache.org/job/ctakes-trunk-compiletest/ws/ctakes-core/src/main/java/org/apache/ctakes/core/util/OntologyConceptUtil.java>:[125,56]
error: ';' expected
[ERROR] <https://builds.apache.org/job/ctakes-trunk-compiletest/ws/ctakes-core/src/main/java/org/apache/ctakes/core/util/OntologyConceptUtil.java>:[125,57]
error: not a statement
[ERROR] <https://builds.apache.org/job/ctakes-trunk-compiletest/ws/ctakes-core/src/main/java/org/apache/ctakes/core/util/OntologyConceptUtil.java>:[125,72]
error: ';' expected
[ERROR] <https://builds.apache.org/job/ctakes-trunk-compiletest/ws/ctakes-core/src/main/java/org/apache/ctakes/core/util/OntologyConceptUtil.java>:[125,74]
error: not a statement
[ERROR] <https://builds.apache.org/job/ctakes-trunk-compiletest/ws/ctakes-core/src/main/java/org/apache/ctakes/core/util/OntologyConceptUtil.java>:[125,86]
error: ';' expected
[ERROR] <https://builds.apache.org/job/ctakes-trunk-compiletest/ws/ctakes-core/src/main/java/org/apache/ctakes/core/util/OntologyConceptUtil.java>:[125,88]
error: not a statement
[ERROR] <https://builds.apache.org/job/ctakes-trunk-compiletest/ws/ctakes-core/src/main/java/org/apache/ctakes/core/util/OntologyConceptUtil.java>:[125,97]
error: ';' expected
[ERROR] <https://builds.apache.org/job/ctakes-trunk-compiletest/ws/ctakes-core/src/main/java/org/apache/ctakes/core/util/OntologyConceptUtil.java>:[134,42]
error: ')' expected
[ERROR] <https://builds.apache.org/job/ctakes-trunk-compiletest/ws/ctakes-core/src/main/java/org/apache/ctakes/core/util/OntologyConceptUtil.java>:[134,43]
error: illegal start of expression
[ERROR] <https://builds.apache.org/job/ctakes-trunk-compiletest/ws/ctakes-core/src/main/java/org/apache/ctakes/core/util/OntologyConceptUtil.java>:[134,54]
error: ';' expected
[ERROR] <https://builds.apache.org/job/ctakes-trunk-compiletest/ws/ctakes-core/src/main/java/org/apache/ctakes/core/util/OntologyConceptUtil.java>:[136,22]
error: illegal start of expression
[ERROR] <https://builds.apache.org/job/ctakes-trunk-compiletest/ws/ctakes-core/src/main/java/org/apache/ctakes/core/util/OntologyConceptUtil.java>:[139,33]
error: ')' expected
[ERROR] <https://builds.apache.org/job/ctakes-trunk-compiletest/ws/ctakes-core/src/main/java/org/apache/ctakes/core/util/OntologyConceptUtil.java>:[139,34]
error: illegal start of expression
[ERROR] <https://builds.apache.org/job/ctakes-trunk-compiletest/ws/ctakes-core/src/main/java/org/apache/ctakes/core/util/OntologyConceptUtil.java>:[139,42]
error: ';' expected
[ERROR] <https://builds.apache.org/job/ctakes-trunk-compiletest/ws/ctakes-core/src/main/java/org/apache/ctakes/core/util/OntologyConceptUtil.java>:[151,42]
error: ')' expected
[ERROR] <https://builds.apache.org/job/ctakes-trunk-compiletest/ws/ctakes-core/src/main/java/org/apache/ctakes/core/util/OntologyConceptUtil.java>:[151,43]
error: illegal start of expression
[ERROR] <https://builds.apache.org/job/ctakes-trunk-compiletest/ws/ctakes-core/src/main/java/org/apache/ctakes/core/util/OntologyConceptUtil.java>:[151,54]
error: ';' expected
[ERROR] <https://builds.apache.org/job/ctakes-trunk-compiletest/ws/ctakes-core/src/main/java/org/apache/ctakes/core/util/OntologyConceptUtil.java>:[153,22]
error: illegal start of expression
[ERROR] <https://builds.apache.org/job/ctakes-trunk-compiletest/ws/ctakes-core/src/main/java/org/apache/ctakes/core/util/OntologyConceptUtil.java>:[154,30]
error: illegal start of expression
[ERROR] <https://builds.apache.org/job/ctakes-trunk-compiletest/ws/ctakes-core/src/main/java/org/apache/ctakes/core/util/OntologyConceptUtil.java>:[156,33]
error: ')' expected
[ERROR] <https://builds.apache.org/job/ctakes-trunk-compiletest/ws/ctakes-core/src/main/java/org/apache/ctakes/core/util/OntologyConceptUtil.java>:[156,34]
error: illegal start of expression
[ERROR] <https://builds.apache.org/job/ctakes-trunk-compiletest/ws/ctakes-core/src/main/java/org/apache/ctakes/core/util/OntologyConceptUtil.java>:[156,42]
error: ';' expected
[ERROR] <https://builds.apache.org/job/ctakes-trunk-compiletest/ws/ctakes-core/src/main/java/org/apache/ctakes/core/util/OntologyConceptUtil.java>:[194,37]
error: ')' expected
[ERROR] <https://builds.apache.org/job/ctakes-trunk-compiletest/ws/ctakes-core/src/main/java/org/apache/ctakes/core/util/OntologyConceptUtil.java>:[194,38]
error: illegal start of expression
[ERROR] <https://builds.apache.org/job/ctakes-trunk-compiletest/ws/ctakes-core/src/main/java/org/apache/ctakes/core/util/OntologyConceptUtil.java>:[194,53]
error: ';' expected
[ERROR] <https://builds.apache.org/job/ctakes-trunk-compiletest/ws/ctakes-core/src/main/java/org/apache/ctakes/core/util/OntologyConceptUtil.java>:[196,49]
error: ')' expected
[ERROR] <https://builds.apache.org/job/ctakes-trunk-compiletest/ws/ctakes-core/src/main/java/org/apache/ctakes/core/util/OntologyConceptUtil.java>:[196,50]
error: ';' expected
[ERROR] <https://builds.apache.org/job/ctakes-trunk-compiletest/ws/ctakes-core/src/main/java/org/apache/ctakes/core/util/OntologyConceptUtil.java>:[196,51]
error: not a statement
[ERROR] <https://builds.apache.org/job/ctakes-trunk-compiletest/ws/ctakes-core/src/main/java/org/apache/ctakes/core/util/OntologyConceptUtil.java>:[196,57]
error: ';' expected
[ERROR] <https://builds.apache.org/job/ctakes-trunk-compiletest/ws/ctakes-core/src/main/java/org/apache/ctakes/core/util/OntologyConceptUtil.java>:[196,62]
error: not a statement
[ERROR] <https://builds.apache.org/job/ctakes-trunk-compiletest/ws/ctakes-core/src/main/java/org/apache/ctakes/core/util/OntologyConceptUtil.java>:[196,68]
error: ';' expected
[ERROR] <https://builds.apache.org/job/ctakes-trunk-compiletest/ws/ctakes-core/src/main/java/org/apache/ctakes/core/util/OntologyConceptUtil.java>:[196,70]
error: not a statement
[ERROR] <https://builds.apache.org/job/ctakes-trunk-compiletest/ws/ctakes-core/src/main/java/org/apache/ctakes/core/util/OntologyConceptUtil.java>:[196,78]
error: ';' expected
[ERROR] <https://builds.apache.org/job/ctakes-trunk-compiletest/ws/ctakes-core/src/main/java/org/apache/ctakes/core/util/OntologyConceptUtil.java>:[196,80]
error: not a statement
[ERROR] <https://builds.apache.org/job/ctakes-trunk-compiletest/ws/ctakes-core/src/main/java/org/apache/ctakes/core/util/OntologyConceptUtil.java>:[196,89]
error: ';' expected
[ERROR] <https://builds.apache.org/job/ctakes-trunk-compiletest/ws/ctakes-core/src/main/java/org/apache/ctakes/core/util/OntologyConceptUtil.java>:[206,37]
error: ')' expected
[ERROR] <https://builds.apache.org/job/ctakes-trunk-compiletest/ws/ctakes-core/src/main/java/org/apache/ctakes/core/util/OntologyConceptUtil.java>:[206,38]
error: illegal start of expression
[ERROR] <https://builds.apache.org/job/ctakes-trunk-compiletest/ws/ctakes-core/src/main/java/org/apache/ctakes/core/util/OntologyConceptUtil.java>:[206,47]
error: ';' expected
[ERROR] <https://builds.apache.org/job/ctakes-trunk-compiletest/ws/ctakes-core/src/main/java/org/apache/ctakes/core/util/OntologyConceptUtil.java>:[207,32]
error: ')' expected
[ERROR] <https://builds.apache.org/job/ctakes-trunk-compiletest/ws/ctakes-core/src/main/java/org/apache/ctakes/core/util/OntologyConceptUtil.java>:[207,33]
error: illegal start of expression
[ERROR] <https://builds.apache.org/job/ctakes-trunk-compiletest/ws/ctakes-core/src/main/java/org/apache/ctakes/core/util/OntologyConceptUtil.java>:[207,40]
error: ';' expected
[ERROR] <https://builds.apache.org/job/ctakes-trunk-compiletest/ws/ctakes-core/src/main/java/org/apache/ctakes/core/util/OntologyConceptUtil.java>:[220,30]
error: illegal start of expression
[ERROR] <https://builds.apache.org/job/ctakes-trunk-compiletest/ws/ctakes-core/src/main/java/org/apache/ctakes/core/util/OntologyConceptUtil.java>:[221,32]
error: ')' expected
[ERROR] <https://builds.apache.org/job/ctakes-trunk-compiletest/ws/ctakes-core/src/main/java/org/apache/ctakes/core/util/OntologyConceptUtil.java>:[221,33]
error: illegal start of expression
[ERROR] <https://builds.apache.org/job/ctakes-trunk-compiletest/ws/ctakes-core/src/main/java/org/apache/ctakes/core/util/OntologyConceptUtil.java>:[221,40]
error: ';' expected
[ERROR] <https://builds.apache.org/job/ctakes-trunk-compiletest/ws/ctakes-core/src/main/java/org/apache/ctakes/core/util/OntologyConceptUtil.java>:[239,33]
error: illegal start of expression
[ERROR] <https://builds.apache.org/job/ctakes-trunk-compiletest/ws/ctakes-core/src/main/java/org/apache/ctakes/core/util/OntologyConceptUtil.java>:[252,33]
error: illegal start of expression
[ERROR] <https://builds.apache.org/job/ctakes-trunk-compiletest/ws/ctakes-core/src/main/java/org/apache/ctakes/core/util/OntologyConceptUtil.java>:[265,33]
error: illegal start of expression
[ERROR] -> [Help 1]
[ERROR] 
[ERROR] To see the full stack trace of the errors, re-run Maven with the -e switch.
[ERROR] Re-run Maven using the -X switch to enable full debug logging.
[ERROR] 
[ERROR] For more information about the errors and possible solutions, please read the following
articles:
[ERROR] [Help 1] http://cwiki.apache.org/confluence/display/MAVEN/MojoFailureException
[ERROR] 
[ERROR] After correcting the problems, you can resume the build with the command
[ERROR]   mvn <goals> -rf :ctakes-core
Sending e-mails to: notifications@ctakes.apache.org
channel stopped

Mime
View raw message