ctakes-notifications mailing list archives

Site index · List index
Message view « Date » · « Thread »
Top « Date » · « Thread »
From Apache Jenkins Server <jenk...@builds.apache.org>
Subject Build failed in Jenkins: ctakes-trunk-compiletest #678
Date Tue, 12 May 2015 14:01:03 GMT
See <https://builds.apache.org/job/ctakes-trunk-compiletest/678/changes>

Changes:

[seanfinan] CTAKES-359 : added additional check for <Result>true</Result> preceded
by xml declaration

[chenpei] CTAKES-356
Create cTAKES 3.2.2 Release- Updating trunk to 3.2.3-SNAPSHOT for future release now.

------------------------------------------
[...truncated 9830 lines...]
[INFO] No sources to compile
[INFO] 
[INFO] --- maven-surefire-plugin:2.12.1:test (default-test) @ ctakes-temporal-res ---
[INFO] Surefire report directory: <https://builds.apache.org/job/ctakes-trunk-compiletest/ws/ctakes-temporal-res/target/surefire-reports>

-------------------------------------------------------
 T E S T S
-------------------------------------------------------

Results :

Tests run: 0, Failures: 0, Errors: 0, Skipped: 0

[JENKINS] Recording test results
[JENKINS] Archiving disabled
[INFO]                                                                         
[INFO] ------------------------------------------------------------------------
[INFO] Building Apache cTAKES Resources ctakes-ytex-res 3.2.3-SNAPSHOT
[INFO] ------------------------------------------------------------------------
[INFO] 
[INFO] --- maven-clean-plugin:2.4.1:clean (default-clean) @ ctakes-ytex-res ---
[INFO] 
[INFO] --- maven-remote-resources-plugin:1.4:process (default) @ ctakes-ytex-res ---
[INFO] 
[INFO] --- maven-resources-plugin:2.5:resources (default-resources) @ ctakes-ytex-res ---
[debug] execute contextualize
[INFO] Using 'UTF-8' encoding to copy filtered resources.
[INFO] Copying 48 resources
[INFO] Copying 3 resources
[INFO] 
[INFO] --- maven-compiler-plugin:2.4:compile (default-compile) @ ctakes-ytex-res ---
[INFO] No sources to compile
[INFO] 
[INFO] --- maven-remote-resources-plugin:1.4:process (default) @ ctakes-ytex-res ---
[INFO] 
[INFO] --- maven-resources-plugin:2.5:resources (default-resources) @ ctakes-ytex-res ---
[debug] execute contextualize
[INFO] Using 'UTF-8' encoding to copy filtered resources.
[INFO] Copying 48 resources
[INFO] Copying 3 resources
[INFO] Copying 3 resources
[INFO] 
[INFO] --- maven-compiler-plugin:2.4:compile (default-compile) @ ctakes-ytex-res ---
[INFO] No sources to compile
[INFO] 
[INFO] --- maven-resources-plugin:2.5:testResources (default-testResources) @ ctakes-ytex-res
---
[debug] execute contextualize
[INFO] Using 'UTF-8' encoding to copy filtered resources.
[INFO] Copying 0 resource
[INFO] Copying 3 resources
[INFO] Copying 3 resources
[INFO] 
[INFO] --- maven-compiler-plugin:2.4:testCompile (default-testCompile) @ ctakes-ytex-res ---
[INFO] No sources to compile
[INFO] 
[INFO] --- maven-surefire-plugin:2.12.1:test (default-test) @ ctakes-ytex-res ---
[INFO] Surefire report directory: <https://builds.apache.org/job/ctakes-trunk-compiletest/ws/ctakes-ytex-res/target/surefire-reports>

-------------------------------------------------------
 T E S T S
-------------------------------------------------------

Results :

Tests run: 0, Failures: 0, Errors: 0, Skipped: 0

[JENKINS] Recording test results
[JENKINS] Archiving disabled
[INFO]                                                                         
[INFO] ------------------------------------------------------------------------
[INFO] Building Apache cTAKES YTEX 3.2.3-SNAPSHOT
[INFO] ------------------------------------------------------------------------
Downloading: http://repo.maven.apache.org/maven2/org/codehaus/mojo/jaxb2-maven-plugin/maven-metadata.xml
Downloaded: http://repo.maven.apache.org/maven2/org/codehaus/mojo/jaxb2-maven-plugin/maven-metadata.xml
(570 B at 3.0 KB/sec)
Downloading: http://repo.maven.apache.org/maven2/org/codehaus/mojo/jaxb2-maven-plugin/2.1/jaxb2-maven-plugin-2.1.pom
Downloaded: http://repo.maven.apache.org/maven2/org/codehaus/mojo/jaxb2-maven-plugin/2.1/jaxb2-maven-plugin-2.1.pom
(15 KB at 130.8 KB/sec)
Downloading: http://repo.maven.apache.org/maven2/org/codehaus/mojo/jaxb2-maven-plugin/2.1/jaxb2-maven-plugin-2.1.jar
Downloaded: http://repo.maven.apache.org/maven2/org/codehaus/mojo/jaxb2-maven-plugin/2.1/jaxb2-maven-plugin-2.1.jar
(149 KB at 598.2 KB/sec)
[INFO] 
[INFO] --- maven-clean-plugin:2.4.1:clean (default-clean) @ ctakes-ytex ---
[INFO] 
[INFO] --- jaxb2-maven-plugin:2.1:xjc (default) @ ctakes-ytex ---
Downloading: http://repo.maven.apache.org/maven2/org/glassfish/jaxb/jaxb-core/2.2.11/jaxb-core-2.2.11.pom
Downloaded: http://repo.maven.apache.org/maven2/org/glassfish/jaxb/jaxb-core/2.2.11/jaxb-core-2.2.11.pom
(0 B at 0.0 KB/sec)
Downloading: http://repo.maven.apache.org/maven2/org/glassfish/jaxb/jaxb-runtime/2.2.11/jaxb-runtime-2.2.11.pom
Downloaded: http://repo.maven.apache.org/maven2/org/glassfish/jaxb/jaxb-runtime/2.2.11/jaxb-runtime-2.2.11.pom
(0 B at 0.0 KB/sec)
Downloading: http://repo.maven.apache.org/maven2/com/sun/xml/bind/mvn/jaxb-runtime-parent/2.2.11/jaxb-runtime-parent-2.2.11.pom
Downloaded: http://repo.maven.apache.org/maven2/com/sun/xml/bind/mvn/jaxb-runtime-parent/2.2.11/jaxb-runtime-parent-2.2.11.pom
(0 B at 0.0 KB/sec)
Downloading: http://repo.maven.apache.org/maven2/org/glassfish/jaxb/jaxb-xjc/2.2.11/jaxb-xjc-2.2.11.pom
Downloaded: http://repo.maven.apache.org/maven2/org/glassfish/jaxb/jaxb-xjc/2.2.11/jaxb-xjc-2.2.11.pom
(9 KB at 105.7 KB/sec)
Downloading: http://repo.maven.apache.org/maven2/com/sun/xsom/xsom/20140925/xsom-20140925.pom
Downloaded: http://repo.maven.apache.org/maven2/com/sun/xsom/xsom/20140925/xsom-20140925.pom
(12 KB at 129.2 KB/sec)
Downloading: http://repo.maven.apache.org/maven2/org/glassfish/jaxb/codemodel/2.2.11/codemodel-2.2.11.pom
Downloaded: http://repo.maven.apache.org/maven2/org/glassfish/jaxb/codemodel/2.2.11/codemodel-2.2.11.pom
(3 KB at 39.9 KB/sec)
Downloading: http://repo.maven.apache.org/maven2/com/sun/xml/bind/mvn/jaxb-codemodel-parent/2.2.11/jaxb-codemodel-parent-2.2.11.pom
Downloaded: http://repo.maven.apache.org/maven2/com/sun/xml/bind/mvn/jaxb-codemodel-parent/2.2.11/jaxb-codemodel-parent-2.2.11.pom
(3 KB at 36.4 KB/sec)
Downloading: http://repo.maven.apache.org/maven2/com/sun/xml/bind/external/rngom/2.2.11/rngom-2.2.11.pom
Downloaded: http://repo.maven.apache.org/maven2/com/sun/xml/bind/external/rngom/2.2.11/rngom-2.2.11.pom
(4 KB at 45.9 KB/sec)
Downloading: http://repo.maven.apache.org/maven2/com/sun/xml/bind/mvn/jaxb-external-parent/2.2.11/jaxb-external-parent-2.2.11.pom
Downloaded: http://repo.maven.apache.org/maven2/com/sun/xml/bind/mvn/jaxb-external-parent/2.2.11/jaxb-external-parent-2.2.11.pom
(3 KB at 35.2 KB/sec)
Downloading: http://repo.maven.apache.org/maven2/com/sun/xml/dtd-parser/dtd-parser/1.1/dtd-parser-1.1.pom
Downloaded: http://repo.maven.apache.org/maven2/com/sun/xml/dtd-parser/dtd-parser/1.1/dtd-parser-1.1.pom
(3 KB at 30.6 KB/sec)
Downloading: http://repo.maven.apache.org/maven2/com/sun/istack/istack-commons-tools/2.21/istack-commons-tools-2.21.pom
Downloaded: http://repo.maven.apache.org/maven2/com/sun/istack/istack-commons-tools/2.21/istack-commons-tools-2.21.pom
(6 KB at 73.3 KB/sec)
Downloading: http://repo.maven.apache.org/maven2/org/glassfish/jaxb/jaxb-jxc/2.2.11/jaxb-jxc-2.2.11.pom
Downloaded: http://repo.maven.apache.org/maven2/org/glassfish/jaxb/jaxb-jxc/2.2.11/jaxb-jxc-2.2.11.pom
(7 KB at 86.9 KB/sec)
Downloading: http://repo.maven.apache.org/maven2/org/glassfish/jaxb/jaxb-core/2.2.11/jaxb-core-2.2.11.jar
Downloading: http://repo.maven.apache.org/maven2/org/glassfish/jaxb/jaxb-runtime/2.2.11/jaxb-runtime-2.2.11.jar
Downloading: http://repo.maven.apache.org/maven2/org/glassfish/jaxb/jaxb-xjc/2.2.11/jaxb-xjc-2.2.11.jar
Downloading: http://repo.maven.apache.org/maven2/com/sun/xsom/xsom/20140925/xsom-20140925.jar
Downloading: http://repo.maven.apache.org/maven2/org/glassfish/jaxb/codemodel/2.2.11/codemodel-2.2.11.jar
Downloaded: http://repo.maven.apache.org/maven2/org/glassfish/jaxb/jaxb-core/2.2.11/jaxb-core-2.2.11.jar
(0 B at 0.0 KB/sec)
Downloading: http://repo.maven.apache.org/maven2/com/sun/xml/bind/external/rngom/2.2.11/rngom-2.2.11.jar
Downloaded: http://repo.maven.apache.org/maven2/org/glassfish/jaxb/jaxb-runtime/2.2.11/jaxb-runtime-2.2.11.jar
(0 B at 0.0 KB/sec)
Downloading: http://repo.maven.apache.org/maven2/com/sun/xml/dtd-parser/dtd-parser/1.1/dtd-parser-1.1.jar
Downloaded: http://repo.maven.apache.org/maven2/org/glassfish/jaxb/codemodel/2.2.11/codemodel-2.2.11.jar
(149 KB at 546.2 KB/sec)
Downloading: http://repo.maven.apache.org/maven2/com/sun/istack/istack-commons-tools/2.21/istack-commons-tools-2.21.jar
Downloaded: http://repo.maven.apache.org/maven2/com/sun/xml/dtd-parser/dtd-parser/1.1/dtd-parser-1.1.jar
(54 KB at 317.7 KB/sec)
Downloading: http://repo.maven.apache.org/maven2/org/glassfish/jaxb/jaxb-jxc/2.2.11/jaxb-jxc-2.2.11.jar
Downloaded: http://repo.maven.apache.org/maven2/com/sun/xml/bind/external/rngom/2.2.11/rngom-2.2.11.jar
(305 KB at 1409.8 KB/sec)
Downloaded: http://repo.maven.apache.org/maven2/com/sun/istack/istack-commons-tools/2.21/istack-commons-tools-2.21.jar
(25 KB at 350.0 KB/sec)
Downloaded: http://repo.maven.apache.org/maven2/com/sun/xsom/xsom/20140925/xsom-20140925.jar
(403 KB at 989.9 KB/sec)
Downloaded: http://repo.maven.apache.org/maven2/org/glassfish/jaxb/jaxb-jxc/2.2.11/jaxb-jxc-2.2.11.jar
(117 KB at 687.5 KB/sec)
Downloaded: http://repo.maven.apache.org/maven2/org/glassfish/jaxb/jaxb-xjc/2.2.11/jaxb-xjc-2.2.11.jar
(1016 KB at 1874.4 KB/sec)
[WARNING] Configured encoding [UTF-8] differs from encoding given in system property 'file.encoding'
[ISO-8859-1]
[INFO] Adding 'extension' flag to XJC arguments, since the 'generateEpisode' argument is given.
(XJCs 'episode' argument requires that the 'extension' argument is provided).
[INFO] Ignored given or default xjbSources [<https://builds.apache.org/job/ctakes-trunk-compiletest/ws/ctakes-ytex/src/main/xjb],>
since it is not an existent file or directory.
[INFO] Ignored given or default sources [<https://builds.apache.org/job/ctakes-trunk-compiletest/ws/ctakes-ytex/src/main/xsd],>
since it is not an existent file or directory.
[WARNING] No XSD files found. Please check your plugin configuration.
[JENKINS] Archiving disabled
[INFO] ------------------------------------------------------------------------
[INFO] Reactor Summary:
[INFO] 
[INFO] Apache cTAKES ..................................... SUCCESS [1.492s]
[INFO] Apache cTAKES common type system .................. SUCCESS [8.470s]
[INFO] Apache cTAKES utils ............................... SUCCESS [2.546s]
[INFO] Apache cTAKES Resources core ...................... SUCCESS [0.833s]
[INFO] Apache cTAKES core ................................ SUCCESS [13.899s]
[INFO] Apache cTAKES Resources pos-tagger ................ SUCCESS [0.810s]
[INFO] Apache cTAKES part-of-speech tagger ............... SUCCESS [4.487s]
[INFO] Apache cTAKES Resources ctakes-chunker-res ........ SUCCESS [0.738s]
[INFO] Apache cTAKES chunker ............................. SUCCESS [1.716s]
[INFO] Apache cTAKES document preprocessor ............... SUCCESS [2.090s]
[INFO] Apache cTAKES Resources dictionary-lookup ......... SUCCESS [12.788s]
[INFO] Apache cTAKES dictionary lookup ................... SUCCESS [3.040s]
[INFO] Apache cTAKES context dependent tokenizer ......... SUCCESS [1.278s]
[INFO] Apache cTAKES Resources lvg ....................... SUCCESS [21.365s]
[INFO] Apache cTAKES LVG lexical tools ................... SUCCESS [3.854s]
[INFO] Apache cTAKES Resources ne-contexts ............... SUCCESS [0.705s]
[INFO] Apache cTAKES named entity contexts ............... SUCCESS [3.228s]
[INFO] Apache cTAKES Resources constituency-parser ....... SUCCESS [0.953s]
[INFO] Apache cTAKES Constituency Parser ................. SUCCESS [1.559s]
[INFO] Apache cTAKES Resources coreference ............... SUCCESS [0.786s]
[INFO] Apache cTAKES Resources relation-extractor ........ SUCCESS [0.818s]
[INFO] Apache cTAKES Resources dependency-parser ......... SUCCESS [1.186s]
[INFO] Apache cTAKES Dependency Parser ................... SUCCESS [34.147s]
[INFO] Apache cTAKES Relation Extractor .................. SUCCESS [8.949s]
[INFO] Apache cTAKES CoReference Resolver ................ SUCCESS [5.918s]
[INFO] Apache cTAKES Resources drug-ner .................. SUCCESS [0.946s]
[INFO] Apache cTAKES Drug NER ............................ SUCCESS [5.668s]
[INFO] Apache cTAKES Resources side-effect ............... SUCCESS [0.908s]
[INFO] Apache cTAKES Side Effects ........................ SUCCESS [6.723s]
[INFO] Apache cTAKES Resources smoking-status ............ SUCCESS [0.911s]
[INFO] Apache cTAKES Smoking Status ...................... SUCCESS [6.520s]
[INFO] Apache cTAKES Resources assertion ................. SUCCESS [0.977s]
[INFO] Apache cTAKES Assertion ........................... SUCCESS [6.132s]
[INFO] Apache cTAKES Resources assertion-zoner ........... SUCCESS [0.837s]
[INFO] Apache cTAKES Assertion's zoner ................... SUCCESS [1.547s]
[INFO] Apache cTAKES Resources temporal .................. SUCCESS [0.779s]
[INFO] Apache cTAKES Resources ctakes-ytex-res ........... SUCCESS [0.759s]
[INFO] Apache cTAKES YTEX ................................ FAILURE [4.254s]
[INFO] Apache cTAKES YTEX UIMA ........................... SKIPPED
[INFO] Apache cTAKES Resources dictionary-lookup-fast-res  SKIPPED
[INFO] Apache cTAKES dictionary lookup fast .............. SKIPPED
[INFO] Apache cTAKES ctakes-clinical-pipeline ............ SKIPPED
[INFO] Apache cTAKES Temporal Information Extraction ..... SKIPPED
[INFO] Apache cTAKES YTEX Web ............................ SKIPPED
[INFO] Apache cTAKES Distribution ........................ SKIPPED
[INFO] Apache cTAKES Regression-test ..................... SKIPPED
[INFO] Apache cTAKES template filler ..................... SKIPPED
[INFO] ctakes-examples ................................... SKIPPED
[INFO] ------------------------------------------------------------------------
[INFO] BUILD FAILURE
[INFO] ------------------------------------------------------------------------
[INFO] Total time: 3:09.446s
[INFO] Finished at: Tue May 12 14:00:54 UTC 2015
[INFO] Final Memory: 62M/434M
[INFO] ------------------------------------------------------------------------
[JENKINS] Archiving disabled
[JENKINS] Archiving disabled
[JENKINS] Archiving disabled
[JENKINS] Archiving disabled
[JENKINS] Archiving disabled
[JENKINS] Archiving disabled
[JENKINS] Archiving disabled
[JENKINS] Archiving disabled
[JENKINS] Archiving disabled
[JENKINS] Archiving disabled
[JENKINS] Archiving disabled
[JENKINS] Archiving disabled
[JENKINS] Archiving disabled
[JENKINS] Archiving disabled
[JENKINS] Archiving disabled
[JENKINS] Archiving disabled
[JENKINS] Archiving disabled
[JENKINS] Archiving disabled
[JENKINS] Archiving disabled
[JENKINS] Archiving disabled
[JENKINS] Archiving disabled
[JENKINS] Archiving disabled
[JENKINS] Archiving disabled
[JENKINS] Archiving disabled
[JENKINS] Archiving disabled
[JENKINS] Archiving disabled
[JENKINS] Archiving disabled
[JENKINS] Archiving disabled
[JENKINS] Archiving disabled
[JENKINS] Archiving disabled
[JENKINS] Archiving disabled
[JENKINS] Archiving disabled
[JENKINS] Archiving disabled
[JENKINS] Archiving disabled
[JENKINS] Archiving disabled
[JENKINS] Archiving disabled
[JENKINS] Archiving disabled
[JENKINS] Archiving disabled
[JENKINS] Archiving disabled
[JENKINS] Archiving disabled
[JENKINS] Archiving disabled
[JENKINS] Archiving disabled
[JENKINS] Archiving disabled
[JENKINS] Archiving disabled
[JENKINS] Archiving disabled
[JENKINS] Archiving disabled
[JENKINS] Archiving disabled
[JENKINS] Archiving disabled
Waiting for Jenkins to finish collecting data
[ERROR] Failed to execute goal org.codehaus.mojo:jaxb2-maven-plugin:2.1:xjc (default) on project
ctakes-ytex: MojoExecutionException: NoSchemasException -> [Help 1]
[ERROR] 
[ERROR] To see the full stack trace of the errors, re-run Maven with the -e switch.
[ERROR] Re-run Maven using the -X switch to enable full debug logging.
[ERROR] 
[ERROR] For more information about the errors and possible solutions, please read the following
articles:
[ERROR] [Help 1] http://cwiki.apache.org/confluence/display/MAVEN/MojoExecutionException
[ERROR] 
[ERROR] After correcting the problems, you can resume the build with the command
[ERROR]   mvn <goals> -rf :ctakes-ytex
Sending e-mails to: notifications@ctakes.apache.org pei@peistation.com
channel stopped

Mime
View raw message