ctakes-notifications mailing list archives

Site index · List index
Message view « Date » · « Thread »
Top « Date » · « Thread »
From Apache Jenkins Server <jenk...@builds.apache.org>
Subject Build failed in Jenkins: ctakes-trunk-compiletest #662
Date Tue, 28 Apr 2015 20:27:47 GMT
See <https://builds.apache.org/job/ctakes-trunk-compiletest/662/changes>

Changes:

[chenpei] CTAKES-283 - Avoid duplicate generation of JCas classes

------------------------------------------
[...truncated 553 lines...]
[INFO] Apache cTAKES Side Effects ........................ SKIPPED
[INFO] Apache cTAKES Resources smoking-status ............ SKIPPED
[INFO] Apache cTAKES Smoking Status ...................... SKIPPED
[INFO] Apache cTAKES Resources assertion ................. SKIPPED
[INFO] Apache cTAKES Assertion ........................... SKIPPED
[INFO] Apache cTAKES Resources assertion-zoner ........... SKIPPED
[INFO] Apache cTAKES Assertion's zoner ................... SKIPPED
[INFO] Apache cTAKES Resources temporal .................. SKIPPED
[INFO] Apache cTAKES Resources ctakes-ytex-res ........... SKIPPED
[INFO] Apache cTAKES YTEX ................................ SKIPPED
[INFO] Apache cTAKES YTEX UIMA ........................... SKIPPED
[INFO] Apache cTAKES Resources dictionary-lookup-fast-res  SKIPPED
[INFO] Apache cTAKES dictionary lookup fast .............. SKIPPED
[INFO] Apache cTAKES ctakes-clinical-pipeline ............ SKIPPED
[INFO] Apache cTAKES Temporal Information Extraction ..... SKIPPED
[INFO] Apache cTAKES YTEX Web ............................ SKIPPED
[INFO] Apache cTAKES Distribution ........................ SKIPPED
[INFO] Apache cTAKES Regression-test ..................... SKIPPED
[INFO] Apache cTAKES template filler ..................... SKIPPED
[INFO] ctakes-examples ................................... SKIPPED
[INFO] ------------------------------------------------------------------------
[INFO] BUILD FAILURE
[INFO] ------------------------------------------------------------------------
[INFO] Total time: 16.054s
[INFO] Finished at: Tue Apr 28 20:27:33 UTC 2015
[INFO] Final Memory: 30M/299M
[INFO] ------------------------------------------------------------------------
[JENKINS] Archiving disabled
[JENKINS] Archiving disabled
[JENKINS] Archiving disabled
[JENKINS] Archiving disabled
[JENKINS] Archiving disabled
[JENKINS] Archiving disabled
[JENKINS] Archiving disabled
[JENKINS] Archiving disabled
[JENKINS] Archiving disabled
[JENKINS] Archiving disabled
[JENKINS] Archiving disabled
[JENKINS] Archiving disabled
[JENKINS] Archiving disabled
[JENKINS] Archiving disabled
[JENKINS] Archiving disabled
[JENKINS] Archiving disabled
[JENKINS] Archiving disabled
[JENKINS] Archiving disabled
[JENKINS] Archiving disabled
[JENKINS] Archiving disabled
[JENKINS] Archiving disabled
[JENKINS] Archiving disabled
[JENKINS] Archiving disabled
[JENKINS] Archiving disabled
[JENKINS] Archiving disabled
[JENKINS] Archiving disabled
[JENKINS] Archiving disabled
[JENKINS] Archiving disabled
[JENKINS] Archiving disabled
[JENKINS] Archiving disabled
[JENKINS] Archiving disabled
[JENKINS] Archiving disabled
[JENKINS] Archiving disabled
[JENKINS] Archiving disabled
[JENKINS] Archiving disabled
[JENKINS] Archiving disabled
[JENKINS] Archiving disabled
[JENKINS] Archiving disabled
[JENKINS] Archiving disabled
[JENKINS] Archiving disabled
[JENKINS] Archiving disabled
[JENKINS] Archiving disabled
[JENKINS] Archiving disabled
[JENKINS] Archiving disabled
[JENKINS] Archiving disabled
[JENKINS] Archiving disabled
[JENKINS] Archiving disabled
[JENKINS] Archiving disabled
Waiting for Jenkins to finish collecting data[ERROR] Failed to execute goal org.apache.maven.plugins:maven-compiler-plugin:2.4:compile
(default-compile) on project ctakes-core: Compilation failure: Compilation failure:
[ERROR] <https://builds.apache.org/job/ctakes-trunk-compiletest/ws/ctakes-core/src/main/java/org/apache/ctakes/core/ae/TokenizerAnnotatorPTB.java>:[28,47]
error: package org.apache.ctakes.typesystem.type.syntax does not exist
[ERROR] <https://builds.apache.org/job/ctakes-trunk-compiletest/ws/ctakes-core/src/main/java/org/apache/ctakes/core/ae/TokenizerAnnotatorPTB.java>:[29,47]
error: package org.apache.ctakes.typesystem.type.syntax does not exist
[ERROR] <https://builds.apache.org/job/ctakes-trunk-compiletest/ws/ctakes-core/src/main/java/org/apache/ctakes/core/ae/TokenizerAnnotatorPTB.java>:[30,49]
error: package org.apache.ctakes.typesystem.type.textspan does not exist
[ERROR] <https://builds.apache.org/job/ctakes-trunk-compiletest/ws/ctakes-core/src/main/java/org/apache/ctakes/core/ae/TokenizerAnnotatorPTB.java>:[31,49]
error: package org.apache.ctakes.typesystem.type.textspan does not exist
[ERROR] <https://builds.apache.org/job/ctakes-trunk-compiletest/ws/ctakes-core/src/main/java/org/apache/ctakes/core/nlp/tokenizer/TokenizerPTB.java>:[40,47]
error: package org.apache.ctakes.typesystem.type.syntax does not exist
[ERROR] <https://builds.apache.org/job/ctakes-trunk-compiletest/ws/ctakes-core/src/main/java/org/apache/ctakes/core/nlp/tokenizer/TokenizerPTB.java>:[41,47]
error: package org.apache.ctakes.typesystem.type.syntax does not exist
[ERROR] <https://builds.apache.org/job/ctakes-trunk-compiletest/ws/ctakes-core/src/main/java/org/apache/ctakes/core/nlp/tokenizer/TokenizerPTB.java>:[42,47]
error: package org.apache.ctakes.typesystem.type.syntax does not exist
[ERROR] <https://builds.apache.org/job/ctakes-trunk-compiletest/ws/ctakes-core/src/main/java/org/apache/ctakes/core/nlp/tokenizer/TokenizerPTB.java>:[43,47]
error: package org.apache.ctakes.typesystem.type.syntax does not exist
[ERROR] <https://builds.apache.org/job/ctakes-trunk-compiletest/ws/ctakes-core/src/main/java/org/apache/ctakes/core/nlp/tokenizer/TokenizerPTB.java>:[44,47]
error: package org.apache.ctakes.typesystem.type.syntax does not exist
[ERROR] <https://builds.apache.org/job/ctakes-trunk-compiletest/ws/ctakes-core/src/main/java/org/apache/ctakes/core/nlp/tokenizer/TokenizerPTB.java>:[45,47]
error: package org.apache.ctakes.typesystem.type.syntax does not exist
[ERROR] <https://builds.apache.org/job/ctakes-trunk-compiletest/ws/ctakes-core/src/main/java/org/apache/ctakes/core/nlp/tokenizer/TokenizerPTB.java>:[46,47]
error: package org.apache.ctakes.typesystem.type.syntax does not exist
[ERROR] <https://builds.apache.org/job/ctakes-trunk-compiletest/ws/ctakes-core/src/main/java/org/apache/ctakes/core/nlp/tokenizer/TokenizerPTB.java>:[67,24]
error: cannot find symbol
[ERROR] symbol:   class BaseToken
[ERROR] location: class TokenizerPTB
[ERROR] <https://builds.apache.org/job/ctakes-trunk-compiletest/ws/ctakes-core/src/main/java/org/apache/ctakes/core/nlp/tokenizer/TokenizerPTB.java>:[674,25]
error: cannot find symbol
[ERROR] symbol:   class BaseToken
[ERROR] location: class TokenizerPTB
[ERROR] <https://builds.apache.org/job/ctakes-trunk-compiletest/ws/ctakes-core/src/main/java/org/apache/ctakes/core/nlp/tokenizer/TokenizerPTB.java>:[933,25]
error: cannot find symbol
[ERROR] symbol:   class BaseToken
[ERROR] location: class TokenizerPTB
[ERROR] <https://builds.apache.org/job/ctakes-trunk-compiletest/ws/ctakes-core/src/main/java/org/apache/ctakes/core/nlp/tokenizer/TokenizerPTB.java>:[993,44]
error: cannot find symbol
[ERROR] symbol:   class BaseToken
[ERROR] location: class TokenizerPTB
[ERROR] <https://builds.apache.org/job/ctakes-trunk-compiletest/ws/ctakes-core/src/main/java/org/apache/ctakes/core/nlp/tokenizer/TokenizerPTB.java>:[1138,25]
error: cannot find symbol
[ERROR] symbol:   class NumToken
[ERROR] location: class TokenizerPTB
[ERROR] <https://builds.apache.org/job/ctakes-trunk-compiletest/ws/ctakes-core/src/main/java/org/apache/ctakes/core/nlp/tokenizer/TokenizerPTB.java>:[1146,29]
error: cannot find symbol
[ERROR] symbol:   class WordToken
[ERROR] location: class TokenizerPTB
[ERROR] <https://builds.apache.org/job/ctakes-trunk-compiletest/ws/ctakes-core/src/main/java/org/apache/ctakes/core/nlp/tokenizer/TokenizerPTB.java>:[1185,32]
error: cannot find symbol
[ERROR] symbol:   class WordToken
[ERROR] location: class TokenizerPTB
[ERROR] <https://builds.apache.org/job/ctakes-trunk-compiletest/ws/ctakes-core/src/main/java/org/apache/ctakes/core/util/DateParser.java>:[29,47]
error: package org.apache.ctakes.typesystem.type.refsem does not exist
[ERROR] <https://builds.apache.org/job/ctakes-trunk-compiletest/ws/ctakes-core/src/main/java/org/apache/ctakes/core/util/DateParser.java>:[78,15]
error: cannot find symbol
[ERROR] symbol:   class Date
[ERROR] location: class DateParser
[ERROR] <https://builds.apache.org/job/ctakes-trunk-compiletest/ws/ctakes-core/src/main/java/org/apache/ctakes/core/cr/FilesInDirectoryCollectionReader.java>:[63,51]
error: package org.apache.ctakes.typesystem.type.structured does not exist
[ERROR] <https://builds.apache.org/job/ctakes-trunk-compiletest/ws/ctakes-core/src/main/java/org/apache/ctakes/core/ae/SimpleSegmentWithTagsAnnotator.java>:[32,49]
error: package org.apache.ctakes.typesystem.type.textspan does not exist
[ERROR] <https://builds.apache.org/job/ctakes-trunk-compiletest/ws/ctakes-core/src/main/java/org/apache/ctakes/core/cc/TokenFreqCasConsumer.java>:[40,47]
error: package org.apache.ctakes.typesystem.type.syntax does not exist
[ERROR] <https://builds.apache.org/job/ctakes-trunk-compiletest/ws/ctakes-core/src/main/java/org/apache/ctakes/core/cc/TokenOffsetsCasConsumer.java>:[38,47]
error: package org.apache.ctakes.typesystem.type.syntax does not exist
[ERROR] <https://builds.apache.org/job/ctakes-trunk-compiletest/ws/ctakes-core/src/main/java/org/apache/ctakes/core/cc/NormalizedFilesInDirectoryCasConsumer.java>:[36,47]
error: package org.apache.ctakes.typesystem.type.syntax does not exist
[ERROR] <https://builds.apache.org/job/ctakes-trunk-compiletest/ws/ctakes-core/src/main/java/org/apache/ctakes/core/fsm/adapters/DecimalTokenAdapter.java>:[22,47]
error: package org.apache.ctakes.typesystem.type.syntax does not exist
[ERROR] <https://builds.apache.org/job/ctakes-trunk-compiletest/ws/ctakes-core/src/main/java/org/apache/ctakes/core/fsm/adapters/NumberTokenAdapter.java>:[22,47]
error: package org.apache.ctakes.typesystem.type.syntax does not exist
[ERROR] <https://builds.apache.org/job/ctakes-trunk-compiletest/ws/ctakes-core/src/main/java/org/apache/ctakes/core/fsm/adapters/DecimalTokenAdapter.java>:[36,28]
error: cannot find symbol
[ERROR] symbol:   class NumToken
[ERROR] location: class DecimalTokenAdapter
[ERROR] <https://builds.apache.org/job/ctakes-trunk-compiletest/ws/ctakes-core/src/main/java/org/apache/ctakes/core/fsm/adapters/NumberTokenAdapter.java>:[37,27]
error: cannot find symbol
[ERROR] symbol:   class NumToken
[ERROR] location: class NumberTokenAdapter
[ERROR] <https://builds.apache.org/job/ctakes-trunk-compiletest/ws/ctakes-core/src/main/java/org/apache/ctakes/core/ae/TokenizerAnnotator.java>:[42,47]
error: package org.apache.ctakes.typesystem.type.syntax does not exist
[ERROR] <https://builds.apache.org/job/ctakes-trunk-compiletest/ws/ctakes-core/src/main/java/org/apache/ctakes/core/ae/TokenizerAnnotator.java>:[43,49]
error: package org.apache.ctakes.typesystem.type.textspan does not exist
[ERROR] <https://builds.apache.org/job/ctakes-trunk-compiletest/ws/ctakes-core/src/main/java/org/apache/ctakes/core/util/SourceMetadataUtil.java>:[3,51]
error: package org.apache.ctakes.typesystem.type.structured does not exist
[ERROR] <https://builds.apache.org/job/ctakes-trunk-compiletest/ws/ctakes-core/src/main/java/org/apache/ctakes/core/util/SourceMetadataUtil.java>:[4,51]
error: package org.apache.ctakes.typesystem.type.structured does not exist
[ERROR] <https://builds.apache.org/job/ctakes-trunk-compiletest/ws/ctakes-core/src/main/java/org/apache/ctakes/core/util/SourceMetadataUtil.java>:[44,18]
error: cannot find symbol
[ERROR] symbol:   class Metadata
[ERROR] location: class SourceMetadataUtil
[ERROR] <https://builds.apache.org/job/ctakes-trunk-compiletest/ws/ctakes-core/src/main/java/org/apache/ctakes/core/util/SourceMetadataUtil.java>:[59,17]
error: cannot find symbol
[ERROR] symbol:   class SourceData
[ERROR] location: class SourceMetadataUtil
[ERROR] <https://builds.apache.org/job/ctakes-trunk-compiletest/ws/ctakes-core/src/main/java/org/apache/ctakes/core/util/SourceMetadataUtil.java>:[72,44]
error: cannot find symbol
[ERROR] symbol:   class SourceData
[ERROR] location: class SourceMetadataUtil
[ERROR] <https://builds.apache.org/job/ctakes-trunk-compiletest/ws/ctakes-core/src/main/java/org/apache/ctakes/core/util/SourceMetadataUtil.java>:[92,44]
error: cannot find symbol
[ERROR] symbol:   class SourceData
[ERROR] location: class SourceMetadataUtil
[ERROR] <https://builds.apache.org/job/ctakes-trunk-compiletest/ws/ctakes-core/src/main/java/org/apache/ctakes/core/util/SourceMetadataUtil.java>:[108,45]
error: cannot find symbol
[ERROR] symbol:   class SourceData
[ERROR] location: class SourceMetadataUtil
[ERROR] <https://builds.apache.org/job/ctakes-trunk-compiletest/ws/ctakes-core/src/main/java/org/apache/ctakes/core/util/SourceMetadataUtil.java>:[116,47]
error: cannot find symbol
[ERROR] symbol:   class SourceData
[ERROR] location: class SourceMetadataUtil
[ERROR] <https://builds.apache.org/job/ctakes-trunk-compiletest/ws/ctakes-core/src/main/java/org/apache/ctakes/core/fsm/adapters/CharacterTokenAdapter.java>:[22,47]
error: package org.apache.ctakes.typesystem.type.syntax does not exist
[ERROR] <https://builds.apache.org/job/ctakes-trunk-compiletest/ws/ctakes-core/src/main/java/org/apache/ctakes/core/fsm/adapters/PunctuationTokenAdapter.java>:[33,72]
error: package org.apache.ctakes.typesystem.type.syntax does not exist
[ERROR] <https://builds.apache.org/job/ctakes-trunk-compiletest/ws/ctakes-core/src/main/java/org/apache/ctakes/core/fsm/adapters/CharacterTokenAdapter.java>:[36,30]
error: cannot find symbol
[ERROR] symbol:   class BaseToken
[ERROR] location: class CharacterTokenAdapter
[ERROR] <https://builds.apache.org/job/ctakes-trunk-compiletest/ws/ctakes-core/src/main/java/org/apache/ctakes/core/cr/JdbcCollectionReader.java>:[49,51]
error: package org.apache.ctakes.typesystem.type.structured does not exist
[ERROR] <https://builds.apache.org/job/ctakes-trunk-compiletest/ws/ctakes-core/src/main/java/org/apache/ctakes/core/util/DocumentIDAnnotationUtil.java>:[26,51]
error: package org.apache.ctakes.typesystem.type.structured does not exist
[ERROR] <https://builds.apache.org/job/ctakes-trunk-compiletest/ws/ctakes-core/src/main/java/org/apache/ctakes/core/fsm/adapters/ContractionTokenAdapter.java>:[33,72]
error: package org.apache.ctakes.typesystem.type.syntax does not exist
[ERROR] <https://builds.apache.org/job/ctakes-trunk-compiletest/ws/ctakes-core/src/main/java/org/apache/ctakes/core/util/FSUtil.java>:[38,48]
error: package org.apache.ctakes.typesystem.type.textsem does not exist
[ERROR] <https://builds.apache.org/job/ctakes-trunk-compiletest/ws/ctakes-core/src/main/java/org/apache/ctakes/core/fsm/adapters/WordTokenAdapter.java>:[34,49]
error: package org.apache.ctakes.typesystem.type.syntax does not exist
[ERROR] <https://builds.apache.org/job/ctakes-trunk-compiletest/ws/ctakes-core/src/main/java/org/apache/ctakes/core/fsm/adapters/WordTokenAdapter.java>:[36,65]
error: package org.apache.ctakes.typesystem.type.syntax does not exist
[ERROR] <https://builds.apache.org/job/ctakes-trunk-compiletest/ws/ctakes-core/src/main/java/org/apache/ctakes/core/ae/SHARPKnowtatorXMLReader.java>:[38,47]
error: package org.apache.ctakes.typesystem.type.refsem does not exist
[ERROR] <https://builds.apache.org/job/ctakes-trunk-compiletest/ws/ctakes-core/src/main/java/org/apache/ctakes/core/ae/SHARPKnowtatorXMLReader.java>:[39,47]
error: package org.apache.ctakes.typesystem.type.refsem does not exist
[ERROR] <https://builds.apache.org/job/ctakes-trunk-compiletest/ws/ctakes-core/src/main/java/org/apache/ctakes/core/ae/SHARPKnowtatorXMLReader.java>:[40,47]
error: package org.apache.ctakes.typesystem.type.refsem does not exist
[ERROR] <https://builds.apache.org/job/ctakes-trunk-compiletest/ws/ctakes-core/src/main/java/org/apache/ctakes/core/ae/SHARPKnowtatorXMLReader.java>:[41,47]
error: package org.apache.ctakes.typesystem.type.refsem does not exist
[ERROR] <https://builds.apache.org/job/ctakes-trunk-compiletest/ws/ctakes-core/src/main/java/org/apache/ctakes/core/ae/SHARPKnowtatorXMLReader.java>:[42,47]
error: package org.apache.ctakes.typesystem.type.refsem does not exist
[ERROR] <https://builds.apache.org/job/ctakes-trunk-compiletest/ws/ctakes-core/src/main/java/org/apache/ctakes/core/ae/SHARPKnowtatorXMLReader.java>:[43,47]
error: package org.apache.ctakes.typesystem.type.refsem does not exist
[ERROR] <https://builds.apache.org/job/ctakes-trunk-compiletest/ws/ctakes-core/src/main/java/org/apache/ctakes/core/ae/SHARPKnowtatorXMLReader.java>:[44,47]
error: package org.apache.ctakes.typesystem.type.refsem does not exist

[ERROR] <https://builds.apache.org/job/ctakes-trunk-compiletest/ws/ctakes-core/src/main/java/org/apache/ctakes/core/ae/SHARPKnowtatorXMLReader.java>:[45,47]
error: package org.apache.ctakes.typesystem.type.refsem does not exist
[ERROR] <https://builds.apache.org/job/ctakes-trunk-compiletest/ws/ctakes-core/src/main/java/org/apache/ctakes/core/ae/SHARPKnowtatorXMLReader.java>:[46,47]
error: package org.apache.ctakes.typesystem.type.refsem does not exist
[ERROR] <https://builds.apache.org/job/ctakes-trunk-compiletest/ws/ctakes-core/src/main/java/org/apache/ctakes/core/ae/SHARPKnowtatorXMLReader.java>:[47,47]
error: package org.apache.ctakes.typesystem.type.refsem does not exist
[ERROR] <https://builds.apache.org/job/ctakes-trunk-compiletest/ws/ctakes-core/src/main/java/org/apache/ctakes/core/ae/SHARPKnowtatorXMLReader.java>:[48,47]
error: package org.apache.ctakes.typesystem.type.refsem does not exist
[ERROR] <https://builds.apache.org/job/ctakes-trunk-compiletest/ws/ctakes-core/src/main/java/org/apache/ctakes/core/ae/SHARPKnowtatorXMLReader.java>:[49,47]
error: package org.apache.ctakes.typesystem.type.refsem does not exist
[ERROR] <https://builds.apache.org/job/ctakes-trunk-compiletest/ws/ctakes-core/src/main/java/org/apache/ctakes/core/ae/SHARPKnowtatorXMLReader.java>:[50,47]
error: package org.apache.ctakes.typesystem.type.refsem does not exist
[ERROR] <https://builds.apache.org/job/ctakes-trunk-compiletest/ws/ctakes-core/src/main/java/org/apache/ctakes/core/ae/SHARPKnowtatorXMLReader.java>:[51,47]
error: package org.apache.ctakes.typesystem.type.refsem does not exist
[ERROR] <https://builds.apache.org/job/ctakes-trunk-compiletest/ws/ctakes-core/src/main/java/org/apache/ctakes/core/ae/SHARPKnowtatorXMLReader.java>:[52,47]
error: package org.apache.ctakes.typesystem.type.refsem does not exist
[ERROR] <https://builds.apache.org/job/ctakes-trunk-compiletest/ws/ctakes-core/src/main/java/org/apache/ctakes/core/ae/SHARPKnowtatorXMLReader.java>:[53,47]
error: package org.apache.ctakes.typesystem.type.refsem does not exist
[ERROR] <https://builds.apache.org/job/ctakes-trunk-compiletest/ws/ctakes-core/src/main/java/org/apache/ctakes/core/ae/SHARPKnowtatorXMLReader.java>:[54,47]
error: package org.apache.ctakes.typesystem.type.refsem does not exist
[ERROR] <https://builds.apache.org/job/ctakes-trunk-compiletest/ws/ctakes-core/src/main/java/org/apache/ctakes/core/ae/SHARPKnowtatorXMLReader.java>:[55,47]
error: package org.apache.ctakes.typesystem.type.refsem does not exist
[ERROR] <https://builds.apache.org/job/ctakes-trunk-compiletest/ws/ctakes-core/src/main/java/org/apache/ctakes/core/ae/SHARPKnowtatorXMLReader.java>:[56,47]
error: package org.apache.ctakes.typesystem.type.refsem does not exist
[ERROR] <https://builds.apache.org/job/ctakes-trunk-compiletest/ws/ctakes-core/src/main/java/org/apache/ctakes/core/ae/SHARPKnowtatorXMLReader.java>:[57,47]
error: package org.apache.ctakes.typesystem.type.refsem does not exist
[ERROR] <https://builds.apache.org/job/ctakes-trunk-compiletest/ws/ctakes-core/src/main/java/org/apache/ctakes/core/ae/SHARPKnowtatorXMLReader.java>:[58,49]
error: package org.apache.ctakes.typesystem.type.relation does not exist
[ERROR] <https://builds.apache.org/job/ctakes-trunk-compiletest/ws/ctakes-core/src/main/java/org/apache/ctakes/core/ae/SHARPKnowtatorXMLReader.java>:[59,49]
error: package org.apache.ctakes.typesystem.type.relation does not exist
[ERROR] <https://builds.apache.org/job/ctakes-trunk-compiletest/ws/ctakes-core/src/main/java/org/apache/ctakes/core/ae/SHARPKnowtatorXMLReader.java>:[60,49]
error: package org.apache.ctakes.typesystem.type.relation does not exist
[ERROR] <https://builds.apache.org/job/ctakes-trunk-compiletest/ws/ctakes-core/src/main/java/org/apache/ctakes/core/ae/SHARPKnowtatorXMLReader.java>:[61,49]
error: package org.apache.ctakes.typesystem.type.relation does not exist
[ERROR] <https://builds.apache.org/job/ctakes-trunk-compiletest/ws/ctakes-core/src/main/java/org/apache/ctakes/core/ae/SHARPKnowtatorXMLReader.java>:[62,49]
error: package org.apache.ctakes.typesystem.type.relation does not exist
[ERROR] <https://builds.apache.org/job/ctakes-trunk-compiletest/ws/ctakes-core/src/main/java/org/apache/ctakes/core/ae/SHARPKnowtatorXMLReader.java>:[63,49]
error: package org.apache.ctakes.typesystem.type.relation does not exist
[ERROR] <https://builds.apache.org/job/ctakes-trunk-compiletest/ws/ctakes-core/src/main/java/org/apache/ctakes/core/ae/SHARPKnowtatorXMLReader.java>:[64,49]
error: package org.apache.ctakes.typesystem.type.relation does not exist
[ERROR] <https://builds.apache.org/job/ctakes-trunk-compiletest/ws/ctakes-core/src/main/java/org/apache/ctakes/core/ae/SHARPKnowtatorXMLReader.java>:[65,49]
error: package org.apache.ctakes.typesystem.type.relation does not exist
[ERROR] <https://builds.apache.org/job/ctakes-trunk-compiletest/ws/ctakes-core/src/main/java/org/apache/ctakes/core/ae/SHARPKnowtatorXMLReader.java>:[66,49]
error: package org.apache.ctakes.typesystem.type.relation does not exist
[ERROR] <https://builds.apache.org/job/ctakes-trunk-compiletest/ws/ctakes-core/src/main/java/org/apache/ctakes/core/ae/SHARPKnowtatorXMLReader.java>:[67,49]
error: package org.apache.ctakes.typesystem.type.relation does not exist
[ERROR] <https://builds.apache.org/job/ctakes-trunk-compiletest/ws/ctakes-core/src/main/java/org/apache/ctakes/core/ae/SHARPKnowtatorXMLReader.java>:[68,49]
error: package org.apache.ctakes.typesystem.type.relation does not exist
[ERROR] <https://builds.apache.org/job/ctakes-trunk-compiletest/ws/ctakes-core/src/main/java/org/apache/ctakes/core/ae/SHARPKnowtatorXMLReader.java>:[69,51]
error: package org.apache.ctakes.typesystem.type.structured does not exist
[ERROR] <https://builds.apache.org/job/ctakes-trunk-compiletest/ws/ctakes-core/src/main/java/org/apache/ctakes/core/ae/SHARPKnowtatorXMLReader.java>:[70,48]
error: package org.apache.ctakes.typesystem.type.textsem does not exist
[ERROR] <https://builds.apache.org/job/ctakes-trunk-compiletest/ws/ctakes-core/src/main/java/org/apache/ctakes/core/ae/SHARPKnowtatorXMLReader.java>:[71,48]
error: package org.apache.ctakes.typesystem.type.textsem does not exist
[ERROR] <https://builds.apache.org/job/ctakes-trunk-compiletest/ws/ctakes-core/src/main/java/org/apache/ctakes/core/ae/SHARPKnowtatorXMLReader.java>:[72,48]
error: package org.apache.ctakes.typesystem.type.textsem does not exist
[ERROR] <https://builds.apache.org/job/ctakes-trunk-compiletest/ws/ctakes-core/src/main/java/org/apache/ctakes/core/ae/SHARPKnowtatorXMLReader.java>:[73,48]
error: package org.apache.ctakes.typesystem.type.textsem does not exist
[ERROR] <https://builds.apache.org/job/ctakes-trunk-compiletest/ws/ctakes-core/src/main/java/org/apache/ctakes/core/ae/SHARPKnowtatorXMLReader.java>:[74,48]
error: package org.apache.ctakes.typesystem.type.textsem does not exist
[ERROR] <https://builds.apache.org/job/ctakes-trunk-compiletest/ws/ctakes-core/src/main/java/org/apache/ctakes/core/ae/SHARPKnowtatorXMLReader.java>:[75,48]
error: package org.apache.ctakes.typesystem.type.textsem does not exist
[ERROR] <https://builds.apache.org/job/ctakes-trunk-compiletest/ws/ctakes-core/src/main/java/org/apache/ctakes/core/ae/SHARPKnowtatorXMLReader.java>:[76,48]
error: package org.apache.ctakes.typesystem.type.textsem does not exist
[ERROR] <https://builds.apache.org/job/ctakes-trunk-compiletest/ws/ctakes-core/src/main/java/org/apache/ctakes/core/ae/SHARPKnowtatorXMLReader.java>:[77,48]
error: package org.apache.ctakes.typesystem.type.textsem does not exist
[ERROR] <https://builds.apache.org/job/ctakes-trunk-compiletest/ws/ctakes-core/src/main/java/org/apache/ctakes/core/ae/SHARPKnowtatorXMLReader.java>:[78,48]
error: package org.apache.ctakes.typesystem.type.textsem does not exist
[ERROR] <https://builds.apache.org/job/ctakes-trunk-compiletest/ws/ctakes-core/src/main/java/org/apache/ctakes/core/ae/SHARPKnowtatorXMLReader.java>:[79,48]
error: package org.apache.ctakes.typesystem.type.textsem does not exist
[ERROR] <https://builds.apache.org/job/ctakes-trunk-compiletest/ws/ctakes-core/src/main/java/org/apache/ctakes/core/ae/SHARPKnowtatorXMLReader.java>:[80,48]
error: package org.apache.ctakes.typesystem.type.textsem does not exist
[ERROR] <https://builds.apache.org/job/ctakes-trunk-compiletest/ws/ctakes-core/src/main/java/org/apache/ctakes/core/ae/SHARPKnowtatorXMLReader.java>:[81,48]
error: package org.apache.ctakes.typesystem.type.textsem does not exist
[ERROR] <https://builds.apache.org/job/ctakes-trunk-compiletest/ws/ctakes-core/src/main/java/org/apache/ctakes/core/ae/SHARPKnowtatorXMLReader.java>:[82,48]
error: package org.apache.ctakes.typesystem.type.textsem does not exist
[ERROR] <https://builds.apache.org/job/ctakes-trunk-compiletest/ws/ctakes-core/src/main/java/org/apache/ctakes/core/ae/SHARPKnowtatorXMLReader.java>:[83,48]
error: package org.apache.ctakes.typesystem.type.textsem does not exist
[ERROR] <https://builds.apache.org/job/ctakes-trunk-compiletest/ws/ctakes-core/src/main/java/org/apache/ctakes/core/ae/SHARPKnowtatorXMLReader.java>:[84,48]
error: package org.apache.ctakes.typesystem.type.textsem does not exist
[ERROR] <https://builds.apache.org/job/ctakes-trunk-compiletest/ws/ctakes-core/src/main/java/org/apache/ctakes/core/ae/SHARPKnowtatorXMLReader.java>:[85,48]
error: package org.apache.ctakes.typesystem.type.textsem does not exist
[ERROR] <https://builds.apache.org/job/ctakes-trunk-compiletest/ws/ctakes-core/src/main/java/org/apache/ctakes/core/ae/SHARPKnowtatorXMLReader.java>:[86,48]
error: package org.apache.ctakes.typesystem.type.textsem does not exist
[ERROR] <https://builds.apache.org/job/ctakes-trunk-compiletest/ws/ctakes-core/src/main/java/org/apache/ctakes/core/ae/SHARPKnowtatorXMLReader.java>:[87,48]
error: package org.apache.ctakes.typesystem.type.textsem does not exist
[ERROR] <https://builds.apache.org/job/ctakes-trunk-compiletest/ws/ctakes-core/src/main/java/org/apache/ctakes/core/ae/SHARPKnowtatorXMLReader.java>:[88,48]
error: package org.apache.ctakes.typesystem.type.textsem does not exist
[ERROR] <https://builds.apache.org/job/ctakes-trunk-compiletest/ws/ctakes-core/src/main/java/org/apache/ctakes/core/ae/SHARPKnowtatorXMLReader.java>:[89,48]
error: package org.apache.ctakes.typesystem.type.textsem does not exist
[ERROR] <https://builds.apache.org/job/ctakes-trunk-compiletest/ws/ctakes-core/src/main/java/org/apache/ctakes/core/cr/TextReader.java>:[34,33]
[deprecation] CasInitializer in org.apache.uima.collection has been deprecated
[ERROR] <https://builds.apache.org/job/ctakes-trunk-compiletest/ws/ctakes-core/src/main/java/org/apache/ctakes/core/resource/LuceneIndexReaderResourceImpl.java>:[70,44]
[deprecation] open(Directory) in IndexReader has been deprecated
[ERROR] <https://builds.apache.org/job/ctakes-trunk-compiletest/ws/ctakes-core/src/main/java/org/apache/ctakes/core/resource/LuceneIndexReaderResourceImpl.java>:[75,44]
[deprecation] open(Directory) in IndexReader has been deprecated
[ERROR] <https://builds.apache.org/job/ctakes-trunk-compiletest/ws/ctakes-core/src/main/java/org/apache/ctakes/core/cr/FilesInDirectoryCollectionReader.java>:[224,7]
[deprecation] getCasInitializer() in CollectionReader_ImplBase has been deprecated
[ERROR] <https://builds.apache.org/job/ctakes-trunk-compiletest/ws/ctakes-core/src/main/java/org/apache/ctakes/core/cr/FilesInDirectoryCollectionReader.java>:[226,4]
[deprecation] getCasInitializer() in CollectionReader_ImplBase has been deprecated
[ERROR] <https://builds.apache.org/job/ctakes-trunk-compiletest/ws/ctakes-core/src/main/java/org/apache/ctakes/core/cr/XmiCollectionReaderCtakes.java>:[80,18]
[unchecked] unchecked call to add(E) as a member of the raw type ArrayList
[ERROR] where E is a type-variable:
[ERROR] E extends Object declared in class ArrayList
[ERROR] <https://builds.apache.org/job/ctakes-trunk-compiletest/ws/ctakes-core/src/main/java/org/apache/ctakes/core/util/ListIterable.java>:[34,50]
[unchecked] unchecked cast
[ERROR] required: T
[ERROR] found:    TOP
[ERROR] where T is a type-variable:
[ERROR] T extends Object declared in class FSListIterator
[ERROR] <https://builds.apache.org/job/ctakes-trunk-compiletest/ws/ctakes-core/src/main/java/org/apache/ctakes/core/cr/JdbcCollectionReader.java>:[179,25]
[unchecked] unchecked conversion
[ERROR] <https://builds.apache.org/job/ctakes-trunk-compiletest/ws/ctakes-core/src/main/java/org/apache/ctakes/core/cr/JdbcCollectionReader.java>:[276,20]
[deprecation] getCasInitializer() in CollectionReader_ImplBase has been deprecated
[ERROR] <https://builds.apache.org/job/ctakes-trunk-compiletest/ws/ctakes-core/src/main/java/org/apache/ctakes/core/cr/JdbcCollectionReader.java>:[279,20]
[deprecation] getCasInitializer() in CollectionReader_ImplBase has been deprecated
[ERROR] <https://builds.apache.org/job/ctakes-trunk-compiletest/ws/ctakes-core/src/main/java/org/apache/ctakes/core/resource/StringIntegerMapResourceImpl.java>:[101,15]
[unchecked] getMap() in StringIntegerMapResourceImpl implements getMap() in StringIntegerMapResource
[ERROR] return type requires unchecked conversion from Map to Map<String,Integer>
[ERROR] <https://builds.apache.org/job/ctakes-trunk-compiletest/ws/ctakes-core/src/main/java/org/apache/ctakes/core/cr/LinesFromFileCollectionReader.java>:[175,7]
[deprecation] getCasInitializer() in CollectionReader_ImplBase has been deprecated
[ERROR] <https://builds.apache.org/job/ctakes-trunk-compiletest/ws/ctakes-core/src/main/java/org/apache/ctakes/core/cr/LinesFromFileCollectionReader.java>:[178,4]
[deprecation] getCasInitializer() in CollectionReader_ImplBase has been deprecated
[ERROR] <https://builds.apache.org/job/ctakes-trunk-compiletest/ws/ctakes-core/src/main/java/org/apache/ctakes/core/ae/SentenceDetector.java>:[45,25]
[deprecation] HashSumEventStream in opennlp.tools.util has been deprecated
[ERROR] <https://builds.apache.org/job/ctakes-trunk-compiletest/ws/ctakes-core/src/main/java/org/apache/ctakes/core/ae/SentenceDetector.java>:[318,30]
[deprecation] train(String,ObjectStream<SentenceSample>,boolean,Dictionary,TrainingParameters)
in SentenceDetectorME has been deprecated
[ERROR] <https://builds.apache.org/job/ctakes-trunk-compiletest/ws/ctakes-core/src/main/java/org/apache/ctakes/core/sentence/SentenceDetectorCtakes.java>:[251,5]
[deprecation] HashSumEventStream in opennlp.tools.util has been deprecated
[ERROR] <https://builds.apache.org/job/ctakes-trunk-compiletest/ws/ctakes-core/src/main/java/org/apache/ctakes/core/sentence/SentenceDetectorCtakes.java>:[251,35]
[deprecation] HashSumEventStream in opennlp.tools.util has been deprecated
[ERROR] <https://builds.apache.org/job/ctakes-trunk-compiletest/ws/ctakes-core/src/main/java/org/apache/ctakes/core/cr/TextReader.java>:[86,4]
[deprecation] CasInitializer in org.apache.uima.collection has been deprecated
[ERROR] <https://builds.apache.org/job/ctakes-trunk-compiletest/ws/ctakes-core/src/main/java/org/apache/ctakes/core/cr/TextReader.java>:[86,36]
[deprecation] getCasInitializer() in CollectionReader_ImplBase has been deprecated
[ERROR] -> [Help 1]
[ERROR] 
[ERROR] To see the full stack trace of the errors, re-run Maven with the -e switch.
[ERROR] Re-run Maven using the -X switch to enable full debug logging.
[ERROR] 
[ERROR] For more information about the errors and possible solutions, please read the following
articles:
[ERROR] [Help 1] http://cwiki.apache.org/confluence/display/MAVEN/MojoFailureException
[ERROR] 
[ERROR] After correcting the problems, you can resume the build with the command
[ERROR]   mvn <goals> -rf :ctakes-core
Sending e-mails to: notifications@ctakes.apache.org
channel stopped

Mime
View raw message