ctakes-notifications mailing list archives

Site index · List index
Message view « Date » · « Thread »
Top « Date » · « Thread »
From Apache Jenkins Server <jenk...@builds.apache.org>
Subject Build failed in Jenkins: ctakes-trunk-compiletest » Apache cTAKES core #664
Date Wed, 29 Apr 2015 15:29:21 GMT
See <https://builds.apache.org/job/ctakes-trunk-compiletest/org.apache.ctakes$ctakes-core/664/changes>

Changes:

[chenpei] CTAKES-347 AggregateCdaProcessor fails with URI is not hierarchical
Not sure how widely CDA as input is used.  Simplified the config input- reusing uimaFIT style
config parameters and use plain strings for path+inputstream instead of FileResource.  These
config files are small and having them shared as a resource is more than it needs to be.

------------------------------------------
[INFO]                                                                         
[INFO] ------------------------------------------------------------------------
[INFO] Building Apache cTAKES core 3.2.2-SNAPSHOT
[INFO] ------------------------------------------------------------------------
[INFO] 
[INFO] --- maven-clean-plugin:2.4.1:clean (default-clean) @ ctakes-core ---
[INFO] Deleting <https://builds.apache.org/job/ctakes-trunk-compiletest/org.apache.ctakes$ctakes-core/ws/target>
[INFO] 
[INFO] --- maven-remote-resources-plugin:1.4:process (default) @ ctakes-core ---
[INFO] 
[INFO] --- maven-resources-plugin:2.5:resources (default-resources) @ ctakes-core ---
[debug] execute contextualize
[INFO] Using 'UTF-8' encoding to copy filtered resources.
[INFO] skip non existing resourceDirectory <https://builds.apache.org/job/ctakes-trunk-compiletest/org.apache.ctakes$ctakes-core/ws/src/main/resources>
[INFO] Copying 3 resources
[INFO] 
[INFO] --- maven-compiler-plugin:2.4:compile (default-compile) @ ctakes-core ---
[INFO] Compiling 148 source files to <https://builds.apache.org/job/ctakes-trunk-compiletest/org.apache.ctakes$ctakes-core/ws/target/classes>
[INFO] -------------------------------------------------------------
[ERROR] COMPILATION ERROR : 
[INFO] -------------------------------------------------------------
[ERROR] <https://builds.apache.org/job/ctakes-trunk-compiletest/org.apache.ctakes$ctakes-core/ws/src/main/java/org/apache/ctakes/core/ae/TokenizerAnnotatorPTB.java>:[28,47]
error: package org.apache.ctakes.typesystem.type.syntax does not exist
[ERROR] <https://builds.apache.org/job/ctakes-trunk-compiletest/org.apache.ctakes$ctakes-core/ws/src/main/java/org/apache/ctakes/core/ae/TokenizerAnnotatorPTB.java>:[29,47]
error: package org.apache.ctakes.typesystem.type.syntax does not exist
[ERROR] <https://builds.apache.org/job/ctakes-trunk-compiletest/org.apache.ctakes$ctakes-core/ws/src/main/java/org/apache/ctakes/core/ae/TokenizerAnnotatorPTB.java>:[30,49]
error: package org.apache.ctakes.typesystem.type.textspan does not exist
[ERROR] <https://builds.apache.org/job/ctakes-trunk-compiletest/org.apache.ctakes$ctakes-core/ws/src/main/java/org/apache/ctakes/core/ae/TokenizerAnnotatorPTB.java>:[31,49]
error: package org.apache.ctakes.typesystem.type.textspan does not exist
[ERROR] <https://builds.apache.org/job/ctakes-trunk-compiletest/org.apache.ctakes$ctakes-core/ws/src/main/java/org/apache/ctakes/core/nlp/tokenizer/TokenizerPTB.java>:[40,47]
error: package org.apache.ctakes.typesystem.type.syntax does not exist
[ERROR] <https://builds.apache.org/job/ctakes-trunk-compiletest/org.apache.ctakes$ctakes-core/ws/src/main/java/org/apache/ctakes/core/nlp/tokenizer/TokenizerPTB.java>:[41,47]
error: package org.apache.ctakes.typesystem.type.syntax does not exist
[ERROR] <https://builds.apache.org/job/ctakes-trunk-compiletest/org.apache.ctakes$ctakes-core/ws/src/main/java/org/apache/ctakes/core/nlp/tokenizer/TokenizerPTB.java>:[42,47]
error: package org.apache.ctakes.typesystem.type.syntax does not exist
[ERROR] <https://builds.apache.org/job/ctakes-trunk-compiletest/org.apache.ctakes$ctakes-core/ws/src/main/java/org/apache/ctakes/core/nlp/tokenizer/TokenizerPTB.java>:[43,47]
error: package org.apache.ctakes.typesystem.type.syntax does not exist
[ERROR] <https://builds.apache.org/job/ctakes-trunk-compiletest/org.apache.ctakes$ctakes-core/ws/src/main/java/org/apache/ctakes/core/nlp/tokenizer/TokenizerPTB.java>:[44,47]
error: package org.apache.ctakes.typesystem.type.syntax does not exist
[ERROR] <https://builds.apache.org/job/ctakes-trunk-compiletest/org.apache.ctakes$ctakes-core/ws/src/main/java/org/apache/ctakes/core/nlp/tokenizer/TokenizerPTB.java>:[45,47]
error: package org.apache.ctakes.typesystem.type.syntax does not exist
[ERROR] <https://builds.apache.org/job/ctakes-trunk-compiletest/org.apache.ctakes$ctakes-core/ws/src/main/java/org/apache/ctakes/core/nlp/tokenizer/TokenizerPTB.java>:[46,47]
error: package org.apache.ctakes.typesystem.type.syntax does not exist
[ERROR] <https://builds.apache.org/job/ctakes-trunk-compiletest/org.apache.ctakes$ctakes-core/ws/src/main/java/org/apache/ctakes/core/nlp/tokenizer/TokenizerPTB.java>:[67,24]
error: cannot find symbol
[ERROR]   symbol:   class BaseToken
  location: class TokenizerPTB
<https://builds.apache.org/job/ctakes-trunk-compiletest/org.apache.ctakes$ctakes-core/ws/src/main/java/org/apache/ctakes/core/nlp/tokenizer/TokenizerPTB.java>:[674,25]
error: cannot find symbol
[ERROR]   symbol:   class BaseToken
  location: class TokenizerPTB
<https://builds.apache.org/job/ctakes-trunk-compiletest/org.apache.ctakes$ctakes-core/ws/src/main/java/org/apache/ctakes/core/nlp/tokenizer/TokenizerPTB.java>:[933,25]
error: cannot find symbol
[ERROR]   symbol:   class BaseToken
  location: class TokenizerPTB
<https://builds.apache.org/job/ctakes-trunk-compiletest/org.apache.ctakes$ctakes-core/ws/src/main/java/org/apache/ctakes/core/nlp/tokenizer/TokenizerPTB.java>:[993,44]
error: cannot find symbol
[ERROR]   symbol:   class BaseToken
  location: class TokenizerPTB
<https://builds.apache.org/job/ctakes-trunk-compiletest/org.apache.ctakes$ctakes-core/ws/src/main/java/org/apache/ctakes/core/nlp/tokenizer/TokenizerPTB.java>:[1138,25]
error: cannot find symbol
[ERROR]   symbol:   class NumToken
  location: class TokenizerPTB
<https://builds.apache.org/job/ctakes-trunk-compiletest/org.apache.ctakes$ctakes-core/ws/src/main/java/org/apache/ctakes/core/nlp/tokenizer/TokenizerPTB.java>:[1146,29]
error: cannot find symbol
[ERROR]   symbol:   class WordToken
  location: class TokenizerPTB
<https://builds.apache.org/job/ctakes-trunk-compiletest/org.apache.ctakes$ctakes-core/ws/src/main/java/org/apache/ctakes/core/nlp/tokenizer/TokenizerPTB.java>:[1185,32]
error: cannot find symbol
[ERROR]   symbol:   class WordToken
  location: class TokenizerPTB
<https://builds.apache.org/job/ctakes-trunk-compiletest/org.apache.ctakes$ctakes-core/ws/src/main/java/org/apache/ctakes/core/util/DateParser.java>:[29,47]
error: package org.apache.ctakes.typesystem.type.refsem does not exist
[ERROR] <https://builds.apache.org/job/ctakes-trunk-compiletest/org.apache.ctakes$ctakes-core/ws/src/main/java/org/apache/ctakes/core/util/DateParser.java>:[78,15]
error: cannot find symbol
[ERROR]   symbol:   class Date
  location: class DateParser
<https://builds.apache.org/job/ctakes-trunk-compiletest/org.apache.ctakes$ctakes-core/ws/src/main/java/org/apache/ctakes/core/cr/FilesInDirectoryCollectionReader.java>:[63,51]
error: package org.apache.ctakes.typesystem.type.structured does not exist
[ERROR] <https://builds.apache.org/job/ctakes-trunk-compiletest/org.apache.ctakes$ctakes-core/ws/src/main/java/org/apache/ctakes/core/ae/SimpleSegmentWithTagsAnnotator.java>:[32,49]
error: package org.apache.ctakes.typesystem.type.textspan does not exist
[ERROR] <https://builds.apache.org/job/ctakes-trunk-compiletest/org.apache.ctakes$ctakes-core/ws/src/main/java/org/apache/ctakes/core/cc/TokenFreqCasConsumer.java>:[40,47]
error: package org.apache.ctakes.typesystem.type.syntax does not exist
[ERROR] <https://builds.apache.org/job/ctakes-trunk-compiletest/org.apache.ctakes$ctakes-core/ws/src/main/java/org/apache/ctakes/core/cc/TokenOffsetsCasConsumer.java>:[38,47]
error: package org.apache.ctakes.typesystem.type.syntax does not exist
[ERROR] <https://builds.apache.org/job/ctakes-trunk-compiletest/org.apache.ctakes$ctakes-core/ws/src/main/java/org/apache/ctakes/core/cc/NormalizedFilesInDirectoryCasConsumer.java>:[36,47]
error: package org.apache.ctakes.typesystem.type.syntax does not exist
[ERROR] <https://builds.apache.org/job/ctakes-trunk-compiletest/org.apache.ctakes$ctakes-core/ws/src/main/java/org/apache/ctakes/core/fsm/adapters/DecimalTokenAdapter.java>:[22,47]
error: package org.apache.ctakes.typesystem.type.syntax does not exist
[ERROR] <https://builds.apache.org/job/ctakes-trunk-compiletest/org.apache.ctakes$ctakes-core/ws/src/main/java/org/apache/ctakes/core/fsm/adapters/NumberTokenAdapter.java>:[22,47]
error: package org.apache.ctakes.typesystem.type.syntax does not exist
[ERROR] <https://builds.apache.org/job/ctakes-trunk-compiletest/org.apache.ctakes$ctakes-core/ws/src/main/java/org/apache/ctakes/core/fsm/adapters/DecimalTokenAdapter.java>:[36,28]
error: cannot find symbol
[ERROR]   symbol:   class NumToken
  location: class DecimalTokenAdapter
<https://builds.apache.org/job/ctakes-trunk-compiletest/org.apache.ctakes$ctakes-core/ws/src/main/java/org/apache/ctakes/core/fsm/adapters/NumberTokenAdapter.java>:[37,27]
error: cannot find symbol
[ERROR]   symbol:   class NumToken
  location: class NumberTokenAdapter
<https://builds.apache.org/job/ctakes-trunk-compiletest/org.apache.ctakes$ctakes-core/ws/src/main/java/org/apache/ctakes/core/ae/TokenizerAnnotator.java>:[42,47]
error: package org.apache.ctakes.typesystem.type.syntax does not exist
[ERROR] <https://builds.apache.org/job/ctakes-trunk-compiletest/org.apache.ctakes$ctakes-core/ws/src/main/java/org/apache/ctakes/core/ae/TokenizerAnnotator.java>:[43,49]
error: package org.apache.ctakes.typesystem.type.textspan does not exist
[ERROR] <https://builds.apache.org/job/ctakes-trunk-compiletest/org.apache.ctakes$ctakes-core/ws/src/main/java/org/apache/ctakes/core/util/SourceMetadataUtil.java>:[3,51]
error: package org.apache.ctakes.typesystem.type.structured does not exist
[ERROR] <https://builds.apache.org/job/ctakes-trunk-compiletest/org.apache.ctakes$ctakes-core/ws/src/main/java/org/apache/ctakes/core/util/SourceMetadataUtil.java>:[4,51]
error: package org.apache.ctakes.typesystem.type.structured does not exist
[ERROR] <https://builds.apache.org/job/ctakes-trunk-compiletest/org.apache.ctakes$ctakes-core/ws/src/main/java/org/apache/ctakes/core/util/SourceMetadataUtil.java>:[44,18]
error: cannot find symbol
[ERROR]   symbol:   class Metadata
  location: class SourceMetadataUtil
<https://builds.apache.org/job/ctakes-trunk-compiletest/org.apache.ctakes$ctakes-core/ws/src/main/java/org/apache/ctakes/core/util/SourceMetadataUtil.java>:[59,17]
error: cannot find symbol
[ERROR]   symbol:   class SourceData
  location: class SourceMetadataUtil
<https://builds.apache.org/job/ctakes-trunk-compiletest/org.apache.ctakes$ctakes-core/ws/src/main/java/org/apache/ctakes/core/util/SourceMetadataUtil.java>:[72,44]
error: cannot find symbol
[ERROR]   symbol:   class SourceData
  location: class SourceMetadataUtil
<https://builds.apache.org/job/ctakes-trunk-compiletest/org.apache.ctakes$ctakes-core/ws/src/main/java/org/apache/ctakes/core/util/SourceMetadataUtil.java>:[92,44]
error: cannot find symbol
[ERROR]   symbol:   class SourceData
  location: class SourceMetadataUtil
<https://builds.apache.org/job/ctakes-trunk-compiletest/org.apache.ctakes$ctakes-core/ws/src/main/java/org/apache/ctakes/core/util/SourceMetadataUtil.java>:[108,45]
error: cannot find symbol
[ERROR]   symbol:   class SourceData
  location: class SourceMetadataUtil
<https://builds.apache.org/job/ctakes-trunk-compiletest/org.apache.ctakes$ctakes-core/ws/src/main/java/org/apache/ctakes/core/util/SourceMetadataUtil.java>:[116,47]
error: cannot find symbol
[ERROR]   symbol:   class SourceData
  location: class SourceMetadataUtil
<https://builds.apache.org/job/ctakes-trunk-compiletest/org.apache.ctakes$ctakes-core/ws/src/main/java/org/apache/ctakes/core/fsm/adapters/CharacterTokenAdapter.java>:[22,47]
error: package org.apache.ctakes.typesystem.type.syntax does not exist
[ERROR] <https://builds.apache.org/job/ctakes-trunk-compiletest/org.apache.ctakes$ctakes-core/ws/src/main/java/org/apache/ctakes/core/fsm/adapters/PunctuationTokenAdapter.java>:[33,72]
error: package org.apache.ctakes.typesystem.type.syntax does not exist
[ERROR] <https://builds.apache.org/job/ctakes-trunk-compiletest/org.apache.ctakes$ctakes-core/ws/src/main/java/org/apache/ctakes/core/fsm/adapters/CharacterTokenAdapter.java>:[36,30]
error: cannot find symbol
[ERROR]   symbol:   class BaseToken
  location: class CharacterTokenAdapter
<https://builds.apache.org/job/ctakes-trunk-compiletest/org.apache.ctakes$ctakes-core/ws/src/main/java/org/apache/ctakes/core/cr/JdbcCollectionReader.java>:[49,51]
error: package org.apache.ctakes.typesystem.type.structured does not exist
[ERROR] <https://builds.apache.org/job/ctakes-trunk-compiletest/org.apache.ctakes$ctakes-core/ws/src/main/java/org/apache/ctakes/core/util/DocumentIDAnnotationUtil.java>:[26,51]
error: package org.apache.ctakes.typesystem.type.structured does not exist
[ERROR] <https://builds.apache.org/job/ctakes-trunk-compiletest/org.apache.ctakes$ctakes-core/ws/src/main/java/org/apache/ctakes/core/fsm/adapters/ContractionTokenAdapter.java>:[33,72]
error: package org.apache.ctakes.typesystem.type.syntax does not exist
[ERROR] <https://builds.apache.org/job/ctakes-trunk-compiletest/org.apache.ctakes$ctakes-core/ws/src/main/java/org/apache/ctakes/core/util/FSUtil.java>:[38,48]
error: package org.apache.ctakes.typesystem.type.textsem does not exist
[ERROR] <https://builds.apache.org/job/ctakes-trunk-compiletest/org.apache.ctakes$ctakes-core/ws/src/main/java/org/apache/ctakes/core/fsm/adapters/WordTokenAdapter.java>:[34,49]
error: package org.apache.ctakes.typesystem.type.syntax does not exist
[ERROR] <https://builds.apache.org/job/ctakes-trunk-compiletest/org.apache.ctakes$ctakes-core/ws/src/main/java/org/apache/ctakes/core/fsm/adapters/WordTokenAdapter.java>:[36,65]
error: package org.apache.ctakes.typesystem.type.syntax does not exist
[ERROR] <https://builds.apache.org/job/ctakes-trunk-compiletest/org.apache.ctakes$ctakes-core/ws/src/main/java/org/apache/ctakes/core/ae/SHARPKnowtatorXMLReader.java>:[38,47]
error: package org.apache.ctakes.typesystem.type.refsem does not exist
[ERROR] <https://builds.apache.org/job/ctakes-trunk-compiletest/org.apache.ctakes$ctakes-core/ws/src/main/java/org/apache/ctakes/core/ae/SHARPKnowtatorXMLReader.java>:[39,47]
error: package org.apache.ctakes.typesystem.type.refsem does not exist
[ERROR] <https://builds.apache.org/job/ctakes-trunk-compiletest/org.apache.ctakes$ctakes-core/ws/src/main/java/org/apache/ctakes/core/ae/SHARPKnowtatorXMLReader.java>:[40,47]
error: package org.apache.ctakes.typesystem.type.refsem does not exist
[ERROR] <https://builds.apache.org/job/ctakes-trunk-compiletest/org.apache.ctakes$ctakes-core/ws/src/main/java/org/apache/ctakes/core/ae/SHARPKnowtatorXMLReader.java>:[41,47]
error: package org.apache.ctakes.typesystem.type.refsem does not exist
[ERROR] <https://builds.apache.org/job/ctakes-trunk-compiletest/org.apache.ctakes$ctakes-core/ws/src/main/java/org/apache/ctakes/core/ae/SHARPKnowtatorXMLReader.java>:[42,47]
error: package org.apache.ctakes.typesystem.type.refsem does not exist
[ERROR] <https://builds.apache.org/job/ctakes-trunk-compiletest/org.apache.ctakes$ctakes-core/ws/src/main/java/org/apache/ctakes/core/ae/SHARPKnowtatorXMLReader.java>:[43,47]
error: package org.apache.ctakes.typesystem.type.refsem does not exist
[ERROR] <https://builds.apache.org/job/ctakes-trunk-compiletest/org.apache.ctakes$ctakes-core/ws/src/main/java/org/apache/ctakes/core/ae/SHARPKnowtatorXMLReader.java>:[44,47]
error: package org.apache.ctakes.typesystem.type.refsem does not exist
[ERROR] <https://builds.apache.org/job/ctakes-trunk-compiletest/org.apache.ctakes$ctakes-core/ws/src/main/java/org/apache/ctakes/core/ae/SHARPKnowtatorXMLReader.java>:[45,47]
error: package org.apache.ctakes.typesystem.type.refsem does not exist
[ERROR] <https://builds.apache.org/job/ctakes-trunk-compiletest/org.apache.ctakes$ctakes-core/ws/src/main/java/org/apache/ctakes/core/ae/SHARPKnowtatorXMLReader.java>:[46,47]
error: package org.apache.ctakes.typesystem.type.refsem does not exist
[ERROR] <https://builds.apache.org/job/ctakes-trunk-compiletest/org.apache.ctakes$ctakes-core/ws/src/main/java/org/apache/ctakes/core/ae/SHARPKnowtatorXMLReader.java>:[47,47]
error: package org.apache.ctakes.typesystem.type.refsem does not exist
[ERROR] <https://builds.apache.org/job/ctakes-trunk-compiletest/org.apache.ctakes$ctakes-core/ws/src/main/java/org/apache/ctakes/core/ae/SHARPKnowtatorXMLReader.java>:[48,47]
error: package org.apache.ctakes.typesystem.type.refsem does not exist
[ERROR] <https://builds.apache.org/job/ctakes-trunk-compiletest/org.apache.ctakes$ctakes-core/ws/src/main/java/org/apache/ctakes/core/ae/SHARPKnowtatorXMLReader.java>:[49,47]
error: package org.apache.ctakes.typesystem.type.refsem does not exist
[ERROR] <https://builds.apache.org/job/ctakes-trunk-compiletest/org.apache.ctakes$ctakes-core/ws/src/main/java/org/apache/ctakes/core/ae/SHARPKnowtatorXMLReader.java>:[50,47]
error: package org.apache.ctakes.typesystem.type.refsem does not exist
[ERROR] <https://builds.apache.org/job/ctakes-trunk-compiletest/org.apache.ctakes$ctakes-core/ws/src/main/java/org/apache/ctakes/core/ae/SHARPKnowtatorXMLReader.java>:[51,47]
error: package org.apache.ctakes.typesystem.type.refsem does not exist
[ERROR] <https://builds.apache.org/job/ctakes-trunk-compiletest/org.apache.ctakes$ctakes-core/ws/src/main/java/org/apache/ctakes/core/ae/SHARPKnowtatorXMLReader.java>:[52,47]
error: package org.apache.ctakes.typesystem.type.refsem does not exist
[ERROR] <https://builds.apache.org/job/ctakes-trunk-compiletest/org.apache.ctakes$ctakes-core/ws/src/main/java/org/apache/ctakes/core/ae/SHARPKnowtatorXMLReader.java>:[53,47]
error: package org.apache.ctakes.typesystem.type.refsem does not exist
[ERROR] <https://builds.apache.org/job/ctakes-trunk-compiletest/org.apache.ctakes$ctakes-core/ws/src/main/java/org/apache/ctakes/core/ae/SHARPKnowtatorXMLReader.java>:[54,47]
error: package org.apache.ctakes.typesystem.type.refsem does not exist
[ERROR] <https://builds.apache.org/job/ctakes-trunk-compiletest/org.apache.ctakes$ctakes-core/ws/src/main/java/org/apache/ctakes/core/ae/SHARPKnowtatorXMLReader.java>:[55,47]
error: package org.apache.ctakes.typesystem.type.refsem does not exist
[ERROR] <https://builds.apache.org/job/ctakes-trunk-compiletest/org.apache.ctakes$ctakes-core/ws/src/main/java/org/apache/ctakes/core/ae/SHARPKnowtatorXMLReader.java>:[56,47]
error: package org.apache.ctakes.typesystem.type.refsem does not exist
[ERROR] <https://builds.apache.org/job/ctakes-trunk-compiletest/org.apache.ctakes$ctakes-core/ws/src/main/java/org/apache/ctakes/core/ae/SHARPKnowtatorXMLReader.java>:[57,47]
error: package org.apache.ctakes.typesystem.type.refsem does not exist
[ERROR] <https://builds.apache.org/job/ctakes-trunk-compiletest/org.apache.ctakes$ctakes-core/ws/src/main/java/org/apache/ctakes/core/ae/SHARPKnowtatorXMLReader.java>:[58,49]
error: package org.apache.ctakes.typesystem.type.relation does not exist
[ERROR] <https://builds.apache.org/job/ctakes-trunk-compiletest/org.apache.ctakes$ctakes-core/ws/src/main/java/org/apache/ctakes/core/ae/SHARPKnowtatorXMLReader.java>:[59,49]
error: package org.apache.ctakes.typesystem.type.relation does not exist
[ERROR] <https://builds.apache.org/job/ctakes-trunk-compiletest/org.apache.ctakes$ctakes-core/ws/src/main/java/org/apache/ctakes/core/ae/SHARPKnowtatorXMLReader.java>:[60,49]
error: package org.apache.ctakes.typesystem.type.relation does not exist
[ERROR] <https://builds.apache.org/job/ctakes-trunk-compiletest/org.apache.ctakes$ctakes-core/ws/src/main/java/org/apache/ctakes/core/ae/SHARPKnowtatorXMLReader.java>:[61,49]
error: package org.apache.ctakes.typesystem.type.relation does not exist
[ERROR] <https://builds.apache.org/job/ctakes-trunk-compiletest/org.apache.ctakes$ctakes-core/ws/src/main/java/org/apache/ctakes/core/ae/SHARPKnowtatorXMLReader.java>:[62,49]
error: package org.apache.ctakes.typesystem.type.relation does not exist
[ERROR] <https://builds.apache.org/job/ctakes-trunk-compiletest/org.apache.ctakes$ctakes-core/ws/src/main/java/org/apache/ctakes/core/ae/SHARPKnowtatorXMLReader.java>:[63,49]
error: package org.apache.ctakes.typesystem.type.relation does not exist
[ERROR] <https://builds.apache.org/job/ctakes-trunk-compiletest/org.apache.ctakes$ctakes-core/ws/src/main/java/org/apache/ctakes/core/ae/SHARPKnowtatorXMLReader.java>:[64,49]
error: package org.apache.ctakes.typesystem.type.relation does not exist
[ERROR] <https://builds.apache.org/job/ctakes-trunk-compiletest/org.apache.ctakes$ctakes-core/ws/src/main/java/org/apache/ctakes/core/ae/SHARPKnowtatorXMLReader.java>:[65,49]
error: package org.apache.ctakes.typesystem.type.relation does not exist
[ERROR] <https://builds.apache.org/job/ctakes-trunk-compiletest/org.apache.ctakes$ctakes-core/ws/src/main/java/org/apache/ctakes/core/ae/SHARPKnowtatorXMLReader.java>:[66,49]
error: package org.apache.ctakes.typesystem.type.relation does not exist
[ERROR] <https://builds.apache.org/job/ctakes-trunk-compiletest/org.apache.ctakes$ctakes-core/ws/src/main/java/org/apache/ctakes/core/ae/SHARPKnowtatorXMLReader.java>:[67,49]
error: package org.apache.ctakes.typesystem.type.relation does not exist
[ERROR] <https://builds.apache.org/job/ctakes-trunk-compiletest/org.apache.ctakes$ctakes-core/ws/src/main/java/org/apache/ctakes/core/ae/SHARPKnowtatorXMLReader.java>:[68,49]
error: package org.apache.ctakes.typesystem.type.relation does not exist
[ERROR] <https://builds.apache.org/job/ctakes-trunk-compiletest/org.apache.ctakes$ctakes-core/ws/src/main/java/org/apache/ctakes/core/ae/SHARPKnowtatorXMLReader.java>:[69,51]
error: package org.apache.ctakes.typesystem.type.structured does not exist
[ERROR] <https://builds.apache.org/job/ctakes-trunk-compiletest/org.apache.ctakes$ctakes-core/ws/src/main/java/org/apache/ctakes/core/ae/SHARPKnowtatorXMLReader.java>:[70,48]
error: package org.apache.ctakes.typesystem.type.textsem does not exist
[ERROR] <https://builds.apache.org/job/ctakes-trunk-compiletest/org.apache.ctakes$ctakes-core/ws/src/main/java/org/apache/ctakes/core/ae/SHARPKnowtatorXMLReader.java>:[71,48]
error: package org.apache.ctakes.typesystem.type.textsem does not exist
[ERROR] <https://builds.apache.org/job/ctakes-trunk-compiletest/org.apache.ctakes$ctakes-core/ws/src/main/java/org/apache/ctakes/core/ae/SHARPKnowtatorXMLReader.java>:[72,48]
error: package org.apache.ctakes.typesystem.type.textsem does not exist
[ERROR] <https://builds.apache.org/job/ctakes-trunk-compiletest/org.apache.ctakes$ctakes-core/ws/src/main/java/org/apache/ctakes/core/ae/SHARPKnowtatorXMLReader.java>:[73,48]
error: package org.apache.ctakes.typesystem.type.textsem does not exist
[ERROR] <https://builds.apache.org/job/ctakes-trunk-compiletest/org.apache.ctakes$ctakes-core/ws/src/main/java/org/apache/ctakes/core/ae/SHARPKnowtatorXMLReader.java>:[74,48]
error: package org.apache.ctakes.typesystem.type.textsem does not exist
[ERROR] <https://builds.apache.org/job/ctakes-trunk-compiletest/org.apache.ctakes$ctakes-core/ws/src/main/java/org/apache/ctakes/core/ae/SHARPKnowtatorXMLReader.java>:[75,48]
error: package org.apache.ctakes.typesystem.type.textsem does not exist
[ERROR] <https://builds.apache.org/job/ctakes-trunk-compiletest/org.apache.ctakes$ctakes-core/ws/src/main/java/org/apache/ctakes/core/ae/SHARPKnowtatorXMLReader.java>:[76,48]
error: package org.apache.ctakes.typesystem.type.textsem does not exist
[ERROR] <https://builds.apache.org/job/ctakes-trunk-compiletest/org.apache.ctakes$ctakes-core/ws/src/main/java/org/apache/ctakes/core/ae/SHARPKnowtatorXMLReader.java>:[77,48]
error: package org.apache.ctakes.typesystem.type.textsem does not exist
[ERROR] <https://builds.apache.org/job/ctakes-trunk-compiletest/org.apache.ctakes$ctakes-core/ws/src/main/java/org/apache/ctakes/core/ae/SHARPKnowtatorXMLReader.java>:[78,48]
error: package org.apache.ctakes.typesystem.type.textsem does not exist
[ERROR] <https://builds.apache.org/job/ctakes-trunk-compiletest/org.apache.ctakes$ctakes-core/ws/src/main/java/org/apache/ctakes/core/ae/SHARPKnowtatorXMLReader.java>:[79,48]
error: package org.apache.ctakes.typesystem.type.textsem does not exist
[ERROR] <https://builds.apache.org/job/ctakes-trunk-compiletest/org.apache.ctakes$ctakes-core/ws/src/main/java/org/apache/ctakes/core/ae/SHARPKnowtatorXMLReader.java>:[80,48]
error: package org.apache.ctakes.typesystem.type.textsem does not exist
[ERROR] <https://builds.apache.org/job/ctakes-trunk-compiletest/org.apache.ctakes$ctakes-core/ws/src/main/java/org/apache/ctakes/core/ae/SHARPKnowtatorXMLReader.java>:[81,48]
error: package org.apache.ctakes.typesystem.type.textsem does not exist
[ERROR] <https://builds.apache.org/job/ctakes-trunk-compiletest/org.apache.ctakes$ctakes-core/ws/src/main/java/org/apache/ctakes/core/ae/SHARPKnowtatorXMLReader.java>:[82,48]
error: package org.apache.ctakes.typesystem.type.textsem does not exist
[ERROR] <https://builds.apache.org/job/ctakes-trunk-compiletest/org.apache.ctakes$ctakes-core/ws/src/main/java/org/apache/ctakes/core/ae/SHARPKnowtatorXMLReader.java>:[83,48]
error: package org.apache.ctakes.typesystem.type.textsem does not exist
[ERROR] <https://builds.apache.org/job/ctakes-trunk-compiletest/org.apache.ctakes$ctakes-core/ws/src/main/java/org/apache/ctakes/core/ae/SHARPKnowtatorXMLReader.java>:[84,48]
error: package org.apache.ctakes.typesystem.type.textsem does not exist
[ERROR] <https://builds.apache.org/job/ctakes-trunk-compiletest/org.apache.ctakes$ctakes-core/ws/src/main/java/org/apache/ctakes/core/ae/SHARPKnowtatorXMLReader.java>:[85,48]
error: package org.apache.ctakes.typesystem.type.textsem does not exist
[ERROR] <https://builds.apache.org/job/ctakes-trunk-compiletest/org.apache.ctakes$ctakes-core/ws/src/main/java/org/apache/ctakes/core/ae/SHARPKnowtatorXMLReader.java>:[86,48]
error: package org.apache.ctakes.typesystem.type.textsem does not exist
[ERROR] <https://builds.apache.org/job/ctakes-trunk-compiletest/org.apache.ctakes$ctakes-core/ws/src/main/java/org/apache/ctakes/core/ae/SHARPKnowtatorXMLReader.java>:[87,48]
error: package org.apache.ctakes.typesystem.type.textsem does not exist
[ERROR] <https://builds.apache.org/job/ctakes-trunk-compiletest/org.apache.ctakes$ctakes-core/ws/src/main/java/org/apache/ctakes/core/ae/SHARPKnowtatorXMLReader.java>:[88,48]
error: package org.apache.ctakes.typesystem.type.textsem does not exist
[ERROR] <https://builds.apache.org/job/ctakes-trunk-compiletest/org.apache.ctakes$ctakes-core/ws/src/main/java/org/apache/ctakes/core/ae/SHARPKnowtatorXMLReader.java>:[89,48]
error: package org.apache.ctakes.typesystem.type.textsem does not exist
[ERROR] <https://builds.apache.org/job/ctakes-trunk-compiletest/org.apache.ctakes$ctakes-core/ws/src/main/java/org/apache/ctakes/core/cr/TextReader.java>:[34,33]
[deprecation] CasInitializer in org.apache.uima.collection has been deprecated
[ERROR] <https://builds.apache.org/job/ctakes-trunk-compiletest/org.apache.ctakes$ctakes-core/ws/src/main/java/org/apache/ctakes/core/resource/LuceneIndexReaderResourceImpl.java>:[70,44]
[deprecation] open(Directory) in IndexReader has been deprecated
[ERROR] <https://builds.apache.org/job/ctakes-trunk-compiletest/org.apache.ctakes$ctakes-core/ws/src/main/java/org/apache/ctakes/core/resource/LuceneIndexReaderResourceImpl.java>:[75,44]
[deprecation] open(Directory) in IndexReader has been deprecated
[ERROR] <https://builds.apache.org/job/ctakes-trunk-compiletest/org.apache.ctakes$ctakes-core/ws/src/main/java/org/apache/ctakes/core/cr/FilesInDirectoryCollectionReader.java>:[224,7]
[deprecation] getCasInitializer() in CollectionReader_ImplBase has been deprecated
[ERROR] <https://builds.apache.org/job/ctakes-trunk-compiletest/org.apache.ctakes$ctakes-core/ws/src/main/java/org/apache/ctakes/core/cr/FilesInDirectoryCollectionReader.java>:[226,4]
[deprecation] getCasInitializer() in CollectionReader_ImplBase has been deprecated
[ERROR] <https://builds.apache.org/job/ctakes-trunk-compiletest/org.apache.ctakes$ctakes-core/ws/src/main/java/org/apache/ctakes/core/cr/XmiCollectionReaderCtakes.java>:[80,18]
[unchecked] unchecked call to add(E) as a member of the raw type ArrayList
[ERROR]   where E is a type-variable:
    E extends Object declared in class ArrayList
<https://builds.apache.org/job/ctakes-trunk-compiletest/org.apache.ctakes$ctakes-core/ws/src/main/java/org/apache/ctakes/core/util/ListIterable.java>:[34,50]
[unchecked] unchecked cast
[ERROR]   required: T
  found:    TOP
  where T is a type-variable:
    T extends Object declared in class FSListIterator
<https://builds.apache.org/job/ctakes-trunk-compiletest/org.apache.ctakes$ctakes-core/ws/src/main/java/org/apache/ctakes/core/cr/JdbcCollectionReader.java>:[179,25]
[unchecked] unchecked conversion
[ERROR] <https://builds.apache.org/job/ctakes-trunk-compiletest/org.apache.ctakes$ctakes-core/ws/src/main/java/org/apache/ctakes/core/cr/JdbcCollectionReader.java>:[276,20]
[deprecation] getCasInitializer() in CollectionReader_ImplBase has been deprecated
[ERROR] <https://builds.apache.org/job/ctakes-trunk-compiletest/org.apache.ctakes$ctakes-core/ws/src/main/java/org/apache/ctakes/core/cr/JdbcCollectionReader.java>:[279,20]
[deprecation] getCasInitializer() in CollectionReader_ImplBase has been deprecated
[ERROR] <https://builds.apache.org/job/ctakes-trunk-compiletest/org.apache.ctakes$ctakes-core/ws/src/main/java/org/apache/ctakes/core/resource/StringIntegerMapResourceImpl.java>:[101,15]
[unchecked] getMap() in StringIntegerMapResourceImpl implements getMap() in StringIntegerMapResource
[ERROR]   return type requires unchecked conversion from Map to Map<String,Integer>
<https://builds.apache.org/job/ctakes-trunk-compiletest/org.apache.ctakes$ctakes-core/ws/src/main/java/org/apache/ctakes/core/cr/LinesFromFileCollectionReader.java>:[175,7]
[deprecation] getCasInitializer() in CollectionReader_ImplBase has been deprecated
[ERROR] <https://builds.apache.org/job/ctakes-trunk-compiletest/org.apache.ctakes$ctakes-core/ws/src/main/java/org/apache/ctakes/core/cr/LinesFromFileCollectionReader.java>:[178,4]
[deprecation] getCasInitializer() in CollectionReader_ImplBase has been deprecated
[ERROR] <https://builds.apache.org/job/ctakes-trunk-compiletest/org.apache.ctakes$ctakes-core/ws/src/main/java/org/apache/ctakes/core/ae/SentenceDetector.java>:[45,25]
[deprecation] HashSumEventStream in opennlp.tools.util has been deprecated
[ERROR] <https://builds.apache.org/job/ctakes-trunk-compiletest/org.apache.ctakes$ctakes-core/ws/src/main/java/org/apache/ctakes/core/ae/SentenceDetector.java>:[318,30]
[deprecation] train(String,ObjectStream<SentenceSample>,boolean,Dictionary,TrainingParameters)
in SentenceDetectorME has been deprecated
[ERROR] <https://builds.apache.org/job/ctakes-trunk-compiletest/org.apache.ctakes$ctakes-core/ws/src/main/java/org/apache/ctakes/core/sentence/SentenceDetectorCtakes.java>:[251,5]
[deprecation] HashSumEventStream in opennlp.tools.util has been deprecated
[ERROR] <https://builds.apache.org/job/ctakes-trunk-compiletest/org.apache.ctakes$ctakes-core/ws/src/main/java/org/apache/ctakes/core/sentence/SentenceDetectorCtakes.java>:[251,35]
[deprecation] HashSumEventStream in opennlp.tools.util has been deprecated
[ERROR] <https://builds.apache.org/job/ctakes-trunk-compiletest/org.apache.ctakes$ctakes-core/ws/src/main/java/org/apache/ctakes/core/cr/TextReader.java>:[86,4]
[deprecation] CasInitializer in org.apache.uima.collection has been deprecated
[ERROR] <https://builds.apache.org/job/ctakes-trunk-compiletest/org.apache.ctakes$ctakes-core/ws/src/main/java/org/apache/ctakes/core/cr/TextReader.java>:[86,36]
[deprecation] getCasInitializer() in CollectionReader_ImplBase has been deprecated
[INFO] 119 errors 
[INFO] -------------------------------------------------------------
[JENKINS] Archiving disabled

Mime
View raw message