ctakes-notifications mailing list archives

Site index · List index
Message view « Date » · « Thread »
Top « Date » · « Thread »
From Apache Jenkins Server <jenk...@builds.apache.org>
Subject Build failed in Jenkins: ctakes-trunk-package » Apache cTAKES core #329
Date Wed, 29 Apr 2015 12:06:03 GMT
See <https://builds.apache.org/job/ctakes-trunk-package/org.apache.ctakes$ctakes-core/329/>

------------------------------------------
[INFO]                                                                         
[INFO] ------------------------------------------------------------------------
[INFO] Building Apache cTAKES core 3.2.2-SNAPSHOT
[INFO] ------------------------------------------------------------------------
[INFO] 
[INFO] --- maven-clean-plugin:2.4.1:clean (default-clean) @ ctakes-core ---
[INFO] 
[INFO] --- maven-remote-resources-plugin:1.4:process (default) @ ctakes-core ---
[INFO] 
[INFO] --- maven-resources-plugin:2.5:resources (default-resources) @ ctakes-core ---
[debug] execute contextualize
[INFO] Using 'UTF-8' encoding to copy filtered resources.
[INFO] skip non existing resourceDirectory <https://builds.apache.org/job/ctakes-trunk-package/org.apache.ctakes$ctakes-core/ws/src/main/resources>
[INFO] Copying 3 resources
[INFO] 
[INFO] --- maven-compiler-plugin:2.4:compile (default-compile) @ ctakes-core ---
[INFO] Compiling 148 source files to <https://builds.apache.org/job/ctakes-trunk-package/org.apache.ctakes$ctakes-core/ws/target/classes>
[INFO] -------------------------------------------------------------
[ERROR] COMPILATION ERROR : 
[INFO] -------------------------------------------------------------
[ERROR] <https://builds.apache.org/job/ctakes-trunk-package/org.apache.ctakes$ctakes-core/ws/src/main/java/org/apache/ctakes/core/fsm/adapters/ContractionTokenAdapter.java>:[33,72]
error: package org.apache.ctakes.typesystem.type.syntax does not exist
[ERROR] <https://builds.apache.org/job/ctakes-trunk-package/org.apache.ctakes$ctakes-core/ws/src/main/java/org/apache/ctakes/core/fsm/adapters/NewlineTokenAdapter.java>:[22,47]
error: package org.apache.ctakes.typesystem.type.syntax does not exist
[ERROR] <https://builds.apache.org/job/ctakes-trunk-package/org.apache.ctakes$ctakes-core/ws/src/main/java/org/apache/ctakes/core/fsm/adapters/CharacterTokenAdapter.java>:[22,47]
error: package org.apache.ctakes.typesystem.type.syntax does not exist
[ERROR] <https://builds.apache.org/job/ctakes-trunk-package/org.apache.ctakes$ctakes-core/ws/src/main/java/org/apache/ctakes/core/fsm/adapters/NewlineTokenAdapter.java>:[34,28]
error: cannot find symbol
[ERROR]   symbol:   class NewlineToken
  location: class NewlineTokenAdapter
<https://builds.apache.org/job/ctakes-trunk-package/org.apache.ctakes$ctakes-core/ws/src/main/java/org/apache/ctakes/core/fsm/adapters/CharacterTokenAdapter.java>:[36,30]
error: cannot find symbol
[ERROR]   symbol:   class BaseToken
  location: class CharacterTokenAdapter
<https://builds.apache.org/job/ctakes-trunk-package/org.apache.ctakes$ctakes-core/ws/src/main/java/org/apache/ctakes/core/ae/TokenConverter.java>:[24,47]
error: package org.apache.ctakes.typesystem.type.syntax does not exist
[ERROR] <https://builds.apache.org/job/ctakes-trunk-package/org.apache.ctakes$ctakes-core/ws/src/main/java/org/apache/ctakes/core/ae/TokenConverter.java>:[25,47]
error: package org.apache.ctakes.typesystem.type.syntax does not exist
[ERROR] <https://builds.apache.org/job/ctakes-trunk-package/org.apache.ctakes$ctakes-core/ws/src/main/java/org/apache/ctakes/core/ae/TokenConverter.java>:[26,47]
error: package org.apache.ctakes.typesystem.type.syntax does not exist
[ERROR] <https://builds.apache.org/job/ctakes-trunk-package/org.apache.ctakes$ctakes-core/ws/src/main/java/org/apache/ctakes/core/ae/TokenConverter.java>:[27,47]
error: package org.apache.ctakes.typesystem.type.syntax does not exist
[ERROR] <https://builds.apache.org/job/ctakes-trunk-package/org.apache.ctakes$ctakes-core/ws/src/main/java/org/apache/ctakes/core/ae/TokenConverter.java>:[28,47]
error: package org.apache.ctakes.typesystem.type.syntax does not exist
[ERROR] <https://builds.apache.org/job/ctakes-trunk-package/org.apache.ctakes$ctakes-core/ws/src/main/java/org/apache/ctakes/core/ae/TokenConverter.java>:[29,47]
error: package org.apache.ctakes.typesystem.type.syntax does not exist
[ERROR] <https://builds.apache.org/job/ctakes-trunk-package/org.apache.ctakes$ctakes-core/ws/src/main/java/org/apache/ctakes/core/ae/TokenConverter.java>:[30,47]
error: package org.apache.ctakes.typesystem.type.syntax does not exist
[ERROR] <https://builds.apache.org/job/ctakes-trunk-package/org.apache.ctakes$ctakes-core/ws/src/main/java/org/apache/ctakes/core/ae/TokenConverter.java>:[43,18]
error: cannot find symbol
[ERROR]   symbol:   class BaseToken
  location: class TokenConverter
<https://builds.apache.org/job/ctakes-trunk-package/org.apache.ctakes$ctakes-core/ws/src/main/java/org/apache/ctakes/core/ae/TokenConverter.java>:[141,32]
error: cannot find symbol
[ERROR]   symbol:   class BaseToken
  location: class TokenConverter
<https://builds.apache.org/job/ctakes-trunk-package/org.apache.ctakes$ctakes-core/ws/src/main/java/org/apache/ctakes/core/cr/JdbcCollectionReader.java>:[49,51]
error: package org.apache.ctakes.typesystem.type.structured does not exist
[ERROR] <https://builds.apache.org/job/ctakes-trunk-package/org.apache.ctakes$ctakes-core/ws/src/main/java/org/apache/ctakes/core/ae/FilterAnnotator.java>:[36,48]
error: package org.apache.ctakes.typesystem.type.textsem does not exist
[ERROR] <https://builds.apache.org/job/ctakes-trunk-package/org.apache.ctakes$ctakes-core/ws/src/main/java/org/apache/ctakes/core/ae/FilterAnnotator.java>:[37,48]
error: package org.apache.ctakes.typesystem.type.textsem does not exist
[ERROR] <https://builds.apache.org/job/ctakes-trunk-package/org.apache.ctakes$ctakes-core/ws/src/main/java/org/apache/ctakes/core/cc/NormalizedFilesInDirectoryCasConsumer.java>:[36,47]
error: package org.apache.ctakes.typesystem.type.syntax does not exist
[ERROR] <https://builds.apache.org/job/ctakes-trunk-package/org.apache.ctakes$ctakes-core/ws/src/main/java/org/apache/ctakes/core/ae/SHARPKnowtatorXMLReader.java>:[38,47]
error: package org.apache.ctakes.typesystem.type.refsem does not exist
[ERROR] <https://builds.apache.org/job/ctakes-trunk-package/org.apache.ctakes$ctakes-core/ws/src/main/java/org/apache/ctakes/core/ae/SHARPKnowtatorXMLReader.java>:[39,47]
error: package org.apache.ctakes.typesystem.type.refsem does not exist
[ERROR] <https://builds.apache.org/job/ctakes-trunk-package/org.apache.ctakes$ctakes-core/ws/src/main/java/org/apache/ctakes/core/ae/SHARPKnowtatorXMLReader.java>:[40,47]
error: package org.apache.ctakes.typesystem.type.refsem does not exist
[ERROR] <https://builds.apache.org/job/ctakes-trunk-package/org.apache.ctakes$ctakes-core/ws/src/main/java/org/apache/ctakes/core/ae/SHARPKnowtatorXMLReader.java>:[41,47]
error: package org.apache.ctakes.typesystem.type.refsem does not exist
[ERROR] <https://builds.apache.org/job/ctakes-trunk-package/org.apache.ctakes$ctakes-core/ws/src/main/java/org/apache/ctakes/core/ae/SHARPKnowtatorXMLReader.java>:[42,47]
error: package org.apache.ctakes.typesystem.type.refsem does not exist
[ERROR] <https://builds.apache.org/job/ctakes-trunk-package/org.apache.ctakes$ctakes-core/ws/src/main/java/org/apache/ctakes/core/ae/SHARPKnowtatorXMLReader.java>:[43,47]
error: package org.apache.ctakes.typesystem.type.refsem does not exist
[ERROR] <https://builds.apache.org/job/ctakes-trunk-package/org.apache.ctakes$ctakes-core/ws/src/main/java/org/apache/ctakes/core/ae/SHARPKnowtatorXMLReader.java>:[44,47]
error: package org.apache.ctakes.typesystem.type.refsem does not exist
[ERROR] <https://builds.apache.org/job/ctakes-trunk-package/org.apache.ctakes$ctakes-core/ws/src/main/java/org/apache/ctakes/core/ae/SHARPKnowtatorXMLReader.java>:[45,47]
error: package org.apache.ctakes.typesystem.type.refsem does not exist
[ERROR] <https://builds.apache.org/job/ctakes-trunk-package/org.apache.ctakes$ctakes-core/ws/src/main/java/org/apache/ctakes/core/ae/SHARPKnowtatorXMLReader.java>:[46,47]
error: package org.apache.ctakes.typesystem.type.refsem does not exist
[ERROR] <https://builds.apache.org/job/ctakes-trunk-package/org.apache.ctakes$ctakes-core/ws/src/main/java/org/apache/ctakes/core/ae/SHARPKnowtatorXMLReader.java>:[47,47]
error: package org.apache.ctakes.typesystem.type.refsem does not exist
[ERROR] <https://builds.apache.org/job/ctakes-trunk-package/org.apache.ctakes$ctakes-core/ws/src/main/java/org/apache/ctakes/core/ae/SHARPKnowtatorXMLReader.java>:[48,47]
error: package org.apache.ctakes.typesystem.type.refsem does not exist
[ERROR] <https://builds.apache.org/job/ctakes-trunk-package/org.apache.ctakes$ctakes-core/ws/src/main/java/org/apache/ctakes/core/ae/SHARPKnowtatorXMLReader.java>:[49,47]
error: package org.apache.ctakes.typesystem.type.refsem does not exist
[ERROR] <https://builds.apache.org/job/ctakes-trunk-package/org.apache.ctakes$ctakes-core/ws/src/main/java/org/apache/ctakes/core/ae/SHARPKnowtatorXMLReader.java>:[50,47]
error: package org.apache.ctakes.typesystem.type.refsem does not exist
[ERROR] <https://builds.apache.org/job/ctakes-trunk-package/org.apache.ctakes$ctakes-core/ws/src/main/java/org/apache/ctakes/core/ae/SHARPKnowtatorXMLReader.java>:[51,47]
error: package org.apache.ctakes.typesystem.type.refsem does not exist
[ERROR] <https://builds.apache.org/job/ctakes-trunk-package/org.apache.ctakes$ctakes-core/ws/src/main/java/org/apache/ctakes/core/ae/SHARPKnowtatorXMLReader.java>:[52,47]
error: package org.apache.ctakes.typesystem.type.refsem does not exist
[ERROR] <https://builds.apache.org/job/ctakes-trunk-package/org.apache.ctakes$ctakes-core/ws/src/main/java/org/apache/ctakes/core/ae/SHARPKnowtatorXMLReader.java>:[53,47]
error: package org.apache.ctakes.typesystem.type.refsem does not exist
[ERROR] <https://builds.apache.org/job/ctakes-trunk-package/org.apache.ctakes$ctakes-core/ws/src/main/java/org/apache/ctakes/core/ae/SHARPKnowtatorXMLReader.java>:[54,47]
error: package org.apache.ctakes.typesystem.type.refsem does not exist
[ERROR] <https://builds.apache.org/job/ctakes-trunk-package/org.apache.ctakes$ctakes-core/ws/src/main/java/org/apache/ctakes/core/ae/SHARPKnowtatorXMLReader.java>:[55,47]
error: package org.apache.ctakes.typesystem.type.refsem does not exist
[ERROR] <https://builds.apache.org/job/ctakes-trunk-package/org.apache.ctakes$ctakes-core/ws/src/main/java/org/apache/ctakes/core/ae/SHARPKnowtatorXMLReader.java>:[56,47]
error: package org.apache.ctakes.typesystem.type.refsem does not exist
[ERROR] <https://builds.apache.org/job/ctakes-trunk-package/org.apache.ctakes$ctakes-core/ws/src/main/java/org/apache/ctakes/core/ae/SHARPKnowtatorXMLReader.java>:[57,47]
error: package org.apache.ctakes.typesystem.type.refsem does not exist
[ERROR] <https://builds.apache.org/job/ctakes-trunk-package/org.apache.ctakes$ctakes-core/ws/src/main/java/org/apache/ctakes/core/ae/SHARPKnowtatorXMLReader.java>:[58,49]
error: package org.apache.ctakes.typesystem.type.relation does not exist
[ERROR] <https://builds.apache.org/job/ctakes-trunk-package/org.apache.ctakes$ctakes-core/ws/src/main/java/org/apache/ctakes/core/ae/SHARPKnowtatorXMLReader.java>:[59,49]
error: package org.apache.ctakes.typesystem.type.relation does not exist
[ERROR] <https://builds.apache.org/job/ctakes-trunk-package/org.apache.ctakes$ctakes-core/ws/src/main/java/org/apache/ctakes/core/ae/SHARPKnowtatorXMLReader.java>:[60,49]
error: package org.apache.ctakes.typesystem.type.relation does not exist
[ERROR] <https://builds.apache.org/job/ctakes-trunk-package/org.apache.ctakes$ctakes-core/ws/src/main/java/org/apache/ctakes/core/ae/SHARPKnowtatorXMLReader.java>:[61,49]
error: package org.apache.ctakes.typesystem.type.relation does not exist
[ERROR] <https://builds.apache.org/job/ctakes-trunk-package/org.apache.ctakes$ctakes-core/ws/src/main/java/org/apache/ctakes/core/ae/SHARPKnowtatorXMLReader.java>:[62,49]
error: package org.apache.ctakes.typesystem.type.relation does not exist
[ERROR] <https://builds.apache.org/job/ctakes-trunk-package/org.apache.ctakes$ctakes-core/ws/src/main/java/org/apache/ctakes/core/ae/SHARPKnowtatorXMLReader.java>:[63,49]
error: package org.apache.ctakes.typesystem.type.relation does not exist
[ERROR] <https://builds.apache.org/job/ctakes-trunk-package/org.apache.ctakes$ctakes-core/ws/src/main/java/org/apache/ctakes/core/ae/SHARPKnowtatorXMLReader.java>:[64,49]
error: package org.apache.ctakes.typesystem.type.relation does not exist
[ERROR] <https://builds.apache.org/job/ctakes-trunk-package/org.apache.ctakes$ctakes-core/ws/src/main/java/org/apache/ctakes/core/ae/SHARPKnowtatorXMLReader.java>:[65,49]
error: package org.apache.ctakes.typesystem.type.relation does not exist
[ERROR] <https://builds.apache.org/job/ctakes-trunk-package/org.apache.ctakes$ctakes-core/ws/src/main/java/org/apache/ctakes/core/ae/SHARPKnowtatorXMLReader.java>:[66,49]
error: package org.apache.ctakes.typesystem.type.relation does not exist
[ERROR] <https://builds.apache.org/job/ctakes-trunk-package/org.apache.ctakes$ctakes-core/ws/src/main/java/org/apache/ctakes/core/ae/SHARPKnowtatorXMLReader.java>:[67,49]
error: package org.apache.ctakes.typesystem.type.relation does not exist
[ERROR] <https://builds.apache.org/job/ctakes-trunk-package/org.apache.ctakes$ctakes-core/ws/src/main/java/org/apache/ctakes/core/ae/SHARPKnowtatorXMLReader.java>:[68,49]
error: package org.apache.ctakes.typesystem.type.relation does not exist
[ERROR] <https://builds.apache.org/job/ctakes-trunk-package/org.apache.ctakes$ctakes-core/ws/src/main/java/org/apache/ctakes/core/ae/SHARPKnowtatorXMLReader.java>:[69,51]
error: package org.apache.ctakes.typesystem.type.structured does not exist
[ERROR] <https://builds.apache.org/job/ctakes-trunk-package/org.apache.ctakes$ctakes-core/ws/src/main/java/org/apache/ctakes/core/ae/SHARPKnowtatorXMLReader.java>:[70,48]
error: package org.apache.ctakes.typesystem.type.textsem does not exist
[ERROR] <https://builds.apache.org/job/ctakes-trunk-package/org.apache.ctakes$ctakes-core/ws/src/main/java/org/apache/ctakes/core/ae/SHARPKnowtatorXMLReader.java>:[71,48]
error: package org.apache.ctakes.typesystem.type.textsem does not exist
[ERROR] <https://builds.apache.org/job/ctakes-trunk-package/org.apache.ctakes$ctakes-core/ws/src/main/java/org/apache/ctakes/core/ae/SHARPKnowtatorXMLReader.java>:[72,48]
error: package org.apache.ctakes.typesystem.type.textsem does not exist
[ERROR] <https://builds.apache.org/job/ctakes-trunk-package/org.apache.ctakes$ctakes-core/ws/src/main/java/org/apache/ctakes/core/ae/SHARPKnowtatorXMLReader.java>:[73,48]
error: package org.apache.ctakes.typesystem.type.textsem does not exist
[ERROR] <https://builds.apache.org/job/ctakes-trunk-package/org.apache.ctakes$ctakes-core/ws/src/main/java/org/apache/ctakes/core/ae/SHARPKnowtatorXMLReader.java>:[74,48]
error: package org.apache.ctakes.typesystem.type.textsem does not exist
[ERROR] <https://builds.apache.org/job/ctakes-trunk-package/org.apache.ctakes$ctakes-core/ws/src/main/java/org/apache/ctakes/core/ae/SHARPKnowtatorXMLReader.java>:[75,48]
error: package org.apache.ctakes.typesystem.type.textsem does not exist
[ERROR] <https://builds.apache.org/job/ctakes-trunk-package/org.apache.ctakes$ctakes-core/ws/src/main/java/org/apache/ctakes/core/ae/SHARPKnowtatorXMLReader.java>:[76,48]
error: package org.apache.ctakes.typesystem.type.textsem does not exist
[ERROR] <https://builds.apache.org/job/ctakes-trunk-package/org.apache.ctakes$ctakes-core/ws/src/main/java/org/apache/ctakes/core/ae/SHARPKnowtatorXMLReader.java>:[77,48]
error: package org.apache.ctakes.typesystem.type.textsem does not exist
[ERROR] <https://builds.apache.org/job/ctakes-trunk-package/org.apache.ctakes$ctakes-core/ws/src/main/java/org/apache/ctakes/core/ae/SHARPKnowtatorXMLReader.java>:[78,48]
error: package org.apache.ctakes.typesystem.type.textsem does not exist
[ERROR] <https://builds.apache.org/job/ctakes-trunk-package/org.apache.ctakes$ctakes-core/ws/src/main/java/org/apache/ctakes/core/ae/SHARPKnowtatorXMLReader.java>:[79,48]
error: package org.apache.ctakes.typesystem.type.textsem does not exist
[ERROR] <https://builds.apache.org/job/ctakes-trunk-package/org.apache.ctakes$ctakes-core/ws/src/main/java/org/apache/ctakes/core/ae/SHARPKnowtatorXMLReader.java>:[80,48]
error: package org.apache.ctakes.typesystem.type.textsem does not exist
[ERROR] <https://builds.apache.org/job/ctakes-trunk-package/org.apache.ctakes$ctakes-core/ws/src/main/java/org/apache/ctakes/core/ae/SHARPKnowtatorXMLReader.java>:[81,48]
error: package org.apache.ctakes.typesystem.type.textsem does not exist
[ERROR] <https://builds.apache.org/job/ctakes-trunk-package/org.apache.ctakes$ctakes-core/ws/src/main/java/org/apache/ctakes/core/ae/SHARPKnowtatorXMLReader.java>:[82,48]
error: package org.apache.ctakes.typesystem.type.textsem does not exist
[ERROR] <https://builds.apache.org/job/ctakes-trunk-package/org.apache.ctakes$ctakes-core/ws/src/main/java/org/apache/ctakes/core/ae/SHARPKnowtatorXMLReader.java>:[83,48]
error: package org.apache.ctakes.typesystem.type.textsem does not exist
[ERROR] <https://builds.apache.org/job/ctakes-trunk-package/org.apache.ctakes$ctakes-core/ws/src/main/java/org/apache/ctakes/core/ae/SHARPKnowtatorXMLReader.java>:[84,48]
error: package org.apache.ctakes.typesystem.type.textsem does not exist
[ERROR] <https://builds.apache.org/job/ctakes-trunk-package/org.apache.ctakes$ctakes-core/ws/src/main/java/org/apache/ctakes/core/ae/SHARPKnowtatorXMLReader.java>:[85,48]
error: package org.apache.ctakes.typesystem.type.textsem does not exist
[ERROR] <https://builds.apache.org/job/ctakes-trunk-package/org.apache.ctakes$ctakes-core/ws/src/main/java/org/apache/ctakes/core/ae/SHARPKnowtatorXMLReader.java>:[86,48]
error: package org.apache.ctakes.typesystem.type.textsem does not exist
[ERROR] <https://builds.apache.org/job/ctakes-trunk-package/org.apache.ctakes$ctakes-core/ws/src/main/java/org/apache/ctakes/core/ae/SHARPKnowtatorXMLReader.java>:[87,48]
error: package org.apache.ctakes.typesystem.type.textsem does not exist
[ERROR] <https://builds.apache.org/job/ctakes-trunk-package/org.apache.ctakes$ctakes-core/ws/src/main/java/org/apache/ctakes/core/ae/SHARPKnowtatorXMLReader.java>:[88,48]
error: package org.apache.ctakes.typesystem.type.textsem does not exist
[ERROR] <https://builds.apache.org/job/ctakes-trunk-package/org.apache.ctakes$ctakes-core/ws/src/main/java/org/apache/ctakes/core/ae/SHARPKnowtatorXMLReader.java>:[89,48]
error: package org.apache.ctakes.typesystem.type.textsem does not exist
[ERROR] <https://builds.apache.org/job/ctakes-trunk-package/org.apache.ctakes$ctakes-core/ws/src/main/java/org/apache/ctakes/core/ae/SHARPKnowtatorXMLReader.java>:[90,48]
error: package org.apache.ctakes.typesystem.type.textsem does not exist
[ERROR] <https://builds.apache.org/job/ctakes-trunk-package/org.apache.ctakes$ctakes-core/ws/src/main/java/org/apache/ctakes/core/ae/SHARPKnowtatorXMLReader.java>:[91,48]
error: package org.apache.ctakes.typesystem.type.textsem does not exist
[ERROR] <https://builds.apache.org/job/ctakes-trunk-package/org.apache.ctakes$ctakes-core/ws/src/main/java/org/apache/ctakes/core/ae/SHARPKnowtatorXMLReader.java>:[92,48]
error: package org.apache.ctakes.typesystem.type.textsem does not exist
[ERROR] <https://builds.apache.org/job/ctakes-trunk-package/org.apache.ctakes$ctakes-core/ws/src/main/java/org/apache/ctakes/core/ae/SHARPKnowtatorXMLReader.java>:[93,48]
error: package org.apache.ctakes.typesystem.type.textsem does not exist
[ERROR] <https://builds.apache.org/job/ctakes-trunk-package/org.apache.ctakes$ctakes-core/ws/src/main/java/org/apache/ctakes/core/ae/SHARPKnowtatorXMLReader.java>:[94,48]
error: package org.apache.ctakes.typesystem.type.textsem does not exist
[ERROR] <https://builds.apache.org/job/ctakes-trunk-package/org.apache.ctakes$ctakes-core/ws/src/main/java/org/apache/ctakes/core/ae/SHARPKnowtatorXMLReader.java>:[95,48]
error: package org.apache.ctakes.typesystem.type.textsem does not exist
[ERROR] <https://builds.apache.org/job/ctakes-trunk-package/org.apache.ctakes$ctakes-core/ws/src/main/java/org/apache/ctakes/core/ae/SHARPKnowtatorXMLReader.java>:[96,48]
error: package org.apache.ctakes.typesystem.type.textsem does not exist
[ERROR] <https://builds.apache.org/job/ctakes-trunk-package/org.apache.ctakes$ctakes-core/ws/src/main/java/org/apache/ctakes/core/ae/SHARPKnowtatorXMLReader.java>:[97,48]
error: package org.apache.ctakes.typesystem.type.textsem does not exist
[ERROR] <https://builds.apache.org/job/ctakes-trunk-package/org.apache.ctakes$ctakes-core/ws/src/main/java/org/apache/ctakes/core/ae/SHARPKnowtatorXMLReader.java>:[98,48]
error: package org.apache.ctakes.typesystem.type.textsem does not exist
[ERROR] <https://builds.apache.org/job/ctakes-trunk-package/org.apache.ctakes$ctakes-core/ws/src/main/java/org/apache/ctakes/core/ae/SHARPKnowtatorXMLReader.java>:[99,48]
error: package org.apache.ctakes.typesystem.type.textsem does not exist
[ERROR] <https://builds.apache.org/job/ctakes-trunk-package/org.apache.ctakes$ctakes-core/ws/src/main/java/org/apache/ctakes/core/ae/SHARPKnowtatorXMLReader.java>:[100,48]
error: package org.apache.ctakes.typesystem.type.textsem does not exist
[ERROR] <https://builds.apache.org/job/ctakes-trunk-package/org.apache.ctakes$ctakes-core/ws/src/main/java/org/apache/ctakes/core/ae/SHARPKnowtatorXMLReader.java>:[101,48]
error: package org.apache.ctakes.typesystem.type.textsem does not exist
[ERROR] <https://builds.apache.org/job/ctakes-trunk-package/org.apache.ctakes$ctakes-core/ws/src/main/java/org/apache/ctakes/core/ae/SHARPKnowtatorXMLReader.java>:[102,48]
error: package org.apache.ctakes.typesystem.type.textsem does not exist
[ERROR] <https://builds.apache.org/job/ctakes-trunk-package/org.apache.ctakes$ctakes-core/ws/src/main/java/org/apache/ctakes/core/ae/SHARPKnowtatorXMLReader.java>:[103,48]
error: package org.apache.ctakes.typesystem.type.textsem does not exist
[ERROR] <https://builds.apache.org/job/ctakes-trunk-package/org.apache.ctakes$ctakes-core/ws/src/main/java/org/apache/ctakes/core/ae/SHARPKnowtatorXMLReader.java>:[104,48]
error: package org.apache.ctakes.typesystem.type.textsem does not exist
[ERROR] <https://builds.apache.org/job/ctakes-trunk-package/org.apache.ctakes$ctakes-core/ws/src/main/java/org/apache/ctakes/core/ae/SHARPKnowtatorXMLReader.java>:[1105,12]
error: cannot find symbol
[ERROR]   symbol:   class IdentifiedAnnotation
  location: class SHARPKnowtatorXMLReader
<https://builds.apache.org/job/ctakes-trunk-package/org.apache.ctakes$ctakes-core/ws/src/main/java/org/apache/ctakes/core/ae/SHARPKnowtatorXMLReader.java>:[1431,28]
error: cannot find symbol
[ERROR]   symbol:   class BinaryTextRelation
  location: class DelayedRelationFeature
<https://builds.apache.org/job/ctakes-trunk-package/org.apache.ctakes$ctakes-core/ws/src/main/java/org/apache/ctakes/core/ae/SHARPKnowtatorXMLReader.java>:[1439,24]
error: cannot find symbol
[ERROR]   symbol:   class BinaryTextRelation
  location: class DelayedRelationFeature
<https://builds.apache.org/job/ctakes-trunk-package/org.apache.ctakes$ctakes-core/ws/src/main/java/org/apache/ctakes/core/ae/SHARPKnowtatorXMLReader.java>:[1456,24]
error: cannot find symbol
[ERROR]   symbol:   class BinaryTextRelation
  location: class DelayedRelationFeature
<https://builds.apache.org/job/ctakes-trunk-package/org.apache.ctakes$ctakes-core/ws/src/main/java/org/apache/ctakes/core/ae/SHARPKnowtatorXMLReader.java>:[1473,24]
error: cannot find symbol
[ERROR]   symbol:   class BinaryTextRelation
  location: class DelayedRelationFeature
<https://builds.apache.org/job/ctakes-trunk-package/org.apache.ctakes$ctakes-core/ws/src/main/java/org/apache/ctakes/core/fsm/adapters/IntegerTokenAdapter.java>:[22,47]
error: package org.apache.ctakes.typesystem.type.syntax does not exist
[ERROR] <https://builds.apache.org/job/ctakes-trunk-package/org.apache.ctakes$ctakes-core/ws/src/main/java/org/apache/ctakes/core/fsm/adapters/NumberTokenAdapter.java>:[22,47]
error: package org.apache.ctakes.typesystem.type.syntax does not exist
[ERROR] <https://builds.apache.org/job/ctakes-trunk-package/org.apache.ctakes$ctakes-core/ws/src/main/java/org/apache/ctakes/core/fsm/adapters/IntegerTokenAdapter.java>:[39,28]
error: cannot find symbol
[ERROR]   symbol:   class NumToken
  location: class IntegerTokenAdapter
<https://builds.apache.org/job/ctakes-trunk-package/org.apache.ctakes$ctakes-core/ws/src/main/java/org/apache/ctakes/core/fsm/adapters/NumberTokenAdapter.java>:[37,27]
error: cannot find symbol
[ERROR]   symbol:   class NumToken
  location: class NumberTokenAdapter
<https://builds.apache.org/job/ctakes-trunk-package/org.apache.ctakes$ctakes-core/ws/src/main/java/org/apache/ctakes/core/cr/FilesInDirectoryCollectionReader.java>:[63,51]
error: package org.apache.ctakes.typesystem.type.structured does not exist
[ERROR] <https://builds.apache.org/job/ctakes-trunk-package/org.apache.ctakes$ctakes-core/ws/src/main/java/org/apache/ctakes/core/fsm/adapters/PunctuationTokenAdapter.java>:[33,72]
error: package org.apache.ctakes.typesystem.type.syntax does not exist
[ERROR] <https://builds.apache.org/job/ctakes-trunk-package/org.apache.ctakes$ctakes-core/ws/src/main/java/org/apache/ctakes/core/ae/SentenceDetector.java>:[47,49]
error: package org.apache.ctakes.typesystem.type.textspan does not exist
[ERROR] <https://builds.apache.org/job/ctakes-trunk-package/org.apache.ctakes$ctakes-core/ws/src/main/java/org/apache/ctakes/core/ae/SentenceDetector.java>:[48,49]
error: package org.apache.ctakes.typesystem.type.textspan does not exist
[ERROR] <https://builds.apache.org/job/ctakes-trunk-package/org.apache.ctakes$ctakes-core/ws/src/main/java/org/apache/ctakes/core/ae/SentenceDetector.java>:[163,53]
error: cannot find symbol
[ERROR]   symbol:   class Segment
  location: class SentenceDetector
<https://builds.apache.org/job/ctakes-trunk-package/org.apache.ctakes$ctakes-core/ws/src/main/java/org/apache/ctakes/core/cc/JdbcWriterTemplate.java>:[22,47]
error: package org.apache.ctakes.typesystem.type.refsem does not exist
[ERROR] <https://builds.apache.org/job/ctakes-trunk-package/org.apache.ctakes$ctakes-core/ws/src/main/java/org/apache/ctakes/core/cr/TextReader.java>:[34,33]
[deprecation] CasInitializer in org.apache.uima.collection has been deprecated
[ERROR] <https://builds.apache.org/job/ctakes-trunk-package/org.apache.ctakes$ctakes-core/ws/src/main/java/org/apache/ctakes/core/cr/JdbcCollectionReader.java>:[179,25]
[unchecked] unchecked conversion
[ERROR] <https://builds.apache.org/job/ctakes-trunk-package/org.apache.ctakes$ctakes-core/ws/src/main/java/org/apache/ctakes/core/cr/JdbcCollectionReader.java>:[276,20]
[deprecation] getCasInitializer() in CollectionReader_ImplBase has been deprecated
[ERROR] <https://builds.apache.org/job/ctakes-trunk-package/org.apache.ctakes$ctakes-core/ws/src/main/java/org/apache/ctakes/core/cr/JdbcCollectionReader.java>:[279,20]
[deprecation] getCasInitializer() in CollectionReader_ImplBase has been deprecated
[ERROR] <https://builds.apache.org/job/ctakes-trunk-package/org.apache.ctakes$ctakes-core/ws/src/main/java/org/apache/ctakes/core/util/ListIterable.java>:[34,50]
[unchecked] unchecked cast
[ERROR]   required: T
  found:    TOP
  where T is a type-variable:
    T extends Object declared in class FSListIterator
<https://builds.apache.org/job/ctakes-trunk-package/org.apache.ctakes$ctakes-core/ws/src/main/java/org/apache/ctakes/core/cr/FilesInDirectoryCollectionReader.java>:[224,7]
[deprecation] getCasInitializer() in CollectionReader_ImplBase has been deprecated
[ERROR] <https://builds.apache.org/job/ctakes-trunk-package/org.apache.ctakes$ctakes-core/ws/src/main/java/org/apache/ctakes/core/cr/FilesInDirectoryCollectionReader.java>:[226,4]
[deprecation] getCasInitializer() in CollectionReader_ImplBase has been deprecated
[ERROR] <https://builds.apache.org/job/ctakes-trunk-package/org.apache.ctakes$ctakes-core/ws/src/main/java/org/apache/ctakes/core/cr/XmiCollectionReaderCtakes.java>:[80,18]
[unchecked] unchecked call to add(E) as a member of the raw type ArrayList
[ERROR]   where E is a type-variable:
    E extends Object declared in class ArrayList
<https://builds.apache.org/job/ctakes-trunk-package/org.apache.ctakes$ctakes-core/ws/src/main/java/org/apache/ctakes/core/resource/StringIntegerMapResourceImpl.java>:[101,15]
[unchecked] getMap() in StringIntegerMapResourceImpl implements getMap() in StringIntegerMapResource
[ERROR]   return type requires unchecked conversion from Map to Map<String,Integer>
<https://builds.apache.org/job/ctakes-trunk-package/org.apache.ctakes$ctakes-core/ws/src/main/java/org/apache/ctakes/core/ae/SentenceDetector.java>:[45,25]
[deprecation] HashSumEventStream in opennlp.tools.util has been deprecated
[ERROR] <https://builds.apache.org/job/ctakes-trunk-package/org.apache.ctakes$ctakes-core/ws/src/main/java/org/apache/ctakes/core/ae/SentenceDetector.java>:[318,30]
[deprecation] train(String,ObjectStream<SentenceSample>,boolean,Dictionary,TrainingParameters)
in SentenceDetectorME has been deprecated
[ERROR] <https://builds.apache.org/job/ctakes-trunk-package/org.apache.ctakes$ctakes-core/ws/src/main/java/org/apache/ctakes/core/sentence/SentenceDetectorCtakes.java>:[251,5]
[deprecation] HashSumEventStream in opennlp.tools.util has been deprecated
[ERROR] <https://builds.apache.org/job/ctakes-trunk-package/org.apache.ctakes$ctakes-core/ws/src/main/java/org/apache/ctakes/core/sentence/SentenceDetectorCtakes.java>:[251,35]
[deprecation] HashSumEventStream in opennlp.tools.util has been deprecated
[ERROR] <https://builds.apache.org/job/ctakes-trunk-package/org.apache.ctakes$ctakes-core/ws/src/main/java/org/apache/ctakes/core/resource/LuceneIndexReaderResourceImpl.java>:[70,44]
[deprecation] open(Directory) in IndexReader has been deprecated
[ERROR] <https://builds.apache.org/job/ctakes-trunk-package/org.apache.ctakes$ctakes-core/ws/src/main/java/org/apache/ctakes/core/resource/LuceneIndexReaderResourceImpl.java>:[75,44]
[deprecation] open(Directory) in IndexReader has been deprecated
[ERROR] <https://builds.apache.org/job/ctakes-trunk-package/org.apache.ctakes$ctakes-core/ws/src/main/java/org/apache/ctakes/core/cr/LinesFromFileCollectionReader.java>:[175,7]
[deprecation] getCasInitializer() in CollectionReader_ImplBase has been deprecated
[ERROR] <https://builds.apache.org/job/ctakes-trunk-package/org.apache.ctakes$ctakes-core/ws/src/main/java/org/apache/ctakes/core/cr/LinesFromFileCollectionReader.java>:[178,4]
[deprecation] getCasInitializer() in CollectionReader_ImplBase has been deprecated
[ERROR] <https://builds.apache.org/job/ctakes-trunk-package/org.apache.ctakes$ctakes-core/ws/src/main/java/org/apache/ctakes/core/cr/TextReader.java>:[86,4]
[deprecation] CasInitializer in org.apache.uima.collection has been deprecated
[ERROR] <https://builds.apache.org/job/ctakes-trunk-package/org.apache.ctakes$ctakes-core/ws/src/main/java/org/apache/ctakes/core/cr/TextReader.java>:[86,36]
[deprecation] getCasInitializer() in CollectionReader_ImplBase has been deprecated
[INFO] 119 errors 
[INFO] -------------------------------------------------------------

Mime
View raw message