ctakes-notifications mailing list archives

Site index · List index
Message view « Date » · « Thread »
Top « Date » · « Thread »
From Apache Jenkins Server <jenk...@builds.apache.org>
Subject Build failed in Jenkins: ctakes-trunk-compiletest #633
Date Sat, 14 Feb 2015 02:17:52 GMT
See <https://builds.apache.org/job/ctakes-trunk-compiletest/633/changes>

Changes:

[clin] add an evaluation script for jointly evaluate event-time and event-event relations

------------------------------------------
[...truncated 7539 lines...]
[ERROR] where SEARCH_T is a type-variable:
[ERROR] SEARCH_T extends Annotation declared in class CleartkExtractor
[ERROR] <https://builds.apache.org/job/ctakes-trunk-compiletest/ws/ctakes-temporal/src/main/java/org/apache/ctakes/temporal/ae/TimexAdmissionTimeAnnotator.java>:[198,58]
[unchecked] unchecked call to extract(JCas,FOCUS_T) as a member of the raw type CleartkExtractor
[ERROR] where FOCUS_T is a type-variable:
[ERROR] FOCUS_T extends Annotation declared in class CleartkExtractor
[ERROR] <https://builds.apache.org/job/ctakes-trunk-compiletest/ws/ctakes-temporal/src/main/java/org/apache/ctakes/temporal/ae/TimexAdmissionTimeAnnotator.java>:[198,58]
[unchecked] unchecked conversion
[ERROR] required: List<Feature>
[ERROR] found:    List
[ERROR] <https://builds.apache.org/job/ctakes-trunk-compiletest/ws/ctakes-temporal/src/main/java/org/apache/ctakes/temporal/ae/BackwardsTimeAnnotator.java>:[167,38]
[unchecked] unchecked call to CleartkExtractor(Class<SEARCH_T>,FeatureExtractor1<SEARCH_T>,Context...)
as a member of the raw type CleartkExtractor
[ERROR] where SEARCH_T is a type-variable:
[ERROR] SEARCH_T extends Annotation declared in class CleartkExtractor
[ERROR] <https://builds.apache.org/job/ctakes-trunk-compiletest/ws/ctakes-temporal/src/main/java/org/apache/ctakes/temporal/ae/BackwardsTimeAnnotator.java>:[205,43]
[unchecked] unchecked call to extract(JCas,T) as a member of the raw type FeatureExtractor1
[ERROR] where T is a type-variable:
[ERROR] T extends Annotation declared in interface FeatureExtractor1
[ERROR] <https://builds.apache.org/job/ctakes-trunk-compiletest/ws/ctakes-temporal/src/main/java/org/apache/ctakes/temporal/ae/BackwardsTimeAnnotator.java>:[205,43]
[unchecked] unchecked conversion
[ERROR] required: Collection<? extends Feature>
[ERROR] found:    List
[ERROR] <https://builds.apache.org/job/ctakes-trunk-compiletest/ws/ctakes-temporal/src/main/java/org/apache/ctakes/temporal/ae/BackwardsTimeAnnotator.java>:[209,49]
[unchecked] unchecked call to extractWithin(JCas,FOCUS_T,Annotation) as a member of the raw
type CleartkExtractor
[ERROR] where FOCUS_T is a type-variable:
[ERROR] FOCUS_T extends Annotation declared in class CleartkExtractor
[ERROR] <https://builds.apache.org/job/ctakes-trunk-compiletest/ws/ctakes-temporal/src/main/java/org/apache/ctakes/temporal/ae/BackwardsTimeAnnotator.java>:[209,49]
[unchecked] unchecked conversion
[ERROR] required: Collection<? extends Feature>
[ERROR] found:    List
[ERROR] <https://builds.apache.org/job/ctakes-trunk-compiletest/ws/ctakes-temporal/src/main/java/org/apache/ctakes/temporal/eval/EvaluationOfEventTimeRelations.java>:[372,33]
[deprecation] createEngineDescription(File) in EventTimeSelfRelationAnnotator has been deprecated
[ERROR] <https://builds.apache.org/job/ctakes-trunk-compiletest/ws/ctakes-temporal/src/main/java/org/apache/ctakes/temporal/eval/EvaluationOfEventEventRelations.java>:[139,35]
[deprecation] createAnnotatorDescription(File) in EventEventRelationAnnotator has been deprecated
[ERROR] <https://builds.apache.org/job/ctakes-trunk-compiletest/ws/ctakes-temporal/src/main/java/org/apache/ctakes/temporal/ae/TimexDischargeTimeAnnotator.java>:[77,30]
[deprecation] createPrimitiveDescription(Class<? extends AnalysisComponent>,Object...)
in AnalysisEngineFactory has been deprecated
[ERROR] <https://builds.apache.org/job/ctakes-trunk-compiletest/ws/ctakes-temporal/src/main/java/org/apache/ctakes/temporal/ae/TimexDischargeTimeAnnotator.java>:[89,30]
[deprecation] createPrimitiveDescription(Class<? extends AnalysisComponent>,Object...)
in AnalysisEngineFactory has been deprecated
[ERROR] <https://builds.apache.org/job/ctakes-trunk-compiletest/ws/ctakes-temporal/src/main/java/org/apache/ctakes/temporal/ae/TimexDischargeTimeAnnotator.java>:[129,4]
[unchecked] unchecked call to TypePathExtractor(Class<T>,String) as a member of the
raw type TypePathExtractor
[ERROR] where T is a type-variable:
[ERROR] T extends Annotation declared in class TypePathExtractor
[ERROR] <https://builds.apache.org/job/ctakes-trunk-compiletest/ws/ctakes-temporal/src/main/java/org/apache/ctakes/temporal/ae/TimexDischargeTimeAnnotator.java>:[127,37]
[unchecked] unchecked call to CombinedExtractor1(FeatureExtractor1<T>,FeatureExtractor1<T>)
as a member of the raw type CombinedExtractor1
[ERROR] where T is a type-variable:
[ERROR] T extends Annotation declared in class CombinedExtractor1
[ERROR] <https://builds.apache.org/job/ctakes-trunk-compiletest/ws/ctakes-temporal/src/main/java/org/apache/ctakes/temporal/ae/TimexDischargeTimeAnnotator.java>:[130,26]
[unchecked] unchecked call to CleartkExtractor(Class<SEARCH_T>,FeatureExtractor1<SEARCH_T>,Context...)
as a member of the raw type CleartkExtractor
[ERROR] where SEARCH_T is a type-variable:
[ERROR] SEARCH_T extends Annotation declared in class CleartkExtractor
[ERROR] <https://builds.apache.org/job/ctakes-trunk-compiletest/ws/ctakes-temporal/src/main/java/org/apache/ctakes/temporal/ae/TimexDischargeTimeAnnotator.java>:[198,59]
[unchecked] unchecked call to extract(JCas,FOCUS_T) as a member of the raw type CleartkExtractor
[ERROR] where FOCUS_T is a type-variable:
[ERROR] FOCUS_T extends Annotation declared in class CleartkExtractor
[ERROR] <https://builds.apache.org/job/ctakes-trunk-compiletest/ws/ctakes-temporal/src/main/java/org/apache/ctakes/temporal/ae/TimexDischargeTimeAnnotator.java>:[198,59]
[unchecked] unchecked conversion
[ERROR] required: List<Feature>
[ERROR] found:    List
[ERROR] <https://builds.apache.org/job/ctakes-trunk-compiletest/ws/ctakes-temporal/src/main/java/org/apache/ctakes/temporal/ae/ConsecutiveSentencesEventTimeRelationAnnotator.java>:[56,30]
[deprecation] createPrimitiveDescription(Class<? extends AnalysisComponent>,Object...)
in AnalysisEngineFactory has been deprecated
[ERROR] <https://builds.apache.org/job/ctakes-trunk-compiletest/ws/ctakes-temporal/src/main/java/org/apache/ctakes/temporal/ae/ConsecutiveSentencesEventTimeRelationAnnotator.java>:[71,30]
[deprecation] createPrimitiveDescription(Class<? extends AnalysisComponent>,Object...)
in AnalysisEngineFactory has been deprecated
[ERROR] <https://builds.apache.org/job/ctakes-trunk-compiletest/ws/ctakes-temporal/src/main/java/org/apache/ctakes/temporal/ae/feature/UnexpandedTokenFeaturesExtractor.java>:[34,42]
[unchecked] unchecked call to CleartkExtractor(Class<SEARCH_T>,FeatureExtractor1<SEARCH_T>,Context...)
as a member of the raw type CleartkExtractor
[ERROR] where SEARCH_T is a type-variable:
[ERROR] SEARCH_T extends Annotation declared in class CleartkExtractor
[ERROR] <https://builds.apache.org/job/ctakes-trunk-compiletest/ws/ctakes-temporal/src/main/java/org/apache/ctakes/temporal/ae/feature/UnexpandedTokenFeaturesExtractor.java>:[48,3]
[unchecked] unchecked call to CombinedExtractor1(FeatureExtractor1<T>,FeatureExtractor1<T>)
as a member of the raw type CombinedExtractor1
[ERROR] where T is a type-variable:
[ERROR] T extends Annotation declared in class CombinedExtractor1
[ERROR] <https://builds.apache.org/job/ctakes-trunk-compiletest/ws/ctakes-temporal/src/main/java/org/apache/ctakes/temporal/ae/feature/UnexpandedTokenFeaturesExtractor.java>:[46,55]
[unchecked] unchecked call to NamingExtractor1(String,FeatureExtractor1<T>) as a member
of the raw type NamingExtractor1
[ERROR] where T is a type-variable:
[ERROR] T extends Annotation declared in class NamingExtractor1
[ERROR] <https://builds.apache.org/job/ctakes-trunk-compiletest/ws/ctakes-temporal/src/main/java/org/apache/ctakes/temporal/ae/feature/UnexpandedTokenFeaturesExtractor.java>:[55,3]
[unchecked] unchecked call to CombinedExtractor1(FeatureExtractor1<T>,FeatureExtractor1<T>)
as a member of the raw type CombinedExtractor1
[ERROR] where T is a type-variable:
[ERROR] T extends Annotation declared in class CombinedExtractor1
[ERROR] <https://builds.apache.org/job/ctakes-trunk-compiletest/ws/ctakes-temporal/src/main/java/org/apache/ctakes/temporal/ae/feature/UnexpandedTokenFeaturesExtractor.java>:[53,55]
[unchecked] unchecked call to NamingExtractor1(String,FeatureExtractor1<T>) as a member
of the raw type NamingExtractor1
[ERROR] where T is a type-variable:
[ERROR] T extends Annotation declared in class NamingExtractor1
[ERROR] <https://builds.apache.org/job/ctakes-trunk-compiletest/ws/ctakes-temporal/src/main/java/org/apache/ctakes/temporal/ae/feature/UnexpandedTokenFeaturesExtractor.java>:[62,3]
[unchecked] unchecked call to NamingExtractor1(String,FeatureExtractor1<T>) as a member
of the raw type NamingExtractor1
[ERROR] where T is a type-variable:
[ERROR] T extends Annotation declared in class NamingExtractor1
[ERROR] <https://builds.apache.org/job/ctakes-trunk-compiletest/ws/ctakes-temporal/src/main/java/org/apache/ctakes/temporal/ae/feature/UnexpandedTokenFeaturesExtractor.java>:[60,42]
[unchecked] unchecked call to CleartkExtractor(Class<SEARCH_T>,FeatureExtractor1<SEARCH_T>,Context...)
as a member of the raw type CleartkExtractor
[ERROR] where SEARCH_T is a type-variable:
[ERROR] SEARCH_T extends Annotation declared in class CleartkExtractor
[ERROR] <https://builds.apache.org/job/ctakes-trunk-compiletest/ws/ctakes-temporal/src/main/java/org/apache/ctakes/temporal/ae/feature/UnexpandedTokenFeaturesExtractor.java>:[70,44]
[unchecked] unchecked call to DistanceExtractor(String,Class<? extends Annotation>)
as a member of the raw type DistanceExtractor
[ERROR] <https://builds.apache.org/job/ctakes-trunk-compiletest/ws/ctakes-temporal/src/main/java/org/apache/ctakes/temporal/ae/feature/UnexpandedTokenFeaturesExtractor.java>:[81,56]
[unchecked] unchecked call to extract(JCas,T) as a member of the raw type FeatureExtractor1
[ERROR] where T is a type-variable:
[ERROR] T extends Annotation declared in interface FeatureExtractor1
[ERROR] <https://builds.apache.org/job/ctakes-trunk-compiletest/ws/ctakes-temporal/src/main/java/org/apache/ctakes/temporal/ae/feature/UnexpandedTokenFeaturesExtractor.java>:[81,56]
[unchecked] unchecked conversion
[ERROR] required: Collection<? extends Feature>
[ERROR] found:    List
[ERROR] <https://builds.apache.org/job/ctakes-trunk-compiletest/ws/ctakes-temporal/src/main/java/org/apache/ctakes/temporal/ae/feature/UnexpandedTokenFeaturesExtractor.java>:[82,56]
[unchecked] unchecked call to extract(JCas,T) as a member of the raw type FeatureExtractor1
[ERROR] where T is a type-variable:
[ERROR] T extends Annotation declared in interface FeatureExtractor1
[ERROR] <https://builds.apache.org/job/ctakes-trunk-compiletest/ws/ctakes-temporal/src/main/java/org/apache/ctakes/temporal/ae/feature/UnexpandedTokenFeaturesExtractor.java>:[82,56]
[unchecked] unchecked conversion
[ERROR] required: Collection<? extends Feature>
[ERROR] found:    List
[ERROR] <https://builds.apache.org/job/ctakes-trunk-compiletest/ws/ctakes-temporal/src/main/java/org/apache/ctakes/temporal/ae/feature/UnexpandedTokenFeaturesExtractor.java>:[83,51]
[unchecked] unchecked call to extractBetween(JCas,FOCUS_T,FOCUS_T) as a member of the raw
type CleartkExtractor
[ERROR] where FOCUS_T is a type-variable:
[ERROR] FOCUS_T extends Annotation declared in class CleartkExtractor
[ERROR] <https://builds.apache.org/job/ctakes-trunk-compiletest/ws/ctakes-temporal/src/main/java/org/apache/ctakes/temporal/ae/feature/UnexpandedTokenFeaturesExtractor.java>:[83,51]
[unchecked] unchecked conversion
[ERROR] required: Collection<? extends Feature>
[ERROR] found:    List
[ERROR] <https://builds.apache.org/job/ctakes-trunk-compiletest/ws/ctakes-temporal/src/main/java/org/apache/ctakes/temporal/ae/feature/UnexpandedTokenFeaturesExtractor.java>:[84,45]
[unchecked] unchecked conversion
[ERROR] required: Collection<? extends Feature>
[ERROR] found:    List
[ERROR] <https://builds.apache.org/job/ctakes-trunk-compiletest/ws/ctakes-temporal/src/main/java/org/apache/ctakes/temporal/eval/EvaluationOfSelfEventTimeRelations.java>:[370,49]
[deprecation] createAnnotatorDescription(File) in EventTimeRelationAnnotator has been deprecated
[ERROR] <https://builds.apache.org/job/ctakes-trunk-compiletest/ws/ctakes-temporal/src/main/java/org/apache/ctakes/temporal/eval/EvaluationOfSelfEventTimeRelations.java>:[489,53]
[deprecation] createEngineDescription(File) in EventTimeSelfRelationAnnotator has been deprecated
[ERROR] <https://builds.apache.org/job/ctakes-trunk-compiletest/ws/ctakes-temporal/src/main/java/org/apache/ctakes/temporal/ae/ConsecutiveSentencesEventEventRelationAnnotator.java>:[58,30]
[deprecation] createPrimitiveDescription(Class<? extends AnalysisComponent>,Object...)
in AnalysisEngineFactory has been deprecated
[ERROR] <https://builds.apache.org/job/ctakes-trunk-compiletest/ws/ctakes-temporal/src/main/java/org/apache/ctakes/temporal/ae/ConsecutiveSentencesEventEventRelationAnnotator.java>:[73,30]
[deprecation] createPrimitiveDescription(Class<? extends AnalysisComponent>,Object...)
in AnalysisEngineFactory has been deprecated
[ERROR] <https://builds.apache.org/job/ctakes-trunk-compiletest/ws/ctakes-temporal/src/main/java/org/apache/ctakes/temporal/ae/TimeAnnotator.java>:[188,4]
[unchecked] unchecked call to TypePathExtractor(Class<T>,String) as a member of the
raw type TypePathExtractor
[ERROR] where T is a type-variable:
[ERROR] T extends Annotation declared in class TypePathExtractor
[ERROR] <https://builds.apache.org/job/ctakes-trunk-compiletest/ws/ctakes-temporal/src/main/java/org/apache/ctakes/temporal/ae/TimeAnnotator.java>:[184,37]
[unchecked] unchecked call to CombinedExtractor1(FeatureExtractor1<T>,FeatureExtractor1<T>,FeatureExtractor1<T>,FeatureExtractor1<T>,FeatureExtractor1<T>)
as a member of the raw type CombinedExtractor1
[ERROR] where T is a type-variable:
[ERROR] T extends Annotation declared in class CombinedExtractor1
[ERROR] <https://builds.apache.org/job/ctakes-trunk-compiletest/ws/ctakes-temporal/src/main/java/org/apache/ctakes/temporal/ae/TimeAnnotator.java>:[198,36]
[unchecked] unchecked call to CleartkExtractor(Class<SEARCH_T>,FeatureExtractor1<SEARCH_T>,Context...)
as a member of the raw type CleartkExtractor
[ERROR] where SEARCH_T is a type-variable:
[ERROR] SEARCH_T extends Annotation declared in class CleartkExtractor
[ERROR] <https://builds.apache.org/job/ctakes-trunk-compiletest/ws/ctakes-temporal/src/main/java/org/apache/ctakes/temporal/ae/TimeAnnotator.java>:[251,38]
[unchecked] unchecked call to extract(JCas,T) as a member of the raw type FeatureExtractor1
[ERROR] where T is a type-variable:
[ERROR] T extends Annotation declared in interface FeatureExtractor1
[ERROR] <https://builds.apache.org/job/ctakes-trunk-compiletest/ws/ctakes-temporal/src/main/java/org/apache/ctakes/temporal/ae/TimeAnnotator.java>:[251,38]
[unchecked] unchecked conversion
[ERROR] required: Collection<? extends Feature>
[ERROR] found:    List
[ERROR] <https://builds.apache.org/job/ctakes-trunk-compiletest/ws/ctakes-temporal/src/main/java/org/apache/ctakes/temporal/ae/TimeAnnotator.java>:[255,44]
[unchecked] unchecked call to extractWithin(JCas,FOCUS_T,Annotation) as a member of the raw
type CleartkExtractor
[ERROR] where FOCUS_T is a type-variable:
[ERROR] FOCUS_T extends Annotation declared in class CleartkExtractor
[ERROR] <https://builds.apache.org/job/ctakes-trunk-compiletest/ws/ctakes-temporal/src/main/java/org/apache/ctakes/temporal/ae/TimeAnnotator.java>:[255,44]
[unchecked] unchecked conversion
[ERROR] required: Collection<? extends Feature>
[ERROR] found:    List
[ERROR] <https://builds.apache.org/job/ctakes-trunk-compiletest/ws/ctakes-temporal/src/main/java/org/apache/ctakes/temporal/ae/EventAnnotator.java>:[205,8]
[unchecked] unchecked call to TypePathExtractor(Class<T>,String) as a member of the
raw type TypePathExtractor
[ERROR] where T is a type-variable:
[ERROR] T extends Annotation declared in class TypePathExtractor
[ERROR] <https://builds.apache.org/job/ctakes-trunk-compiletest/ws/ctakes-temporal/src/main/java/org/apache/ctakes/temporal/ae/EventAnnotator.java>:[202,33]
[unchecked] unchecked call to CombinedExtractor1(FeatureExtractor1<T>,FeatureExtractor1<T>,FeatureExtractor1<T>)
as a member of the raw type CombinedExtractor1
[ERROR] where T is a type-variable:
[ERROR] T extends Annotation declared in class CombinedExtractor1
[ERROR] <https://builds.apache.org/job/ctakes-trunk-compiletest/ws/ctakes-temporal/src/main/java/org/apache/ctakes/temporal/ae/EventAnnotator.java>:[206,35]
[unchecked] unchecked call to CleartkExtractor(Class<SEARCH_T>,FeatureExtractor1<SEARCH_T>,Context...)
as a member of the raw type CleartkExtractor
[ERROR] where SEARCH_T is a type-variable:
[ERROR] SEARCH_T extends Annotation declared in class CleartkExtractor
[ERROR] <https://builds.apache.org/job/ctakes-trunk-compiletest/ws/ctakes-temporal/src/main/java/org/apache/ctakes/temporal/ae/EventAnnotator.java>:[319,58]
[unchecked] unchecked call to extract(JCas,T) as a member of the raw type FeatureExtractor1
[ERROR] where T is a type-variable:
[ERROR] T extends Annotation declared in interface FeatureExtractor1
[ERROR] <https://builds.apache.org/job/ctakes-trunk-compiletest/ws/ctakes-temporal/src/main/java/org/apache/ctakes/temporal/ae/EventAnnotator.java>:[319,58]
[unchecked] unchecked conversion
[ERROR] required: Collection<? extends Feature>
[ERROR] found:    List
[ERROR] <https://builds.apache.org/job/ctakes-trunk-compiletest/ws/ctakes-temporal/src/main/java/org/apache/ctakes/temporal/ae/EventAnnotator.java>:[322,66]
[unchecked] unchecked call to extractWithin(JCas,FOCUS_T,Annotation) as a member of the raw
type CleartkExtractor
[ERROR] where FOCUS_T is a type-variable:
[ERROR] FOCUS_T extends Annotation declared in class CleartkExtractor
[ERROR] <https://builds.apache.org/job/ctakes-trunk-compiletest/ws/ctakes-temporal/src/main/java/org/apache/ctakes/temporal/ae/EventAnnotator.java>:[322,66]
[unchecked] unchecked conversion
[ERROR] required: Collection<? extends Feature>
[ERROR] found:    List
[ERROR] <https://builds.apache.org/job/ctakes-trunk-compiletest/ws/ctakes-temporal/src/main/java/org/apache/ctakes/temporal/eval/EvaluationOfBothEEAndETRelations.java>:[291,44]
[deprecation] createPrimitiveDescription(Class<? extends AnalysisComponent>,Object...)
in AnalysisEngineFactory has been deprecated
[ERROR] <https://builds.apache.org/job/ctakes-trunk-compiletest/ws/ctakes-temporal/src/main/java/org/apache/ctakes/temporal/eval/EvaluationOfBothEEAndETRelations.java>:[382,30]
[deprecation] createAnnotatorDescription(File) in EventEventRelationAnnotator has been deprecated
[ERROR] <https://builds.apache.org/job/ctakes-trunk-compiletest/ws/ctakes-temporal/src/main/java/org/apache/ctakes/temporal/eval/EvaluationOfBothEEAndETRelations.java>:[383,53]
[deprecation] createEngineDescription(File) in EventTimeSelfRelationAnnotator has been deprecated
[ERROR] <https://builds.apache.org/job/ctakes-trunk-compiletest/ws/ctakes-temporal/src/main/java/org/apache/ctakes/temporal/ae/ContextualModalityAnnotator.java>:[94,8]
[unchecked] unchecked call to TypePathExtractor(Class<T>,String) as a member of the
raw type TypePathExtractor
[ERROR] where T is a type-variable:
[ERROR] T extends Annotation declared in class TypePathExtractor
[ERROR] <https://builds.apache.org/job/ctakes-trunk-compiletest/ws/ctakes-temporal/src/main/java/org/apache/ctakes/temporal/ae/ContextualModalityAnnotator.java>:[92,39]
[unchecked] unchecked call to CombinedExtractor1(FeatureExtractor1<T>,FeatureExtractor1<T>)
as a member of the raw type CombinedExtractor1
[ERROR] where T is a type-variable:
[ERROR] T extends Annotation declared in class CombinedExtractor1
[ERROR] <https://builds.apache.org/job/ctakes-trunk-compiletest/ws/ctakes-temporal/src/main/java/org/apache/ctakes/temporal/ae/ContextualModalityAnnotator.java>:[96,28]
[unchecked] unchecked call to CleartkExtractor(Class<SEARCH_T>,FeatureExtractor1<SEARCH_T>,Context...)
as a member of the raw type CleartkExtractor
[ERROR] where SEARCH_T is a type-variable:
[ERROR] SEARCH_T extends Annotation declared in class CleartkExtractor
[ERROR] <https://builds.apache.org/job/ctakes-trunk-compiletest/ws/ctakes-temporal/src/main/java/org/apache/ctakes/temporal/ae/ContextualModalityAnnotator.java>:[109,62]
[unchecked] unchecked call to extract(JCas,FOCUS_T) as a member of the raw type CleartkExtractor
[ERROR] where FOCUS_T is a type-variable:
[ERROR] FOCUS_T extends Annotation declared in class CleartkExtractor
[ERROR] <https://builds.apache.org/job/ctakes-trunk-compiletest/ws/ctakes-temporal/src/main/java/org/apache/ctakes/temporal/ae/ContextualModalityAnnotator.java>:[109,62]
[unchecked] unchecked conversion
[ERROR] required: List<Feature>
[ERROR] found:    List
[ERROR] <https://builds.apache.org/job/ctakes-trunk-compiletest/ws/ctakes-temporal/src/main/java/org/apache/ctakes/temporal/ae/ConstituencyBasedTimeAnnotator.java>:[188,26]
[unchecked] unchecked call to CleartkExtractor(Class<SEARCH_T>,FeatureExtractor1<SEARCH_T>,Context...)
as a member of the raw type CleartkExtractor
[ERROR] where SEARCH_T is a type-variable:
[ERROR] SEARCH_T extends Annotation declared in class CleartkExtractor
[ERROR] <https://builds.apache.org/job/ctakes-trunk-compiletest/ws/ctakes-temporal/src/main/java/org/apache/ctakes/temporal/ae/ConstituencyBasedTimeAnnotator.java>:[190,24]
[unchecked] unchecked call to CleartkExtractor(Class<SEARCH_T>,FeatureExtractor1<SEARCH_T>,Context...)
as a member of the raw type CleartkExtractor
[ERROR] where SEARCH_T is a type-variable:
[ERROR] SEARCH_T extends Annotation declared in class CleartkExtractor
[ERROR] <https://builds.apache.org/job/ctakes-trunk-compiletest/ws/ctakes-temporal/src/main/java/org/apache/ctakes/temporal/ae/ConstituencyBasedTimeAnnotator.java>:[235,47]
[unchecked] unchecked call to extract(JCas,T) as a member of the raw type FeatureExtractor1
[ERROR] where T is a type-variable:
[ERROR] T extends Annotation declared in interface FeatureExtractor1
[ERROR] <https://builds.apache.org/job/ctakes-trunk-compiletest/ws/ctakes-temporal/src/main/java/org/apache/ctakes/temporal/ae/ConstituencyBasedTimeAnnotator.java>:[235,47]
[unchecked] unchecked conversion
[ERROR] required: Collection<? extends Feature>
[ERROR] found:    List
[ERROR] <https://builds.apache.org/job/ctakes-trunk-compiletest/ws/ctakes-temporal/src/main/java/org/apache/ctakes/temporal/ae/ConstituencyBasedTimeAnnotator.java>:[251,39]
[unchecked] unchecked call to extract(JCas,T) as a member of the raw type FeatureExtractor1
[ERROR] where T is a type-variable:
[ERROR] T extends Annotation declared in interface FeatureExtractor1
[ERROR] <https://builds.apache.org/job/ctakes-trunk-compiletest/ws/ctakes-temporal/src/main/java/org/apache/ctakes/temporal/ae/ConstituencyBasedTimeAnnotator.java>:[251,39]
[unchecked] unchecked conversion
[ERROR] required: Collection<? extends Feature>
[ERROR] found:    List
[ERROR] <https://builds.apache.org/job/ctakes-trunk-compiletest/ws/ctakes-temporal/src/main/java/org/apache/ctakes/temporal/ae/MetaTimeAnnotator.java>:[75,38]
[deprecation] createEnsembleDescription(File,String) in BackwardsTimeAnnotator has been deprecated
[ERROR] <https://builds.apache.org/job/ctakes-trunk-compiletest/ws/ctakes-temporal/src/main/java/org/apache/ctakes/temporal/ae/MetaTimeAnnotator.java>:[78,46]
[deprecation] createEnsembleDescription(File,String) in ConstituencyBasedTimeAnnotator has
been deprecated
[ERROR] <https://builds.apache.org/job/ctakes-trunk-compiletest/ws/ctakes-temporal/src/main/java/org/apache/ctakes/temporal/ae/MetaTimeAnnotator.java>:[81,32]
[deprecation] createEnsembleDescription(File,String) in CRFTimeAnnotator has been deprecated
[ERROR] <https://builds.apache.org/job/ctakes-trunk-compiletest/ws/ctakes-temporal/src/main/java/org/apache/ctakes/temporal/ae/MetaTimeAnnotator.java>:[104,38]
[deprecation] createEnsembleDescription(File,String) in BackwardsTimeAnnotator has been deprecated
[ERROR] <https://builds.apache.org/job/ctakes-trunk-compiletest/ws/ctakes-temporal/src/main/java/org/apache/ctakes/temporal/ae/MetaTimeAnnotator.java>:[107,46]
[deprecation] createEnsembleDescription(File,String) in ConstituencyBasedTimeAnnotator has
been deprecated
[ERROR] <https://builds.apache.org/job/ctakes-trunk-compiletest/ws/ctakes-temporal/src/main/java/org/apache/ctakes/temporal/ae/MetaTimeAnnotator.java>:[110,32]
[deprecation] createEnsembleDescription(File,String) in CRFTimeAnnotator has been deprecated
[ERROR] <https://builds.apache.org/job/ctakes-trunk-compiletest/ws/ctakes-temporal/src/main/java/org/apache/ctakes/temporal/eval/EvaluationOfTimeSpans.java>:[288,23]
[deprecation] createAnnotatorDescription(File) in TimeAnnotator has been deprecated
[ERROR] <https://builds.apache.org/job/ctakes-trunk-compiletest/ws/ctakes-temporal/src/main/java/org/apache/ctakes/temporal/eval/EvaluationOfEventEventThymeRelations.java>:[369,30]
[deprecation] createAnnotatorDescription(File) in EventEventRelationAnnotator has been deprecated
[ERROR] <https://builds.apache.org/job/ctakes-trunk-compiletest/ws/ctakes-temporal/src/main/java/org/apache/ctakes/temporal/ae/DocTimeRelAnnotator.java>:[122,8]
[unchecked] unchecked call to TypePathExtractor(Class<T>,String) as a member of the
raw type TypePathExtractor
[ERROR] where T is a type-variable:
[ERROR] T extends Annotation declared in class TypePathExtractor
[ERROR] <https://builds.apache.org/job/ctakes-trunk-compiletest/ws/ctakes-temporal/src/main/java/org/apache/ctakes/temporal/ae/DocTimeRelAnnotator.java>:[120,39]
[unchecked] unchecked call to CombinedExtractor1(FeatureExtractor1<T>,FeatureExtractor1<T>)
as a member of the raw type CombinedExtractor1
[ERROR] where T is a type-variable:
[ERROR] T extends Annotation declared in class CombinedExtractor1
[ERROR] <https://builds.apache.org/job/ctakes-trunk-compiletest/ws/ctakes-temporal/src/main/java/org/apache/ctakes/temporal/ae/DocTimeRelAnnotator.java>:[123,28]
[unchecked] unchecked call to CleartkExtractor(Class<SEARCH_T>,FeatureExtractor1<SEARCH_T>,Context...)
as a member of the raw type CleartkExtractor
[ERROR] where SEARCH_T is a type-variable:
[ERROR] SEARCH_T extends Annotation declared in class CleartkExtractor
[ERROR] <https://builds.apache.org/job/ctakes-trunk-compiletest/ws/ctakes-temporal/src/main/java/org/apache/ctakes/temporal/ae/DocTimeRelAnnotator.java>:[150,60]
[unchecked] unchecked call to extract(JCas,FOCUS_T) as a member of the raw type CleartkExtractor
[ERROR] where FOCUS_T is a type-variable:
[ERROR] FOCUS_T extends Annotation declared in class CleartkExtractor
[ERROR] <https://builds.apache.org/job/ctakes-trunk-compiletest/ws/ctakes-temporal/src/main/java/org/apache/ctakes/temporal/ae/DocTimeRelAnnotator.java>:[150,60]
[unchecked] unchecked conversion
[ERROR] required: List<Feature>
[ERROR] found:    List
[ERROR] <https://builds.apache.org/job/ctakes-trunk-compiletest/ws/ctakes-temporal/src/main/java/org/apache/ctakes/temporal/eval/EvaluationOfNEPredicateEventSpans.java>:[77,37]
[deprecation] createAnnotatorDescription(File) in NEPredicateEventAnnotator has been deprecated
[ERROR] <https://builds.apache.org/job/ctakes-trunk-compiletest/ws/ctakes-temporal/src/main/java/org/apache/ctakes/temporal/ae/feature/MultiTokenFeaturesExtractor.java>:[68,42]
[unchecked] unchecked call to CleartkExtractor(Class<SEARCH_T>,FeatureExtractor1<SEARCH_T>,Context...)
as a member of the raw type CleartkExtractor
[ERROR] where SEARCH_T is a type-variable:
[ERROR] SEARCH_T extends Annotation declared in class CleartkExtractor
[ERROR] <https://builds.apache.org/job/ctakes-trunk-compiletest/ws/ctakes-temporal/src/main/java/org/apache/ctakes/temporal/ae/feature/MultiTokenFeaturesExtractor.java>:[82,3]
[unchecked] unchecked call to CombinedExtractor1(FeatureExtractor1<T>,FeatureExtractor1<T>)
as a member of the raw type CombinedExtractor1
[ERROR] where T is a type-variable:
[ERROR] T extends Annotation declared in class CombinedExtractor1
[ERROR] <https://builds.apache.org/job/ctakes-trunk-compiletest/ws/ctakes-temporal/src/main/java/org/apache/ctakes/temporal/ae/feature/MultiTokenFeaturesExtractor.java>:[80,55]
[unchecked] unchecked call to NamingExtractor1(String,FeatureExtractor1<T>) as a member
of the raw type NamingExtractor1
[ERROR] where T is a type-variable:
[ERROR] T extends Annotation declared in class NamingExtractor1
[ERROR] <https://builds.apache.org/job/ctakes-trunk-compiletest/ws/ctakes-temporal/src/main/java/org/apache/ctakes/temporal/ae/feature/MultiTokenFeaturesExtractor.java>:[89,3]
[unchecked] unchecked call to CombinedExtractor1(FeatureExtractor1<T>,FeatureExtractor1<T>)
as a member of the raw type CombinedExtractor1
[ERROR] where T is a type-variable:
[ERROR] T extends Annotation declared in class CombinedExtractor1
[ERROR] <https://builds.apache.org/job/ctakes-trunk-compiletest/ws/ctakes-temporal/src/main/java/org/apache/ctakes/temporal/ae/feature/MultiTokenFeaturesExtractor.java>:[87,55]
[unchecked] unchecked call to NamingExtractor1(String,FeatureExtractor1<T>) as a member
of the raw type NamingExtractor1
[ERROR] where T is a type-variable:
[ERROR] T extends Annotation declared in class NamingExtractor1
[ERROR] <https://builds.apache.org/job/ctakes-trunk-compiletest/ws/ctakes-temporal/src/main/java/org/apache/ctakes/temporal/ae/feature/MultiTokenFeaturesExtractor.java>:[96,3]
[unchecked] unchecked call to NamingExtractor1(String,FeatureExtractor1<T>) as a member
of the raw type NamingExtractor1
[ERROR] where T is a type-variable:
[ERROR] T extends Annotation declared in class NamingExtractor1
[ERROR] <https://builds.apache.org/job/ctakes-trunk-compiletest/ws/ctakes-temporal/src/main/java/org/apache/ctakes/temporal/ae/feature/MultiTokenFeaturesExtractor.java>:[94,42]
[unchecked] unchecked call to CleartkExtractor(Class<SEARCH_T>,FeatureExtractor1<SEARCH_T>,Context...)
as a member of the raw type CleartkExtractor
[ERROR] where SEARCH_T is a type-variable:
[ERROR] SEARCH_T extends Annotation declared in class CleartkExtractor
[ERROR] <https://builds.apache.org/job/ctakes-trunk-compiletest/ws/ctakes-temporal/src/main/java/org/apache/ctakes/temporal/ae/feature/MultiTokenFeaturesExtractor.java>:[107,44]
[unchecked] unchecked call to DistanceExtractor(String,Class<? extends Annotation>)
as a member of the raw type DistanceExtractor
[ERROR] <https://builds.apache.org/job/ctakes-trunk-compiletest/ws/ctakes-temporal/src/main/java/org/apache/ctakes/temporal/ae/feature/MultiTokenFeaturesExtractor.java>:[154,57]
[unchecked] unchecked call to extract(JCas,T) as a member of the raw type FeatureExtractor1
[ERROR] where T is a type-variable:
[ERROR] T extends Annotation declared in interface FeatureExtractor1
[ERROR] <https://builds.apache.org/job/ctakes-trunk-compiletest/ws/ctakes-temporal/src/main/java/org/apache/ctakes/temporal/ae/feature/MultiTokenFeaturesExtractor.java>:[154,57]
[unchecked] unchecked conversion
[ERROR] required: Collection<? extends Feature>
[ERROR] found:    List
[ERROR] <https://builds.apache.org/job/ctakes-trunk-compiletest/ws/ctakes-temporal/src/main/java/org/apache/ctakes/temporal/ae/feature/MultiTokenFeaturesExtractor.java>:[156,53]
[unchecked] unchecked call to extractBetween(JCas,FOCUS_T,FOCUS_T) as a member of the raw
type CleartkExtractor
[ERROR] where FOCUS_T is a type-variable:
[ERROR] FOCUS_T extends Annotation declared in class CleartkExtractor
[ERROR] <https://builds.apache.org/job/ctakes-trunk-compiletest/ws/ctakes-temporal/src/main/java/org/apache/ctakes/temporal/ae/feature/MultiTokenFeaturesExtractor.java>:[156,53]
[unchecked] unchecked conversion
[ERROR] required: Collection<? extends Feature>
[ERROR] found:    List
[ERROR] <https://builds.apache.org/job/ctakes-trunk-compiletest/ws/ctakes-temporal/src/main/java/org/apache/ctakes/temporal/ae/feature/MultiTokenFeaturesExtractor.java>:[157,47]
[unchecked] unchecked conversion
[ERROR] required: Collection<? extends Feature>
[ERROR] found:    List
[ERROR] <https://builds.apache.org/job/ctakes-trunk-compiletest/ws/ctakes-temporal/src/main/java/org/apache/ctakes/temporal/ae/feature/MultiTokenFeaturesExtractor.java>:[161,57]
[unchecked] unchecked call to extract(JCas,T) as a member of the raw type FeatureExtractor1
[ERROR] where T is a type-variable:
[ERROR] T extends Annotation declared in interface FeatureExtractor1
[ERROR] <https://builds.apache.org/job/ctakes-trunk-compiletest/ws/ctakes-temporal/src/main/java/org/apache/ctakes/temporal/ae/feature/MultiTokenFeaturesExtractor.java>:[161,57]
[unchecked] unchecked conversion
[ERROR] required: Collection<? extends Feature>
[ERROR] found:    List
[ERROR] <https://builds.apache.org/job/ctakes-trunk-compiletest/ws/ctakes-temporal/src/main/java/org/apache/ctakes/temporal/ae/CRFTimeAnnotator.java>:[148,8]
[unchecked] unchecked call to TypePathExtractor(Class<T>,String) as a member of the
raw type TypePathExtractor
[ERROR] -> [Help 1]
[ERROR] 
[ERROR] To see the full stack trace of the errors, re-run Maven with the -e switch.
[ERROR] Re-run Maven using the -X switch to enable full debug logging.
[ERROR] 
[ERROR] For more information about the errors and possible solutions, please read the following
articles:
[ERROR] [Help 1] http://cwiki.apache.org/confluence/display/MAVEN/MojoFailureException
[ERROR] 
[ERROR] After correcting the problems, you can resume the build with the command
[ERROR]   mvn <goals> -rf :ctakes-temporal
Sending e-mails to: notifications@ctakes.apache.org clin@apache.org
channel stopped

Mime
View raw message