ctakes-notifications mailing list archives

Site index · List index
Message view « Date » · « Thread »
Top « Date » · « Thread »
From "ASF subversion and git services (JIRA)" <j...@apache.org>
Subject [jira] [Commented] (CTAKES-327) Make inner classes import explicit - if not, class names can be ambiguous and depend on compiler order.
Date Tue, 04 Nov 2014 16:57:34 GMT

    [ https://issues.apache.org/jira/browse/CTAKES-327?page=com.atlassian.jira.plugin.system.issuetabpanels:comment-tabpanel&focusedCommentId=14196353#comment-14196353
] 

ASF subversion and git services commented on CTAKES-327:
--------------------------------------------------------

Commit 1636645 from chenpei@apache.org in branch 'ctakes/trunk'
[ https://svn.apache.org/r1636645 ]

CTAKES-327 - Make inner classes import explicit - if not, class names can be ambiguous and
depend on compiler order.

> Make inner classes import explicit - if not, class names can be ambiguous and depend
on compiler order.
> -------------------------------------------------------------------------------------------------------
>
>                 Key: CTAKES-327
>                 URL: https://issues.apache.org/jira/browse/CTAKES-327
>             Project: cTAKES
>          Issue Type: Bug
>    Affects Versions: 3.2.0
>            Reporter: Pei Chen
>            Assignee: Pei Chen
>            Priority: Minor
>             Fix For: 3.2.1
>
>
> >>>>> [ERROR] COMPILATION ERROR :
> >>>>> [INFO] -------------------------------------------------------------
> >>>>> [ERROR] /Users/dima/Boston/Workspaces/cTakes/ctakes/ctakes-
> >>> temporal/src/main/java/org/apache/ctakes/temporal/eval/EvaluationOfTe
> >>> mporalRelations_ImplBase.java:[123,57] error: cannot find symbol
> >>>>> [ERROR]   symbol:   class JCasAnnotator_ImplBase
> >>>>> location: class EvaluationOfTemporalRelations_ImplBase
> >>>>> /Users/dima/Boston/Workspaces/cTakes/ctakes/ctakes-
> >>> 
> >> temporal/src/main/java/org/apache/ctakes/temporal/eval/EvaluationOfNEP
> >>> redicateEventSpans.java:[77,37] [deprecation]
> >>> createAnnotatorDescription(File) in NEPredicateEventAnnotator has been
> >>> deprecated
> >>>>> [ERROR] /Users/dima/Boston/Workspaces/cTakes/ctakes/ctakes-
> >>> 
> >> temporal/src/main/java/org/apache/ctakes/temporal/ae/DocTimeRelAnnot
> >>> ator.java:[117,8] [unchecked] unchecked call to
> >>> TypePathExtractor(Class<T>,String) as a member of the raw type
> >>> TypePathExtractor
> >>>>> [ERROR]   where T is a type-variable:
> >>>>>   T extends Annotation declared in class TypePathExtractor
> >>>>> /Users/dima/Boston/Workspaces/cTakes/ctakes/ctakes-
> >>> 
> >> temporal/src/main/java/org/apache/ctakes/temporal/ae/DocTimeRelAnnot
> >>> ator.java:[115,39] [unchecked] unchecked call to
> >>> CombinedExtractor1(FeatureExtractor1<T>,FeatureExtractor1<T>)
as a
> >>> member of the raw type CombinedExtractor1
> >>>>> [ERROR]   where T is a type-variable:
> >>>>>   T extends Annotation declared in class CombinedExtractor1
> >>>>> /Users/dima/Boston/Workspaces/cTakes/ctakes/ctakes-
> >>> 
> >> temporal/src/main/java/org/apache/ctakes/temporal/ae/DocTimeRelAnnot
> >>> ator.java:[118,28] [unchecked] unchecked call to
> >>> 
> >> CleartkExtractor(Class<SEARCH_T>,FeatureExtractor1<SEARCH_T>,Context...
> >>> ) as a member of the raw type CleartkExtractor
> >>>>> [ERROR]   where SEARCH_T is a type-variable:
> >>>>>   SEARCH_T extends Annotation declared in class CleartkExtractor
> >>>>> /Users/dima/Boston/Workspaces/cTakes/ctakes/ctakes-
> >>> 
> >> temporal/src/main/java/org/apache/ctakes/temporal/ae/DocTimeRelAnnot
> >>> ator.java:[144,62] [unchecked] unchecked call to extract(JCas,FOCUS_T) as
> >> a
> >>> member of the raw type CleartkExtractor
> >>>>> [ERROR]   where FOCUS_T is a type-variable:
> >>>>>   FOCUS_T extends Annotation declared in class CleartkExtractor
> >>>>> /Users/dima/Boston/Workspaces/cTakes/ctakes/ctakes-
> >>> 
> >> temporal/src/main/java/org/apache/ctakes/temporal/ae/DocTimeRelAnnot
> >>> ator.java:[144,62] [unchecked] unchecked conversion
> >>>>> [ERROR]   required: List<Feature>
> >>>>> found:    List
> >>>>> /Users/dima/Boston/Workspaces/cTakes/ctakes/ctakes-
> >>> 
> >> temporal/src/main/java/org/apache/ctakes/temporal/ae/feature/TimeXExtr
> >>> actor.java:[134,41] [unchecked] unchecked conversion
> >>>>> [ERROR]   required: Collection<? extends Feature>
> >>>>> found:    List
> >>>>> /Users/dima/Boston/Workspaces/cTakes/ctakes/ctakes-
> >>> 
> >> temporal/src/main/java/org/apache/ctakes/temporal/ae/ConstituencyBase
> >>> dTimeAnnotator.java:[188,26] [unchecked] unchecked call to
> >>> 
> >> CleartkExtractor(Class<SEARCH_T>,FeatureExtractor1<SEARCH_T>,Context...
> >>> ) as a member of the raw type CleartkExtractor
> >>>>> [ERROR]   where SEARCH_T is a type-variable:
> >>>>>   SEARCH_T extends Annotation declared in class CleartkExtractor
> >>>>> /Users/dima/Boston/Workspaces/cTakes/ctakes/ctakes-
> >>> 
> >> temporal/src/main/java/org/apache/ctakes/temporal/ae/ConstituencyBase
> >>> dTimeAnnotator.java:[190,24] [unchecked] unchecked call to
> >>> 
> >> CleartkExtractor(Class<SEARCH_T>,FeatureExtractor1<SEARCH_T>,Context...
> >>> ) as a member of the raw type CleartkExtractor
> >>>>> [ERROR]   where SEARCH_T is a type-variable:
> >>>>>   SEARCH_T extends Annotation declared in class CleartkExtractor
> >>>>> /Users/dima/Boston/Workspaces/cTakes/ctakes/ctakes-
> >>> 
> >> temporal/src/main/java/org/apache/ctakes/temporal/ae/ConstituencyBase
> >>> dTimeAnnotator.java:[235,47] [unchecked] unchecked call to
> >> extract(JCas,T)
> >>> as a member of the raw type FeatureExtractor1
> >>>>> [ERROR]   where T is a type-variable:
> >>>>>   T extends Annotation declared in interface FeatureExtractor1
> >>>>> /Users/dima/Boston/Workspaces/cTakes/ctakes/ctakes-
> >>> 
> >> temporal/src/main/java/org/apache/ctakes/temporal/ae/ConstituencyBase
> >>> dTimeAnnotator.java:[235,47] [unchecked] unchecked conversion
> >>>>> [ERROR]   required: Collection<? extends Feature>
> >>>>> found:    List
> >>>>> /Users/dima/Boston/Workspaces/cTakes/ctakes/ctakes-
> >>> 
> >> temporal/src/main/java/org/apache/ctakes/temporal/ae/ConstituencyBase
> >>> dTimeAnnotator.java:[251,39] [unchecked] unchecked call to
> >> extract(JCas,T)
> >>> as a member of the raw type FeatureExtractor1
> >>>>> [ERROR]   where T is a type-variable:
> >>>>>   T extends Annotation declared in interface FeatureExtractor1
> >>>>> /Users/dima/Boston/Workspaces/cTakes/ctakes/ctakes-
> >>> 
> >> temporal/src/main/java/org/apache/ctakes/temporal/ae/ConstituencyBase
> >>> dTimeAnnotator.java:[251,39] [unchecked] unchecked conversion
> >>>>> [ERROR]   required: Collection<? extends Feature>
> >>>>> found:    List
> >>>>> /Users/dima/Boston/Workspaces/cTakes/ctakes/ctakes-
> >>> 
> >> temporal/src/main/java/org/apache/ctakes/temporal/ae/BackwardsTimeAn
> >>> notator.java:[167,38] [unchecked] unchecked call to
> >>> 
> >> CleartkExtractor(Class<SEARCH_T>,FeatureExtractor1<SEARCH_T>,Context...
> >>> ) as a member of the raw type CleartkExtractor
> >>>>> [ERROR]   where SEARCH_T is a type-variable:
> >>>>>   SEARCH_T extends Annotation declared in class CleartkExtractor
> >>>>> /Users/dima/Boston/Workspaces/cTakes/ctakes/ctakes-
> >>> 
> >> temporal/src/main/java/org/apache/ctakes/temporal/ae/BackwardsTimeAn
> >>> notator.java:[205,43] [unchecked] unchecked call to extract(JCas,T) as a
> >>> member of the raw type FeatureExtractor1
> >>>>> [ERROR]   where T is a type-variable:
> >>>>>   T extends Annotation declared in interface FeatureExtractor1
> >>>>> /Users/dima/Boston/Workspaces/cTakes/ctakes/ctakes-
> >>> 
> >> temporal/src/main/java/org/apache/ctakes/temporal/ae/BackwardsTimeAn
> >>> notator.java:[205,43] [unchecked] unchecked conversion
> >>>>> [ERROR]   required: Collection<? extends Feature>
> >>>>> found:    List
> >>>>> /Users/dima/Boston/Workspaces/cTakes/ctakes/ctakes-
> >>> 
> >> temporal/src/main/java/org/apache/ctakes/temporal/ae/BackwardsTimeAn
> >>> notator.java:[209,49] [unchecked] unchecked call to
> >>> extractWithin(JCas,FOCUS_T,Annotation) as a member of the raw type
> >>> CleartkExtractor
> >>>>> [ERROR]   where FOCUS_T is a type-variable:
> >>>>>   FOCUS_T extends Annotation declared in class CleartkExtractor
> >>>>> /Users/dima/Boston/Workspaces/cTakes/ctakes/ctakes-
> >>> 
> >> temporal/src/main/java/org/apache/ctakes/temporal/ae/BackwardsTimeAn
> >>> notator.java:[209,49] [unchecked] unchecked conversion
> >>>>> [ERROR]   required: Collection<? extends Feature>
> >>>>> found:    List
> >>>>> /Users/dima/Boston/Workspaces/cTakes/ctakes/ctakes-
> >>> temporal/src/main/java/org/apache/ctakes/temporal/eval/EvaluationOfTe
> >>> mporalRelations_ImplBase.java:[128,4] error: method does not override or
> >>> implement a method from a supertype
> >>>>> [ERROR] /Users/dima/Boston/Workspaces/cTakes/ctakes/ctakes-
> >>> 
> >> temporal/src/main/java/org/apache/ctakes/temporal/eval/EvaluationOfEve
> >>> ntTimeRelations.java:[332,29] [deprecation]
> >>> createAnnotatorDescription(File) in EventTimeRelationAnnotator has been
> >>> deprecated
> >>>>> [ERROR] /Users/dima/Boston/Workspaces/cTakes/ctakes/ctakes-
> >>> 
> >> temporal/src/main/java/org/apache/ctakes/temporal/ae/TimeAnnotator.ja
> >>> va:[188,4] [unchecked] unchecked call to
> >> TypePathExtractor(Class<T>,String)
> >>> as a member of the raw type TypePathExtractor
> >>>>> [ERROR]   where T is a type-variable:
> >>>>>   T extends Annotation declared in class TypePathExtractor
> >>>>> /Users/dima/Boston/Workspaces/cTakes/ctakes/ctakes-
> >>> 
> >> temporal/src/main/java/org/apache/ctakes/temporal/ae/TimeAnnotator.ja
> >>> va:[184,37] [unchecked] unchecked call to
> >>> 
> >> CombinedExtractor1(FeatureExtractor1<T>,FeatureExtractor1<T>,FeatureEx
> >>> tractor1<T>,FeatureExtractor1<T>,FeatureExtractor1<T>)
as a member of
> >>> the raw type CombinedExtractor1
> >>>>> [ERROR]   where T is a type-variable:
> >>>>>   T extends Annotation declared in class CombinedExtractor1
> >>>>> /Users/dima/Boston/Workspaces/cTakes/ctakes/ctakes-
> >>> 
> >> temporal/src/main/java/org/apache/ctakes/temporal/ae/TimeAnnotator.ja
> >>> va:[198,36] [unchecked] unchecked call to
> >>> 
> >> CleartkExtractor(Class<SEARCH_T>,FeatureExtractor1<SEARCH_T>,Context...
> >>> ) as a member of the raw type CleartkExtractor
> >>>>> [ERROR]   where SEARCH_T is a type-variable:
> >>>>>   SEARCH_T extends Annotation declared in class CleartkExtractor
> >>>>> /Users/dima/Boston/Workspaces/cTakes/ctakes/ctakes-
> >>> 
> >> temporal/src/main/java/org/apache/ctakes/temporal/ae/TimeAnnotator.ja
> >>> va:[251,38] [unchecked] unchecked call to extract(JCas,T) as a member of
> >> the
> >>> raw type FeatureExtractor1
> >>>>> [ERROR]   where T is a type-variable:
> >>>>>   T extends Annotation declared in interface FeatureExtractor1
> >>>>> /Users/dima/Boston/Workspaces/cTakes/ctakes/ctakes-
> >>> 
> >> temporal/src/main/java/org/apache/ctakes/temporal/ae/TimeAnnotator.ja
> >>> va:[251,38] [unchecked] unchecked conversion
> >>>>> [ERROR]   required: Collection<? extends Feature>
> >>>>> found:    List
> >>>>> /Users/dima/Boston/Workspaces/cTakes/ctakes/ctakes-
> >>> 
> >> temporal/src/main/java/org/apache/ctakes/temporal/ae/TimeAnnotator.ja
> >>> va:[255,44] [unchecked] unchecked call to
> >>> extractWithin(JCas,FOCUS_T,Annotation) as a member of the raw type
> >>> CleartkExtractor
> >>>>> [ERROR]   where FOCUS_T is a type-variable:
> >>>>>   FOCUS_T extends Annotation declared in class CleartkExtractor
> >>>>> /Users/dima/Boston/Workspaces/cTakes/ctakes/ctakes-
> >>> 
> >> temporal/src/main/java/org/apache/ctakes/temporal/ae/TimeAnnotator.ja
> >>> va:[255,44] [unchecked] unchecked conversion
> >>>>> [ERROR]   required: Collection<? extends Feature>
> >>>>> found:    List
> >>>>> /Users/dima/Boston/Workspaces/cTakes/ctakes/ctakes-
> >>> temporal/src/main/java/org/apache/ctakes/temporal/eval/EvaluationOfTe
> >>> mporalRelations.java:[352,29] [deprecation]
> >>> createAnnotatorDescription(File) in EventTimeRelationAnnotator has been
> >>> deprecated
> >>>>> [ERROR] /Users/dima/Boston/Workspaces/cTakes/ctakes/ctakes-
> >>> temporal/src/main/java/org/apache/ctakes/temporal/eval/EvaluationOfTe
> >>> mporalRelations.java:[353,50] [deprecation]
> >>> createAnnotatorDescription(File) in EventEventRelationAnnotator has
> >> been
> >>> deprecated
> >>>>> [ERROR] /Users/dima/Boston/Workspaces/cTakes/ctakes/ctakes-
> >>> temporal/src/main/java/org/apache/ctakes/temporal/eval/EvaluationOfTe
> >>> mporalRelations.java:[354,50] [deprecation]
> >>> createAnnotatorDescription(File) in EventDischargeTimeAnnotator has
> >> been
> >>> deprecated
> >>>>> [ERROR] /Users/dima/Boston/Workspaces/cTakes/ctakes/ctakes-
> >>> temporal/src/main/java/org/apache/ctakes/temporal/eval/EvaluationOfTe
> >>> mporalRelations.java:[355,50] [deprecation]
> >>> createAnnotatorDescription(File) in EventAdmissionTimeAnnotator has
> >> been
> >>> deprecated
> >>>>> [ERROR] /Users/dima/Boston/Workspaces/cTakes/ctakes/ctakes-
> >>> 
> >> temporal/src/main/java/org/apache/ctakes/temporal/ae/ContextualModalit
> >>> yAnnotator.java:[94,8] [unchecked] unchecked call to
> >>> TypePathExtractor(Class<T>,String) as a member of the raw type
> >>> TypePathExtractor
> >>>>> [ERROR]   where T is a type-variable:
> >>>>>   T extends Annotation declared in class TypePathExtractor
> >>>>> /Users/dima/Boston/Workspaces/cTakes/ctakes/ctakes-
> >>> 
> >> temporal/src/main/java/org/apache/ctakes/temporal/ae/ContextualModalit
> >>> yAnnotator.java:[92,39] [unchecked] unchecked call to
> >>> CombinedExtractor1(FeatureExtractor1<T>,FeatureExtractor1<T>)
as a
> >>> member of the raw type CombinedExtractor1
> >>>>> [ERROR]   where T is a type-variable:
> >>>>>   T extends Annotation declared in class CombinedExtractor1
> >>>>> /Users/dima/Boston/Workspaces/cTakes/ctakes/ctakes-
> >>> 
> >> temporal/src/main/java/org/apache/ctakes/temporal/ae/ContextualModalit
> >>> yAnnotator.java:[96,28] [unchecked] unchecked call to
> >>> 
> >> CleartkExtractor(Class<SEARCH_T>,FeatureExtractor1<SEARCH_T>,Context...
> >>> ) as a member of the raw type CleartkExtractor
> >>>>> [ERROR]   where SEARCH_T is a type-variable:
> >>>>>   SEARCH_T extends Annotation declared in class CleartkExtractor
> >>>>> /Users/dima/Boston/Workspaces/cTakes/ctakes/ctakes-
> >>> 
> >> temporal/src/main/java/org/apache/ctakes/temporal/ae/ContextualModalit
> >>> yAnnotator.java:[109,62] [unchecked] unchecked call to
> >>> extract(JCas,FOCUS_T) as a member of the raw type CleartkExtractor
> >>>>> [ERROR]   where FOCUS_T is a type-variable:
> >>>>>   FOCUS_T extends Annotation declared in class CleartkExtractor
> >>>>> /Users/dima/Boston/Workspaces/cTakes/ctakes/ctakes-
> >>> 
> >> temporal/src/main/java/org/apache/ctakes/temporal/ae/ContextualModalit
> >>> yAnnotator.java:[109,62] [unchecked] unchecked conversion
> >>>>> [ERROR]   required: List<Feature>
> >>>>> found:    List
> >>>>> /Users/dima/Boston/Workspaces/cTakes/ctakes/ctakes-
> >>> 
> >> temporal/src/main/java/org/apache/ctakes/temporal/eval/EvaluationOfEve
> >>> ntEventRelations.java:[84,46] error: no suitable method found for
> >>> createEngineDescription(Class<RemoveNonContainsRelations>)
> >>>>> [ERROR] Object...) is not applicable
> >>>>>     (actual argument Class<RemoveNonContainsRelations> cannot
be
> >>> converted to Class<? extends AnalysisComponent> by method invocation
> >>> conversion)
> >>>>>   method AnalysisEngineFactory.createEngineDescription(Class<?
> >>> extends
> >>> AnalysisComponent>,TypeSystemDescription,TypePriorities,Object...) is
> >> not
> >>> applicable
> >>>>>     (actual argument Class<RemoveNonContainsRelations> cannot
be
> >>> converted to Class<? extends AnalysisComponent> by method invocation
> >>> conversion)
> >>>>>   method AnalysisEngineFactory.createEngineDescription(Class<?
> >>> extends AnalysisComponent>,Object...) is not applicable
> >>>>>     (actual argument Class<RemoveNonContainsRelations> cannot
be
> >>> converted to Class<? extends AnalysisComponent> by method invocation
> >>> conversion)
> >>>>>   method AnalysisEngineFactory.createEngineDescription(Class<?
> >>> extends AnalysisComponent>,TypeSystemDescription,Object...) is not
> >>> applicable
> >>>>>     (actual argument Class<RemoveNonContainsRelations> cannot
be
> >>> converted to Class<? extends AnalysisComponent> by method invocation
> >>> conversion)
> >>>>>   method
> >> AnalysisEngineFactory.createEngineDescription(String,Object...)
> >>> is not applicable
> >>>>>     (actual argument Class<RemoveNonContainsRelations> cannot
be
> >>> converted to String by method invocation conversion)
> >>>>> /Users/dima/Boston/Workspaces/cTakes/ctakes/ctakes-
> >>> 
> >> temporal/src/main/java/org/apache/ctakes/temporal/eval/EvaluationOfEve
> >>> ntEventRelations.java:[116,29] error: no suitable method found for
> >>> createEngineDescription(Class<RemoveNonContainsRelations>)
> >>>>> [ERROR] Object...) is not applicable
> >>>>>     (actual argument Class<RemoveNonContainsRelations> cannot
be
> >>> converted to Class<? extends AnalysisComponent> by method invocation
> >>> conversion)
> >>>>>   method AnalysisEngineFactory.createEngineDescription(Class<?
> >>> extends
> >>> AnalysisComponent>,TypeSystemDescription,TypePriorities,Object...) is
> >> not
> >>> applicable
> >>>>>     (actual argument Class<RemoveNonContainsRelations> cannot
be
> >>> converted to Class<? extends AnalysisComponent> by method invocation
> >>> conversion)
> >>>>>   method AnalysisEngineFactory.createEngineDescription(Class<?
> >>> extends AnalysisComponent>,Object...) is not applicable
> >>>>>     (actual argument Class<RemoveNonContainsRelations> cannot
be
> >>> converted to Class<? extends AnalysisComponent> by method invocation
> >>> conversion)
> >>>>>   method AnalysisEngineFactory.createEngineDescription(Class<?
> >>> extends AnalysisComponent>,TypeSystemDescription,Object...) is not
> >>> applicable
> >>>>>     (actual argument Class<RemoveNonContainsRelations> cannot
be
> >>> converted to Class<? extends AnalysisComponent> by method invocation
> >>> conversion)
> >>>>>   method
> >> AnalysisEngineFactory.createEngineDescription(String,Object...)
> >>> is not applicable
> >>>>>     (actual argument Class<RemoveNonContainsRelations> cannot
be
> >>> converted to String by method invocation conversion)
> >>>>> /Users/dima/Boston/Workspaces/cTakes/ctakes/ctakes-
> >>> 
> >> temporal/src/main/java/org/apache/ctakes/temporal/eval/EvaluationOfEve
> >>> ntEventRelations.java:[139,35] [deprecation]
> >>> createAnnotatorDescription(File) in EventEventRelationAnnotator has
> >> been
> >>> deprecated
> >>>>> [ERROR] /Users/dima/Boston/Workspaces/cTakes/ctakes/ctakes-
> >>> 
> >> temporal/src/main/java/org/apache/ctakes/temporal/ae/MetaTimeAnnotat
> >>> or.java:[75,38] [deprecation] createEnsembleDescription(File,String) in
> >>> BackwardsTimeAnnotator has been deprecated
> >>>>> [ERROR] /Users/dima/Boston/Workspaces/cTakes/ctakes/ctakes-
> >>> 
> >> temporal/src/main/java/org/apache/ctakes/temporal/ae/MetaTimeAnnotat
> >>> or.java:[78,46] [deprecation] createEnsembleDescription(File,String) in
> >>> ConstituencyBasedTimeAnnotator has been deprecated
> >>>>> [ERROR] /Users/dima/Boston/Workspaces/cTakes/ctakes/ctakes-
> >>> 
> >> temporal/src/main/java/org/apache/ctakes/temporal/ae/MetaTimeAnnotat
> >>> or.java:[81,32] [deprecation] createEnsembleDescription(File,String) in
> >>> CRFTimeAnnotator has been deprecated
> >>>>> [ERROR] /Users/dima/Boston/Workspaces/cTakes/ctakes/ctakes-
> >>> 
> >> temporal/src/main/java/org/apache/ctakes/temporal/ae/MetaTimeAnnotat
> >>> or.java:[104,38] [deprecation] createEnsembleDescription(File,String) in
> >>> BackwardsTimeAnnotator has been deprecated
> >>>>> [ERROR] /Users/dima/Boston/Workspaces/cTakes/ctakes/ctakes-
> >>> 
> >> temporal/src/main/java/org/apache/ctakes/temporal/ae/MetaTimeAnnotat
> >>> or.java:[107,46] [deprecation] createEnsembleDescription(File,String) in
> >>> ConstituencyBasedTimeAnnotator has been deprecated
> >>>>> [ERROR] /Users/dima/Boston/Workspaces/cTakes/ctakes/ctakes-
> >>> 
> >> temporal/src/main/java/org/apache/ctakes/temporal/ae/MetaTimeAnnotat
> >>> or.java:[110,32] [deprecation] createEnsembleDescription(File,String) in
> >>> CRFTimeAnnotator has been deprecated
> >>>>> [ERROR] /Users/dima/Boston/Workspaces/cTakes/ctakes/ctakes-
> >>> 
> >> temporal/src/main/java/org/apache/ctakes/temporal/ae/EventAnnotator.ja
> >>> va:[203,8] [unchecked] unchecked call to
> >> TypePathExtractor(Class<T>,String)
> >>> as a member of the raw type TypePathExtractor
> >>>>> [ERROR]   where T is a type-variable:
> >>>>>   T extends Annotation declared in class TypePathExtractor
> >>>>> /Users/dima/Boston/Workspaces/cTakes/ctakes/ctakes-
> >>> 
> >> temporal/src/main/java/org/apache/ctakes/temporal/ae/EventAnnotator.ja
> >>> va:[200,33] [unchecked] unchecked call to
> >>> 
> >> CombinedExtractor1(FeatureExtractor1<T>,FeatureExtractor1<T>,FeatureEx
> >>> tractor1<T>) as a member of the raw type CombinedExtractor1
> >>>>> [ERROR]   where T is a type-variable:
> >>>>>   T extends Annotation declared in class CombinedExtractor1
> >>>>> /Users/dima/Boston/Workspaces/cTakes/ctakes/ctakes-
> >>> 
> >> temporal/src/main/java/org/apache/ctakes/temporal/ae/EventAnnotator.ja
> >>> va:[204,35] [unchecked] unchecked call to
> >>> 
> >> CleartkExtractor(Class<SEARCH_T>,FeatureExtractor1<SEARCH_T>,Context...
> >>> ) as a member of the raw type CleartkExtractor
> >>>>> [ERROR]   where SEARCH_T is a type-variable:
> >>>>>   SEARCH_T extends Annotation declared in class CleartkExtractor
> >>>>> /Users/dima/Boston/Workspaces/cTakes/ctakes/ctakes-
> >>> 
> >> temporal/src/main/java/org/apache/ctakes/temporal/ae/EventAnnotator.ja
> >>> va:[317,58] [unchecked] unchecked call to extract(JCas,T) as a member of
> >> the
> >>> raw type FeatureExtractor1
> >>>>> [ERROR]   where T is a type-variable:
> >>>>>   T extends Annotation declared in interface FeatureExtractor1
> >>>>> /Users/dima/Boston/Workspaces/cTakes/ctakes/ctakes-
> >>> 
> >> temporal/src/main/java/org/apache/ctakes/temporal/ae/EventAnnotator.ja
> >>> va:[317,58] [unchecked] unchecked conversion
> >>>>> [ERROR]   required: Collection<? extends Feature>
> >>>>> found:    List
> >>>>> /Users/dima/Boston/Workspaces/cTakes/ctakes/ctakes-
> >>> 
> >> temporal/src/main/java/org/apache/ctakes/temporal/ae/EventAnnotator.ja
> >>> va:[320,66] [unchecked] unchecked call to
> >>> extractWithin(JCas,FOCUS_T,Annotation) as a member of the raw type
> >>> CleartkExtractor
> >>>>> [ERROR]   where FOCUS_T is a type-variable:
> >>>>>   FOCUS_T extends Annotation declared in class CleartkExtractor
> >>>>> /Users/dima/Boston/Workspaces/cTakes/ctakes/ctakes-
> >>> 
> >> temporal/src/main/java/org/apache/ctakes/temporal/ae/EventAnnotator.ja
> >>> va:[320,66] [unchecked] unchecked conversion
> >>>>> [ERROR]   required: Collection<? extends Feature>
> >>>>> found:    List
> >>>>> /Users/dima/Boston/Workspaces/cTakes/ctakes/ctakes-
> >>> 
> >> temporal/src/main/java/org/apache/ctakes/temporal/ae/EventAdmissionTi
> >>> meAnnotator.java:[124,4] [unchecked] unchecked call to
> >>> TypePathExtractor(Class<T>,String) as a member of the raw type
> >>> TypePathExtractor
> >>>>> [ERROR]   where T is a type-variable:
> >>>>>   T extends Annotation declared in class TypePathExtractor
> >>>>> /Users/dima/Boston/Workspaces/cTakes/ctakes/ctakes-
> >>> 
> >> temporal/src/main/java/org/apache/ctakes/temporal/ae/EventAdmissionTi
> >>> meAnnotator.java:[122,37] [unchecked] unchecked call to
> >>> CombinedExtractor1(FeatureExtractor1<T>,FeatureExtractor1<T>)
as a
> >>> member of the raw type CombinedExtractor1
> >>>>> [ERROR]   where T is a type-variable:
> >>>>>   T extends Annotation declared in class CombinedExtractor1
> >>>>> /Users/dima/Boston/Workspaces/cTakes/ctakes/ctakes-
> >>> 
> >> temporal/src/main/java/org/apache/ctakes/temporal/ae/EventAdmissionTi
> >>> meAnnotator.java:[125,26] [unchecked] unchecked call to
> >>> 
> >> CleartkExtractor(Class<SEARCH_T>,FeatureExtractor1<SEARCH_T>,Context...
> >>> ) as a member of the raw type CleartkExtractor
> >>>>> [ERROR]   where SEARCH_T is a type-variable:
> >>>>>   SEARCH_T extends Annotation declared in class CleartkExtractor
> >>>>> /Users/dima/Boston/Workspaces/cTakes/ctakes/ctakes-
> >>> 
> >> temporal/src/main/java/org/apache/ctakes/temporal/ae/EventAdmissionTi
> >>> meAnnotator.java:[179,59] [unchecked] unchecked call to
> >>> extract(JCas,FOCUS_T) as a member of the raw type CleartkExtractor
> >>>>> [ERROR]   where FOCUS_T is a type-variable:
> >>>>>   FOCUS_T extends Annotation declared in class CleartkExtractor
> >>>>> /Users/dima/Boston/Workspaces/cTakes/ctakes/ctakes-
> >>> 
> >> temporal/src/main/java/org/apache/ctakes/temporal/ae/EventAdmissionTi
> >>> meAnnotator.java:[179,59] [unchecked] unchecked conversion
> >>>>> [ERROR]   required: List<Feature>
> >>>>> found:    List
> >>>>> /Users/dima/Boston/Workspaces/cTakes/ctakes/ctakes-
> >>> 
> >> temporal/src/main/java/org/apache/ctakes/temporal/ae/CRFTimeAnnotato
> >>> r.java:[148,8] [unchecked] unchecked call to
> >>> TypePathExtractor(Class<T>,String) as a member of the raw type
> >>> TypePathExtractor
> >>>>> [ERROR]   where T is a type-variable:
> >>>>>   T extends Annotation declared in class TypePathExtractor
> >>>>> /Users/dima/Boston/Workspaces/cTakes/ctakes/ctakes-
> >>> 
> >> temporal/src/main/java/org/apache/ctakes/temporal/ae/CRFTimeAnnotato
> >>> r.java:[144,39] [unchecked] unchecked call to
> >>> 
> >> CombinedExtractor1(FeatureExtractor1<T>,FeatureExtractor1<T>,FeatureEx
> >>> tractor1<T>) as a member of the raw type CombinedExtractor1
> >>>>> [ERROR]   where T is a type-variable:
> >>>>>   T extends Annotation declared in class CombinedExtractor1
> >>>>> /Users/dima/Boston/Workspaces/cTakes/ctakes/ctakes-
> >>> 
> >> temporal/src/main/java/org/apache/ctakes/temporal/ae/CRFTimeAnnotato
> >>> r.java:[158,38] [unchecked] unchecked call to
> >>> 
> >> CleartkExtractor(Class<SEARCH_T>,FeatureExtractor1<SEARCH_T>,Context...
> >>> ) as a member of the raw type CleartkExtractor
> >>>>> [ERROR]   where SEARCH_T is a type-variable:
> >>>>>   SEARCH_T extends Annotation declared in class CleartkExtractor
> >>>>> /Users/dima/Boston/Workspaces/cTakes/ctakes/ctakes-
> >>> 
> >> temporal/src/main/java/org/apache/ctakes/temporal/ae/CRFTimeAnnotato
> >>> r.java:[195,43] [unchecked] unchecked call to extract(JCas,T) as a member
> >> of
> >>> the raw type FeatureExtractor1
> >>>>> [ERROR]   where T is a type-variable:
> >>>>>   T extends Annotation declared in interface FeatureExtractor1
> >>>>> /Users/dima/Boston/Workspaces/cTakes/ctakes/ctakes-
> >>> 
> >> temporal/src/main/java/org/apache/ctakes/temporal/ae/CRFTimeAnnotato
> >>> r.java:[195,43] [unchecked] unchecked conversion
> >>>>> [ERROR]   required: Collection<? extends Feature>
> >>>>> found:    List
> >>>>> /Users/dima/Boston/Workspaces/cTakes/ctakes/ctakes-
> >>> 
> >> temporal/src/main/java/org/apache/ctakes/temporal/ae/CRFTimeAnnotato
> >>> r.java:[199,49] [unchecked] unchecked call to
> >>> extractWithin(JCas,FOCUS_T,Annotation) as a member of the raw type
> >>> CleartkExtractor
> >>>>> [ERROR]   where FOCUS_T is a type-variable:
> >>>>>   FOCUS_T extends Annotation declared in class CleartkExtractor
> >>>>> /Users/dima/Boston/Workspaces/cTakes/ctakes/ctakes-
> >>> 
> >> temporal/src/main/java/org/apache/ctakes/temporal/ae/CRFTimeAnnotato
> >>> r.java:[199,49] [unchecked] unchecked conversion
> >>>>> [ERROR]   required: Collection<? extends Feature>
> >>>>> found:    List
> >>>>> /Users/dima/Boston/Workspaces/cTakes/ctakes/ctakes-
> >>> 
> >> temporal/src/main/java/org/apache/ctakes/temporal/ae/EventDischargeTi
> >>> meAnnotator.java:[123,4] [unchecked] unchecked call to
> >>> TypePathExtractor(Class<T>,String) as a member of the raw type
> >>> TypePathExtractor
> >>>>> [ERROR]   where T is a type-variable:
> >>>>>   T extends Annotation declared in class TypePathExtractor
> >>>>> /Users/dima/Boston/Workspaces/cTakes/ctakes/ctakes-
> >>> 
> >> temporal/src/main/java/org/apache/ctakes/temporal/ae/EventDischargeTi
> >>> meAnnotator.java:[121,37] [unchecked] unchecked call to
> >>> CombinedExtractor1(FeatureExtractor1<T>,FeatureExtractor1<T>)
as a
> >>> member of the raw type CombinedExtractor1
> >>>>> [ERROR]   where T is a type-variable:
> >>>>>   T extends Annotation declared in class CombinedExtractor1
> >>>>> /Users/dima/Boston/Workspaces/cTakes/ctakes/ctakes-
> >>> 
> >> temporal/src/main/java/org/apache/ctakes/temporal/ae/EventDischargeTi
> >>> meAnnotator.java:[124,26] [unchecked] unchecked call to
> >>> 
> >> CleartkExtractor(Class<SEARCH_T>,FeatureExtractor1<SEARCH_T>,Context...
> >>> ) as a member of the raw type CleartkExtractor
> >>>>> [ERROR]   where SEARCH_T is a type-variable:
> >>>>>   SEARCH_T extends Annotation declared in class CleartkExtractor
> >>>>> /Users/dima/Boston/Workspaces/cTakes/ctakes/ctakes-
> >>> 
> >> temporal/src/main/java/org/apache/ctakes/temporal/ae/EventDischargeTi
> >>> meAnnotator.java:[178,59] [unchecked] unchecked call to
> >>> extract(JCas,FOCUS_T) as a member of the raw type CleartkExtractor
> >>>>> [ERROR]   where FOCUS_T is a type-variable:
> >>>>>   FOCUS_T extends Annotation declared in class CleartkExtractor
> >>>>> /Users/dima/Boston/Workspaces/cTakes/ctakes/ctakes-
> >>> 
> >> temporal/src/main/java/org/apache/ctakes/temporal/ae/EventDischargeTi
> >>> meAnnotator.java:[178,59] [unchecked] unchecked conversion
> >>>>> [ERROR]   required: List<Feature>
> >>>>> found:    List
> >>>>> /Users/dima/Boston/Workspaces/cTakes/ctakes/ctakes-
> >>> 
> >> temporal/src/main/java/org/apache/ctakes/temporal/eval/EvaluationOfTim
> >>> eSpans.java:[288,23] [deprecation] createAnnotatorDescription(File) in
> >>> TimeAnnotator has been deprecated
> >>>>> [INFO] 71 errors
> >>>>> [INFO] -------------------------------------------------------------
> >>>>> [INFO] ------------------------------------------------------------------------
> >>>>> [INFO] Reactor Summary:
> >>>>> [INFO]
> >>>>> [INFO] Apache cTAKES ..................................... SUCCESS
[0.709s]
> >>>>> [INFO] Apache cTAKES common type system .................. SUCCESS
> >>> [4.050s]
> >>>>> [INFO] Apache cTAKES utils ............................... SUCCESS
[1.006s]
> >>>>> [INFO] Apache cTAKES Resources core ...................... SUCCESS
[0.050s]
> >>>>> [INFO] Apache cTAKES core ................................ SUCCESS
[2.218s]
> >>>>> [INFO] Apache cTAKES Resources pos-tagger ................ SUCCESS
> >> [0.048s]
> >>>>> [INFO] Apache cTAKES part-of-speech tagger ............... SUCCESS
> >> [0.456s]
> >>>>> [INFO] Apache cTAKES Resources ctakes-chunker-res ........ SUCCESS
> >>> [0.059s]
> >>>>> [INFO] Apache cTAKES chunker ............................. SUCCESS
[0.492s]
> >>>>> [INFO] Apache cTAKES document preprocessor ............... SUCCESS
> >>> [0.526s]
> >>>>> [INFO] Apache cTAKES Resources dictionary-lookup ......... SUCCESS
> >>> [5.973s]
> >>>>> [INFO] Apache cTAKES dictionary lookup ................... SUCCESS
[0.593s]
> >>>>> [INFO] Apache cTAKES context dependent tokenizer ......... SUCCESS
> >>> [0.250s]
> >>>>> [INFO] Apache cTAKES Resources lvg ....................... SUCCESS
[0.056s]
> >>>>> [INFO] Apache cTAKES LVG lexical tools ................... SUCCESS
[0.347s]
> >>>>> [INFO] Apache cTAKES Resources ne-contexts ............... SUCCESS
> >> [0.037s]
> >>>>> [INFO] Apache cTAKES named entity contexts ............... SUCCESS
> >> [0.322s]
> >>>>> [INFO] Apache cTAKES Resources constituency-parser ....... SUCCESS
> >>> [0.146s]
> >>>>> [INFO] Apache cTAKES Constituency Parser ................. SUCCESS
> >> [0.347s]
> >>>>> [INFO] Apache cTAKES Resources coreference ............... SUCCESS
> >>> [0.089s]
> >>>>> [INFO] Apache cTAKES Resources relation-extractor ........ SUCCESS
> >>> [0.021s]
> >>>>> [INFO] Apache cTAKES Resources dependency-parser ......... SUCCESS
> >>> [0.527s]
> >>>>> [INFO] Apache cTAKES Dependency Parser ................... SUCCESS
> >> [0.470s]
> >>>>> [INFO] Apache cTAKES Relation Extractor .................. SUCCESS
[1.051s]
> >>>>> [INFO] Apache cTAKES CoReference Resolver ................ SUCCESS
> >> [0.981s]
> >>>>> [INFO] Apache cTAKES Resources drug-ner .................. SUCCESS
> >> [0.095s]
> >>>>> [INFO] Apache cTAKES Drug NER ............................ SUCCESS
[1.218s]
> >>>>> [INFO] Apache cTAKES Resources side-effect ............... SUCCESS
> >> [0.089s]
> >>>>> [INFO] Apache cTAKES Side Effects ........................ SUCCESS
[2.055s]
> >>>>> [INFO] Apache cTAKES Resources smoking-status ............ SUCCESS
> >>> [0.099s]
> >>>>> [INFO] Apache cTAKES Smoking Status ...................... SUCCESS
[1.868s]
> >>>>> [INFO] Apache cTAKES Resources assertion ................. SUCCESS
> >> [0.201s]
> >>>>> [INFO] Apache cTAKES Resources assertion-zoner ........... SUCCESS
> >>> [0.104s]
> >>>>> [INFO] Apache cTAKES Assertion's zoner ................... SUCCESS
[0.423s]
> >>>>> [INFO] Apache cTAKES Assertion ........................... SUCCESS
[1.396s]
> >>>>> [INFO] Apache cTAKES Resources temporal .................. SUCCESS
> >> [0.033s]
> >>>>> [INFO] Apache cTAKES Resources ctakes-ytex-res ........... SUCCESS
> >>> [0.057s]
> >>>>> [INFO] Apache cTAKES YTEX ................................ SUCCESS
[5.052s]
> >>>>> [INFO] Apache cTAKES YTEX UIMA ........................... SUCCESS
[2.151s]
> >>>>> [INFO] Apache cTAKES ctakes-clinical-pipeline ............ SUCCESS
[0.782s]
> >>>>> [INFO] Apache cTAKES Temporal Information Extraction ..... FAILURE
> >>> [4.727s]
> >>>>> [INFO] Apache cTAKES YTEX Web ............................ SKIPPED
> >>>>> [INFO] Apache cTAKES Distribution ........................ SKIPPED
> >>>>> [INFO] Apache cTAKES Regression-test ..................... SKIPPED
> >>>>> [INFO] Apache cTAKES template filler ..................... SKIPPED
> >>>>> [INFO] ctakes-examples ................................... SKIPPED
> >>>>> [INFO] Apache cTAKES Resources dictionary-lookup-fast-res  SKIPPED
> >>>>> [INFO] Apache cTAKES dictionary lookup fast .............. SKIPPED
> >>>>> [INFO] ------------------------------------------------------------------------
> >>>>> [INFO] BUILD FAILURE
> >>>>> [INFO] ------------------------------------------------------------------------
> >>>>> [INFO] Total time: 42.370s
> >>>>> [INFO] Finished at: Mon Oct 13 10:42:35 CDT 2014
> >>>>> [INFO] Final Memory: 101M/1444M
> >>>>> [INFO] ------------------------------------------------------------------------



--
This message was sent by Atlassian JIRA
(v6.3.4#6332)

Mime
View raw message