ctakes-notifications mailing list archives

Site index · List index
Message view « Date » · « Thread »
Top « Date » · « Thread »
From Apache Jenkins Server <jenk...@builds.apache.org>
Subject Build failed in Jenkins: ctakes-trunk-compiletest » Apache cTAKES core #599
Date Thu, 13 Nov 2014 22:28:13 GMT
See <https://builds.apache.org/job/ctakes-trunk-compiletest/org.apache.ctakes$ctakes-core/599/>

------------------------------------------
[INFO]                                                                         
[INFO] ------------------------------------------------------------------------
[INFO] Building Apache cTAKES core 3.2.1-SNAPSHOT
[INFO] ------------------------------------------------------------------------
[WARNING] The POM for jwnl:jwnl:jar:1.3.3 is invalid, transitive dependencies (if any) will
not be available, enable debug logging for more details
[INFO] 
[INFO] --- maven-clean-plugin:2.4.1:clean (default-clean) @ ctakes-core ---
[INFO] 
[INFO] --- maven-remote-resources-plugin:1.4:process (default) @ ctakes-core ---
[WARNING] Invalid POM for jwnl:jwnl:jar:1.3.3, transitive dependencies (if any) will not be
available, enable debug logging for more details
Downloading: http://repo.maven.apache.org/maven2/jwnl/jwnl/1.3.3/jwnl-1.3.3.pom
[INFO] 
[INFO] --- maven-resources-plugin:2.5:resources (default-resources) @ ctakes-core ---
[debug] execute contextualize
[INFO] Using 'UTF-8' encoding to copy filtered resources.
[INFO] skip non existing resourceDirectory <https://builds.apache.org/job/ctakes-trunk-compiletest/org.apache.ctakes$ctakes-core/ws/src/main/resources>
[INFO] Copying 3 resources
[INFO] 
[INFO] --- maven-compiler-plugin:2.4:compile (default-compile) @ ctakes-core ---
[INFO] Compiling 143 source files to <https://builds.apache.org/job/ctakes-trunk-compiletest/org.apache.ctakes$ctakes-core/ws/target/classes>
[INFO] -------------------------------------------------------------
[ERROR] COMPILATION ERROR : 
[INFO] -------------------------------------------------------------
[ERROR] error: error reading /home/jenkins/jenkins-slave/maven-repositories/1/jwnl/jwnl/1.3.3/jwnl-1.3.3.jar;
error in opening zip file
[INFO] 1 error
[INFO] -------------------------------------------------------------
[JENKINS] Archiving disabled

Mime
View raw message