ctakes-notifications mailing list archives

Site index · List index
Message view « Date » · « Thread »
Top « Date » · « Thread »
From Apache Jenkins Server <jenk...@builds.apache.org>
Subject Build failed in Jenkins: ctakes-trunk-compiletest #601
Date Fri, 14 Nov 2014 16:47:31 GMT
See <https://builds.apache.org/job/ctakes-trunk-compiletest/601/>

------------------------------------------
[...truncated 6978 lines...]
[JENKINS] Archiving disabled
[INFO]                                                                         
[INFO] ------------------------------------------------------------------------
[INFO] Building Apache cTAKES Resources dictionary-lookup-fast-res 3.2.1-SNAPSHOT
[INFO] ------------------------------------------------------------------------
[INFO] 
[INFO] --- maven-clean-plugin:2.4.1:clean (default-clean) @ ctakes-dictionary-lookup-fast-res
---
[INFO] 
[INFO] --- maven-remote-resources-plugin:1.4:process (default) @ ctakes-dictionary-lookup-fast-res
---
[INFO] 
[INFO] --- maven-resources-plugin:2.5:resources (default-resources) @ ctakes-dictionary-lookup-fast-res
---
[debug] execute contextualize
[INFO] Using 'UTF-8' encoding to copy filtered resources.
[INFO] Copying 9 resources
[INFO] Copying 3 resources
[INFO] 
[INFO] --- maven-dependency-plugin:2.8:unpack-dependencies (unpack-dependencies-ide) @ ctakes-dictionary-lookup-fast-res
---
[INFO] Unpacking /home/jenkins/jenkins-slave/maven-repositories/1/net/sourceforge/ctakesresources/ctakes-resources-snomed-rword-hsqldb-2011ab/3.2.1.1/ctakes-resources-snomed-rword-hsqldb-2011ab-3.2.1.1.jar
to <https://builds.apache.org/job/ctakes-trunk-compiletest/ws/ctakes-dictionary-lookup-fast-res/../resources>
with includes "" and excludes ""
[INFO] 
[INFO] --- maven-compiler-plugin:2.4:compile (default-compile) @ ctakes-dictionary-lookup-fast-res
---
[INFO] No sources to compile
[INFO] 
[INFO] --- maven-remote-resources-plugin:1.4:process (default) @ ctakes-dictionary-lookup-fast-res
---
[INFO] 
[INFO] --- maven-resources-plugin:2.5:resources (default-resources) @ ctakes-dictionary-lookup-fast-res
---
[debug] execute contextualize
[INFO] Using 'UTF-8' encoding to copy filtered resources.
[INFO] Copying 9 resources
[INFO] Copying 3 resources
[INFO] Copying 3 resources
[INFO] 
[INFO] --- maven-dependency-plugin:2.8:unpack-dependencies (unpack-dependencies-ide) @ ctakes-dictionary-lookup-fast-res
---
[INFO] ctakes-resources-snomed-rword-hsqldb-2011ab-3.2.1.1.jar already exists in destination.
[INFO] 
[INFO] --- maven-compiler-plugin:2.4:compile (default-compile) @ ctakes-dictionary-lookup-fast-res
---
[INFO] No sources to compile
[INFO] 
[INFO] --- maven-resources-plugin:2.5:testResources (default-testResources) @ ctakes-dictionary-lookup-fast-res
---
[debug] execute contextualize
[INFO] Using 'UTF-8' encoding to copy filtered resources.
[INFO] skip non existing resourceDirectory <https://builds.apache.org/job/ctakes-trunk-compiletest/ws/ctakes-dictionary-lookup-fast-res/src/test/resources>
[INFO] Copying 3 resources
[INFO] Copying 3 resources
[INFO] 
[INFO] --- maven-compiler-plugin:2.4:testCompile (default-testCompile) @ ctakes-dictionary-lookup-fast-res
---
[INFO] No sources to compile
[INFO] 
[INFO] --- maven-surefire-plugin:2.12.1:test (default-test) @ ctakes-dictionary-lookup-fast-res
---
[INFO] Surefire report directory: <https://builds.apache.org/job/ctakes-trunk-compiletest/ws/ctakes-dictionary-lookup-fast-res/target/surefire-reports>

-------------------------------------------------------
 T E S T S
-------------------------------------------------------

Results :

Tests run: 0, Failures: 0, Errors: 0, Skipped: 0

[JENKINS] Recording test results
[JENKINS] Archiving disabled
[INFO]                                                                         
[INFO] ------------------------------------------------------------------------
[INFO] Building Apache cTAKES dictionary lookup fast 3.2.1-SNAPSHOT
[INFO] ------------------------------------------------------------------------
[INFO] 
[INFO] --- maven-clean-plugin:2.4.1:clean (default-clean) @ ctakes-dictionary-lookup-fast
---
[INFO] 
[INFO] --- maven-remote-resources-plugin:1.4:process (default) @ ctakes-dictionary-lookup-fast
---
Downloading: http://repo.maven.apache.org/maven2/jwnl/jwnl/1.3.3/jwnl-1.3.3.pom
[INFO] 
[INFO] --- maven-resources-plugin:2.5:resources (default-resources) @ ctakes-dictionary-lookup-fast
---
[debug] execute contextualize
[INFO] Using 'UTF-8' encoding to copy filtered resources.
[INFO] skip non existing resourceDirectory <https://builds.apache.org/job/ctakes-trunk-compiletest/ws/ctakes-dictionary-lookup-fast/src/main/resources>
[INFO] Copying 3 resources
[INFO] 
[INFO] --- maven-dependency-plugin:2.8:unpack-dependencies (unpack-dependencies) @ ctakes-dictionary-lookup-fast
---
[INFO] 
[INFO] --- maven-compiler-plugin:2.4:compile (default-compile) @ ctakes-dictionary-lookup-fast
---
[INFO] Compiling 53 source files to <https://builds.apache.org/job/ctakes-trunk-compiletest/ws/ctakes-dictionary-lookup-fast/target/classes>
[INFO] 
[INFO] --- maven-remote-resources-plugin:1.4:process (default) @ ctakes-dictionary-lookup-fast
---
Downloading: http://repo.maven.apache.org/maven2/jwnl/jwnl/1.3.3/jwnl-1.3.3.pom
[INFO] 
[INFO] --- maven-resources-plugin:2.5:resources (default-resources) @ ctakes-dictionary-lookup-fast
---
[debug] execute contextualize
[INFO] Using 'UTF-8' encoding to copy filtered resources.
[INFO] skip non existing resourceDirectory <https://builds.apache.org/job/ctakes-trunk-compiletest/ws/ctakes-dictionary-lookup-fast/src/main/resources>
[INFO] Copying 3 resources
[INFO] Copying 3 resources
[INFO] 
[INFO] --- maven-dependency-plugin:2.8:unpack-dependencies (unpack-dependencies) @ ctakes-dictionary-lookup-fast
---
[INFO] 
[INFO] --- maven-compiler-plugin:2.4:compile (default-compile) @ ctakes-dictionary-lookup-fast
---
[INFO] Compiling 3 source files to <https://builds.apache.org/job/ctakes-trunk-compiletest/ws/ctakes-dictionary-lookup-fast/target/classes>
[INFO] 
[INFO] --- maven-resources-plugin:2.5:testResources (default-testResources) @ ctakes-dictionary-lookup-fast
---
[debug] execute contextualize
[INFO] Using 'UTF-8' encoding to copy filtered resources.
[INFO] skip non existing resourceDirectory <https://builds.apache.org/job/ctakes-trunk-compiletest/ws/ctakes-dictionary-lookup-fast/src/test/resources>
[INFO] Copying 3 resources
[INFO] Copying 3 resources
[INFO] 
[INFO] --- maven-compiler-plugin:2.4:testCompile (default-testCompile) @ ctakes-dictionary-lookup-fast
---
[INFO] No sources to compile
[INFO] 
[INFO] --- maven-surefire-plugin:2.12.1:test (default-test) @ ctakes-dictionary-lookup-fast
---
[INFO] Surefire report directory: <https://builds.apache.org/job/ctakes-trunk-compiletest/ws/ctakes-dictionary-lookup-fast/target/surefire-reports>

-------------------------------------------------------
 T E S T S
-------------------------------------------------------

Results :

Tests run: 0, Failures: 0, Errors: 0, Skipped: 0

[JENKINS] Recording test results
[JENKINS] Archiving disabled
[INFO]                                                                         
[INFO] ------------------------------------------------------------------------
[INFO] Building Apache cTAKES ctakes-clinical-pipeline 3.2.1-SNAPSHOT
[INFO] ------------------------------------------------------------------------
[INFO] 
[INFO] --- maven-clean-plugin:2.4.1:clean (default-clean) @ ctakes-clinical-pipeline ---
[INFO] 
[INFO] --- maven-remote-resources-plugin:1.4:process (default) @ ctakes-clinical-pipeline
---
Downloading: http://repo.maven.apache.org/maven2/jwnl/jwnl/1.3.3/jwnl-1.3.3.pom
[JENKINS] Archiving disabled
[INFO] ------------------------------------------------------------------------
[INFO] Reactor Summary:
[INFO] 
[INFO] Apache cTAKES ..................................... SUCCESS [5.838s]
[INFO] Apache cTAKES common type system .................. SUCCESS [15.567s]
[INFO] Apache cTAKES utils ............................... SUCCESS [9.123s]
[INFO] Apache cTAKES Resources core ...................... SUCCESS [1.222s]
[INFO] Apache cTAKES core ................................ SUCCESS [54.548s]
[INFO] Apache cTAKES Resources pos-tagger ................ SUCCESS [1.258s]
[INFO] Apache cTAKES part-of-speech tagger ............... SUCCESS [9.279s]
[INFO] Apache cTAKES Resources ctakes-chunker-res ........ SUCCESS [1.275s]
[INFO] Apache cTAKES chunker ............................. SUCCESS [3.888s]
[INFO] Apache cTAKES document preprocessor ............... SUCCESS [6.477s]
[INFO] Apache cTAKES Resources dictionary-lookup ......... SUCCESS [17.948s]
[INFO] Apache cTAKES dictionary lookup ................... SUCCESS [3.885s]
[INFO] Apache cTAKES context dependent tokenizer ......... SUCCESS [3.685s]
[INFO] Apache cTAKES Resources lvg ....................... SUCCESS [5.265s]
[INFO] Apache cTAKES LVG lexical tools ................... SUCCESS [6.387s]
[INFO] Apache cTAKES Resources ne-contexts ............... SUCCESS [3.177s]
[INFO] Apache cTAKES named entity contexts ............... SUCCESS [8.285s]
[INFO] Apache cTAKES Resources constituency-parser ....... SUCCESS [5.890s]
[INFO] Apache cTAKES Constituency Parser ................. SUCCESS [6.102s]
[INFO] Apache cTAKES Resources coreference ............... SUCCESS [3.420s]
[INFO] Apache cTAKES Resources relation-extractor ........ SUCCESS [5.464s]
[INFO] Apache cTAKES Resources dependency-parser ......... SUCCESS [5.813s]
[INFO] Apache cTAKES Dependency Parser ................... SUCCESS [34.112s]
[INFO] Apache cTAKES Relation Extractor .................. SUCCESS [17.055s]
[INFO] Apache cTAKES CoReference Resolver ................ SUCCESS [6.423s]
[INFO] Apache cTAKES Resources drug-ner .................. SUCCESS [2.751s]
[INFO] Apache cTAKES Drug NER ............................ SUCCESS [5.959s]
[INFO] Apache cTAKES Resources side-effect ............... SUCCESS [2.925s]
[INFO] Apache cTAKES Side Effects ........................ SUCCESS [8.568s]
[INFO] Apache cTAKES Resources smoking-status ............ SUCCESS [5.091s]
[INFO] Apache cTAKES Smoking Status ...................... SUCCESS [8.923s]
[INFO] Apache cTAKES Resources assertion ................. SUCCESS [3.627s]
[INFO] Apache cTAKES Assertion ........................... SUCCESS [8.655s]
[INFO] Apache cTAKES Resources assertion-zoner ........... SUCCESS [2.579s]
[INFO] Apache cTAKES Assertion's zoner ................... SUCCESS [4.978s]
[INFO] Apache cTAKES Resources temporal .................. SUCCESS [2.693s]
[INFO] Apache cTAKES Resources ctakes-ytex-res ........... SUCCESS [2.799s]
[INFO] Apache cTAKES YTEX ................................ SUCCESS [11.559s]
[INFO] Apache cTAKES YTEX UIMA ........................... SUCCESS [11.166s]
[INFO] Apache cTAKES Resources dictionary-lookup-fast-res  SUCCESS [3.242s]
[INFO] Apache cTAKES dictionary lookup fast .............. SUCCESS [5.759s]
[INFO] Apache cTAKES ctakes-clinical-pipeline ............ FAILURE [2.534s]
[INFO] Apache cTAKES Temporal Information Extraction ..... SKIPPED
[INFO] Apache cTAKES YTEX Web ............................ SKIPPED
[INFO] Apache cTAKES Distribution ........................ SKIPPED
[INFO] Apache cTAKES Regression-test ..................... SKIPPED
[INFO] Apache cTAKES template filler ..................... SKIPPED
[INFO] ctakes-examples ................................... SKIPPED
[INFO] ------------------------------------------------------------------------
[INFO] BUILD FAILURE
[INFO] ------------------------------------------------------------------------
[INFO] Total time: 6:38.561s
[INFO] Finished at: Fri Nov 14 16:45:43 UTC 2014
[INFO] Final Memory: 77M/311M
[INFO] ------------------------------------------------------------------------
[JENKINS] Archiving disabled
[JENKINS] Archiving disabled
[JENKINS] Archiving disabled
[JENKINS] Archiving disabled
[JENKINS] Archiving disabled
[JENKINS] Archiving disabled
[JENKINS] Archiving disabled
[JENKINS] Archiving disabled
[JENKINS] Archiving disabled
[JENKINS] Archiving disabled
[JENKINS] Archiving disabled
[JENKINS] Archiving disabled
[JENKINS] Archiving disabled
[JENKINS] Archiving disabled
[JENKINS] Archiving disabled
[JENKINS] Archiving disabled
[JENKINS] Archiving disabled
[JENKINS] Archiving disabled
[JENKINS] Archiving disabled
[JENKINS] Archiving disabled
[JENKINS] Archiving disabled
[JENKINS] Archiving disabled
[JENKINS] Archiving disabled
[JENKINS] Archiving disabled
[JENKINS] Archiving disabled
[JENKINS] Archiving disabled
[JENKINS] Archiving disabled
[JENKINS] Archiving disabled
[JENKINS] Archiving disabled
[JENKINS] Archiving disabled
[JENKINS] Archiving disabled
[JENKINS] Archiving disabled
[JENKINS] Archiving disabled
[JENKINS] Archiving disabled
[JENKINS] Archiving disabled
[JENKINS] Archiving disabled
[JENKINS] Archiving disabled
[JENKINS] Archiving disabled
[JENKINS] Archiving disabled
[JENKINS] Archiving disabled
[JENKINS] Archiving disabled
[JENKINS] Archiving disabled
[JENKINS] Archiving disabled
[JENKINS] Archiving disabled
[JENKINS] Archiving disabled
[JENKINS] Archiving disabled
[JENKINS] Archiving disabled
[JENKINS] Archiving disabled
Waiting for Jenkins to finish collecting data[ERROR] Failed to execute goal org.apache.maven.plugins:maven-remote-resources-plugin:1.4:process
(default) on project ctakes-clinical-pipeline: Error resolving project artifact: Could not
transfer artifact jwnl:jwnl:pom:1.3.3 from/to central (http://repo.maven.apache.org/maven2):
Failed to transfer file: http://repo.maven.apache.org/maven2/jwnl/jwnl/1.3.3/jwnl-1.3.3.pom.
Return code is: 503, ReasonPhrase: All backends failed or unhealthy. for project jwnl:jwnl:jar:1.3.3
-> [Help 1]
[ERROR] 
[ERROR] To see the full stack trace of the errors, re-run Maven with the -e switch.
[ERROR] Re-run Maven using the -X switch to enable full debug logging.
[ERROR] 
[ERROR] For more information about the errors and possible solutions, please read the following
articles:
[ERROR] [Help 1] http://cwiki.apache.org/confluence/display/MAVEN/MojoExecutionException
[ERROR] 
[ERROR] After correcting the problems, you can resume the build with the command
[ERROR]   mvn <goals> -rf :ctakes-clinical-pipeline

Sending e-mails to: notifications@ctakes.apache.org
Sending e-mails to: notifications@ctakes.apache.org
channel stopped

Mime
View raw message