ctakes-notifications mailing list archives

Site index · List index
Message view « Date » · « Thread »
Top « Date » · « Thread »
From Apache Jenkins Server <jenk...@builds.apache.org>
Subject Build failed in Jenkins: ctakes-trunk-compiletest » Apache cTAKES Assertion #552
Date Tue, 14 Oct 2014 21:30:13 GMT
See <https://builds.apache.org/job/ctakes-trunk-compiletest/org.apache.ctakes$ctakes-assertion/552/changes>

Changes:

[tmill] Cleanup uncertainty AE, static accessors to uncertainty analysis engine, use constants.

[tmill] Clean up generic types, and allow for learning curve building during training.

------------------------------------------
[...truncated 26 lines...]
[INFO] -------------------------------------------------------------
[ERROR] COMPILATION ERROR : 
[INFO] -------------------------------------------------------------
[ERROR] <https://builds.apache.org/job/ctakes-trunk-compiletest/org.apache.ctakes$ctakes-assertion/ws/src/main/java/org/apache/ctakes/assertion/medfacts/cleartk/UncertaintyCleartkAnalysisEngine.java>:[37,62]
error: cannot find symbol
[ERROR]   symbol:   class DependencyPathRegexpFeatureExtractor
  location: package org.apache.ctakes.assertion.medfacts.cleartk.extractors
<https://builds.apache.org/job/ctakes-trunk-compiletest/org.apache.ctakes$ctakes-assertion/ws/src/main/java/org/apache/ctakes/assertion/medfacts/cleartk/AssertionCleartkAnalysisEngine.java>:[277,11]
[unchecked] unchecked call to TypePathExtractor(Class<T>,String) as a member of the
raw type TypePathExtractor
[ERROR]   where T is a type-variable:
    T extends Annotation declared in class TypePathExtractor
<https://builds.apache.org/job/ctakes-trunk-compiletest/org.apache.ctakes$ctakes-assertion/ws/src/main/java/org/apache/ctakes/assertion/medfacts/cleartk/AssertionCleartkAnalysisEngine.java>:[278,11]
[unchecked] unchecked call to TypePathExtractor(Class<T>,String) as a member of the
raw type TypePathExtractor
[ERROR]   where T is a type-variable:
    T extends Annotation declared in class TypePathExtractor
<https://builds.apache.org/job/ctakes-trunk-compiletest/org.apache.ctakes$ctakes-assertion/ws/src/main/java/org/apache/ctakes/assertion/medfacts/cleartk/AssertionCleartkAnalysisEngine.java>:[279,11]
[unchecked] unchecked call to TypePathExtractor(Class<T>,String) as a member of the
raw type TypePathExtractor
[ERROR]   where T is a type-variable:
    T extends Annotation declared in class TypePathExtractor
<https://builds.apache.org/job/ctakes-trunk-compiletest/org.apache.ctakes$ctakes-assertion/ws/src/main/java/org/apache/ctakes/assertion/medfacts/cleartk/AssertionCleartkAnalysisEngine.java>:[274,8]
[unchecked] unchecked call to CombinedExtractor1(FeatureExtractor1<T>,FeatureExtractor1<T>,FeatureExtractor1<T>,FeatureExtractor1<T>)
as a member of the raw type CombinedExtractor1
[ERROR]   where T is a type-variable:
    T extends Annotation declared in class CombinedExtractor1
<https://builds.apache.org/job/ctakes-trunk-compiletest/org.apache.ctakes$ctakes-assertion/ws/src/main/java/org/apache/ctakes/assertion/medfacts/cleartk/AssertionCleartkAnalysisEngine.java>:[282,33]
[unchecked] unchecked call to CleartkExtractor(Class<SEARCH_T>,FeatureExtractor1<SEARCH_T>,Context...)
as a member of the raw type CleartkExtractor
[ERROR]   where SEARCH_T is a type-variable:
    SEARCH_T extends Annotation declared in class CleartkExtractor
<https://builds.apache.org/job/ctakes-trunk-compiletest/org.apache.ctakes$ctakes-assertion/ws/src/main/java/org/apache/ctakes/assertion/medfacts/cleartk/AssertionCleartkAnalysisEngine.java>:[282,33]
[unchecked] unchecked conversion
[ERROR]   required: CleartkExtractor<IdentifiedAnnotation,BaseToken>
  found:    CleartkExtractor
<https://builds.apache.org/job/ctakes-trunk-compiletest/org.apache.ctakes$ctakes-assertion/ws/src/main/java/org/apache/ctakes/assertion/medfacts/cleartk/AssertionCleartkAnalysisEngine.java>:[408,41]
[unchecked] unchecked call to extract(JCas,FOCUS_T) as a member of the raw type CleartkExtractor
[ERROR]   where FOCUS_T is a type-variable:
    FOCUS_T extends Annotation declared in class CleartkExtractor
<https://builds.apache.org/job/ctakes-trunk-compiletest/org.apache.ctakes$ctakes-assertion/ws/src/main/java/org/apache/ctakes/assertion/medfacts/cleartk/AssertionCleartkAnalysisEngine.java>:[408,41]
[unchecked] unchecked conversion
[ERROR]   required: Collection<Feature>
  found:    List
<https://builds.apache.org/job/ctakes-trunk-compiletest/org.apache.ctakes$ctakes-assertion/ws/src/main/java/org/apache/ctakes/assertion/medfacts/cleartk/AssertionCleartkAnalysisEngine.java>:[472,41]
[unchecked] unchecked call to extract(JCas,T) as a member of the raw type FeatureExtractor1
[ERROR]   where T is a type-variable:
    T extends Annotation declared in interface FeatureExtractor1
<https://builds.apache.org/job/ctakes-trunk-compiletest/org.apache.ctakes$ctakes-assertion/ws/src/main/java/org/apache/ctakes/assertion/medfacts/cleartk/AssertionCleartkAnalysisEngine.java>:[472,41]
[unchecked] unchecked conversion
[ERROR]   required: Collection<Feature>
  found:    List
<https://builds.apache.org/job/ctakes-trunk-compiletest/org.apache.ctakes$ctakes-assertion/ws/src/main/java/org/apache/ctakes/assertion/medfacts/cleartk/AssertionCleartkAnalysisEngine.java>:[477,41]
[unchecked] unchecked call to extract(JCas,T) as a member of the raw type FeatureExtractor1
[ERROR]   where T is a type-variable:
    T extends Annotation declared in interface FeatureExtractor1
<https://builds.apache.org/job/ctakes-trunk-compiletest/org.apache.ctakes$ctakes-assertion/ws/src/main/java/org/apache/ctakes/assertion/medfacts/cleartk/AssertionCleartkAnalysisEngine.java>:[477,41]
[unchecked] unchecked conversion
[ERROR]   required: Collection<Feature>
  found:    List
<https://builds.apache.org/job/ctakes-trunk-compiletest/org.apache.ctakes$ctakes-assertion/ws/src/main/java/org/apache/ctakes/assertion/medfacts/cleartk/AssertionCleartkAnalysisEngine.java>:[500,41]
[unchecked] unchecked call to extract(JCas,T) as a member of the raw type FeatureFunctionExtractor
[ERROR]   where T is a type-variable:
    T extends Annotation declared in class FeatureFunctionExtractor
<https://builds.apache.org/job/ctakes-trunk-compiletest/org.apache.ctakes$ctakes-assertion/ws/src/main/java/org/apache/ctakes/assertion/medfacts/cleartk/AssertionCleartkAnalysisEngine.java>:[500,41]
[unchecked] unchecked conversion
[ERROR]   required: Collection<Feature>
  found:    List
<https://builds.apache.org/job/ctakes-trunk-compiletest/org.apache.ctakes$ctakes-assertion/ws/src/main/java/org/apache/ctakes/assertion/medfacts/cleartk/AssertionCleartkAnalysisEngine.java>:[575,37]
[unchecked] unchecked conversion
[ERROR]   required: List<String>
  found:    List
<https://builds.apache.org/job/ctakes-trunk-compiletest/org.apache.ctakes$ctakes-assertion/ws/src/main/java/org/apache/ctakes/assertion/eval/AssertionEvaluation.java>:[453,55]
[unchecked] unchecked call to addAll(AnnotationStatisticsCompact<OUTCOME_TYPE>) as a
member of the raw type AnnotationStatisticsCompact
[ERROR]   where OUTCOME_TYPE is a type-variable:
    OUTCOME_TYPE extends Comparable<? super OUTCOME_TYPE> declared in class AnnotationStatisticsCompact
<https://builds.apache.org/job/ctakes-trunk-compiletest/org.apache.ctakes$ctakes-assertion/ws/src/main/java/org/apache/ctakes/assertion/eval/AssertionEvaluation.java>:[1035,24]
[unchecked] unchecked call to <ANNOTATION_TYPE,SPAN_TYPE>add(Collection<? extends
ANNOTATION_TYPE>,Collection<? extends ANNOTATION_TYPE>,Function<ANNOTATION_TYPE,SPAN_TYPE>,Function<ANNOTATION_TYPE,OUTCOME_TYPE>)
as a member of the raw type AnnotationStatisticsCompact
[ERROR]   where ANNOTATION_TYPE,SPAN_TYPE,OUTCOME_TYPE are type-variables:
    ANNOTATION_TYPE extends Object declared in method <ANNOTATION_TYPE,SPAN_TYPE>add(Collection<?
extends ANNOTATION_TYPE>,Collection<? extends ANNOTATION_TYPE>,Function<ANNOTATION_TYPE,SPAN_TYPE>,Function<ANNOTATION_TYPE,OUTCOME_TYPE>)
    SPAN_TYPE extends Object declared in method <ANNOTATION_TYPE,SPAN_TYPE>add(Collection<?
extends ANNOTATION_TYPE>,Collection<? extends ANNOTATION_TYPE>,Function<ANNOTATION_TYPE,SPAN_TYPE>,Function<ANNOTATION_TYPE,OUTCOME_TYPE>)
    OUTCOME_TYPE extends Comparable<? super OUTCOME_TYPE> declared in class AnnotationStatisticsCompact
<https://builds.apache.org/job/ctakes-trunk-compiletest/org.apache.ctakes$ctakes-assertion/ws/src/main/java/org/apache/ctakes/assertion/eval/AssertionEvaluation.java>:[1048,27]
[unchecked] unchecked call to <ANNOTATION_TYPE,SPAN_TYPE>add(Collection<? extends
ANNOTATION_TYPE>,Collection<? extends ANNOTATION_TYPE>,Function<ANNOTATION_TYPE,SPAN_TYPE>,Function<ANNOTATION_TYPE,OUTCOME_TYPE>)
as a member of the raw type AnnotationStatisticsCompact
[ERROR]   where ANNOTATION_TYPE,SPAN_TYPE,OUTCOME_TYPE are type-variables:
    ANNOTATION_TYPE extends Object declared in method <ANNOTATION_TYPE,SPAN_TYPE>add(Collection<?
extends ANNOTATION_TYPE>,Collection<? extends ANNOTATION_TYPE>,Function<ANNOTATION_TYPE,SPAN_TYPE>,Function<ANNOTATION_TYPE,OUTCOME_TYPE>)
    SPAN_TYPE extends Object declared in method <ANNOTATION_TYPE,SPAN_TYPE>add(Collection<?
extends ANNOTATION_TYPE>,Collection<? extends ANNOTATION_TYPE>,Function<ANNOTATION_TYPE,SPAN_TYPE>,Function<ANNOTATION_TYPE,OUTCOME_TYPE>)
    OUTCOME_TYPE extends Comparable<? super OUTCOME_TYPE> declared in class AnnotationStatisticsCompact
<https://builds.apache.org/job/ctakes-trunk-compiletest/org.apache.ctakes$ctakes-assertion/ws/src/main/java/org/apache/ctakes/assertion/eval/AssertionEvaluation.java>:[1058,27]
[unchecked] unchecked call to <ANNOTATION_TYPE,SPAN_TYPE>add(Collection<? extends
ANNOTATION_TYPE>,Collection<? extends ANNOTATION_TYPE>,Function<ANNOTATION_TYPE,SPAN_TYPE>,Function<ANNOTATION_TYPE,OUTCOME_TYPE>)
as a member of the raw type AnnotationStatisticsCompact
[ERROR]   where ANNOTATION_TYPE,SPAN_TYPE,OUTCOME_TYPE are type-variables:
    ANNOTATION_TYPE extends Object declared in method <ANNOTATION_TYPE,SPAN_TYPE>add(Collection<?
extends ANNOTATION_TYPE>,Collection<? extends ANNOTATION_TYPE>,Function<ANNOTATION_TYPE,SPAN_TYPE>,Function<ANNOTATION_TYPE,OUTCOME_TYPE>)
    SPAN_TYPE extends Object declared in method <ANNOTATION_TYPE,SPAN_TYPE>add(Collection<?
extends ANNOTATION_TYPE>,Collection<? extends ANNOTATION_TYPE>,Function<ANNOTATION_TYPE,SPAN_TYPE>,Function<ANNOTATION_TYPE,OUTCOME_TYPE>)
    OUTCOME_TYPE extends Comparable<? super OUTCOME_TYPE> declared in class AnnotationStatisticsCompact
<https://builds.apache.org/job/ctakes-trunk-compiletest/org.apache.ctakes$ctakes-assertion/ws/src/main/java/org/apache/ctakes/assertion/eval/AssertionEvaluation.java>:[1068,23]
[unchecked] unchecked call to <ANNOTATION_TYPE,SPAN_TYPE>add(Collection<? extends
ANNOTATION_TYPE>,Collection<? extends ANNOTATION_TYPE>,Function<ANNOTATION_TYPE,SPAN_TYPE>,Function<ANNOTATION_TYPE,OUTCOME_TYPE>)
as a member of the raw type AnnotationStatisticsCompact
[ERROR]   where ANNOTATION_TYPE,SPAN_TYPE,OUTCOME_TYPE are type-variables:
    ANNOTATION_TYPE extends Object declared in method <ANNOTATION_TYPE,SPAN_TYPE>add(Collection<?
extends ANNOTATION_TYPE>,Collection<? extends ANNOTATION_TYPE>,Function<ANNOTATION_TYPE,SPAN_TYPE>,Function<ANNOTATION_TYPE,OUTCOME_TYPE>)
    SPAN_TYPE extends Object declared in method <ANNOTATION_TYPE,SPAN_TYPE>add(Collection<?
extends ANNOTATION_TYPE>,Collection<? extends ANNOTATION_TYPE>,Function<ANNOTATION_TYPE,SPAN_TYPE>,Function<ANNOTATION_TYPE,OUTCOME_TYPE>)
    OUTCOME_TYPE extends Comparable<? super OUTCOME_TYPE> declared in class AnnotationStatisticsCompact
<https://builds.apache.org/job/ctakes-trunk-compiletest/org.apache.ctakes$ctakes-assertion/ws/src/main/java/org/apache/ctakes/assertion/eval/AssertionEvaluation.java>:[1078,23]
[unchecked] unchecked call to <ANNOTATION_TYPE,SPAN_TYPE>add(Collection<? extends
ANNOTATION_TYPE>,Collection<? extends ANNOTATION_TYPE>,Function<ANNOTATION_TYPE,SPAN_TYPE>,Function<ANNOTATION_TYPE,OUTCOME_TYPE>)
as a member of the raw type AnnotationStatisticsCompact
[ERROR]   where ANNOTATION_TYPE,SPAN_TYPE,OUTCOME_TYPE are type-variables:
    ANNOTATION_TYPE extends Object declared in method <ANNOTATION_TYPE,SPAN_TYPE>add(Collection<?
extends ANNOTATION_TYPE>,Collection<? extends ANNOTATION_TYPE>,Function<ANNOTATION_TYPE,SPAN_TYPE>,Function<ANNOTATION_TYPE,OUTCOME_TYPE>)
    SPAN_TYPE extends Object declared in method <ANNOTATION_TYPE,SPAN_TYPE>add(Collection<?
extends ANNOTATION_TYPE>,Collection<? extends ANNOTATION_TYPE>,Function<ANNOTATION_TYPE,SPAN_TYPE>,Function<ANNOTATION_TYPE,OUTCOME_TYPE>)
    OUTCOME_TYPE extends Comparable<? super OUTCOME_TYPE> declared in class AnnotationStatisticsCompact
<https://builds.apache.org/job/ctakes-trunk-compiletest/org.apache.ctakes$ctakes-assertion/ws/src/main/java/org/apache/ctakes/assertion/eval/AssertionEvaluation.java>:[1089,23]
[unchecked] unchecked call to <ANNOTATION_TYPE,SPAN_TYPE>add(Collection<? extends
ANNOTATION_TYPE>,Collection<? extends ANNOTATION_TYPE>,Function<ANNOTATION_TYPE,SPAN_TYPE>,Function<ANNOTATION_TYPE,OUTCOME_TYPE>)
as a member of the raw type AnnotationStatisticsCompact
[ERROR]   where ANNOTATION_TYPE,SPAN_TYPE,OUTCOME_TYPE are type-variables:
    ANNOTATION_TYPE extends Object declared in method <ANNOTATION_TYPE,SPAN_TYPE>add(Collection<?
extends ANNOTATION_TYPE>,Collection<? extends ANNOTATION_TYPE>,Function<ANNOTATION_TYPE,SPAN_TYPE>,Function<ANNOTATION_TYPE,OUTCOME_TYPE>)
    SPAN_TYPE extends Object declared in method <ANNOTATION_TYPE,SPAN_TYPE>add(Collection<?
extends ANNOTATION_TYPE>,Collection<? extends ANNOTATION_TYPE>,Function<ANNOTATION_TYPE,SPAN_TYPE>,Function<ANNOTATION_TYPE,OUTCOME_TYPE>)
    OUTCOME_TYPE extends Comparable<? super OUTCOME_TYPE> declared in class AnnotationStatisticsCompact
<https://builds.apache.org/job/ctakes-trunk-compiletest/org.apache.ctakes$ctakes-assertion/ws/src/main/java/org/apache/ctakes/assertion/eval/AssertionEvaluation.java>:[1157,24]
[unchecked] unchecked call to write(Instance<OUTCOME_TYPE>) as a member of the raw type
DataWriter
[ERROR]   where OUTCOME_TYPE is a type-variable:
    OUTCOME_TYPE extends Object declared in interface DataWriter
<https://builds.apache.org/job/ctakes-trunk-compiletest/org.apache.ctakes$ctakes-assertion/ws/src/main/java/org/apache/ctakes/assertion/eval/AnnotationStatisticsCompact.java>:[270,49]
[unchecked] Possible heap pollution from parameterized vararg type OUTCOME_TYPE
[ERROR]   where OUTCOME_TYPE is a type-variable:
    OUTCOME_TYPE extends Comparable<? super OUTCOME_TYPE> declared in class AnnotationStatisticsCompact
<https://builds.apache.org/job/ctakes-trunk-compiletest/org.apache.ctakes$ctakes-assertion/ws/src/main/java/org/apache/ctakes/assertion/eval/AnnotationStatisticsCompact.java>:[289,49]
[unchecked] Possible heap pollution from parameterized vararg type OUTCOME_TYPE
[ERROR]   where OUTCOME_TYPE is a type-variable:
    OUTCOME_TYPE extends Comparable<? super OUTCOME_TYPE> declared in class AnnotationStatisticsCompact
<https://builds.apache.org/job/ctakes-trunk-compiletest/org.apache.ctakes$ctakes-assertion/ws/src/main/java/org/apache/ctakes/assertion/eval/AnnotationStatisticsCompact.java>:[309,48]
[unchecked] Possible heap pollution from parameterized vararg type OUTCOME_TYPE
[ERROR]   where OUTCOME_TYPE is a type-variable:
    OUTCOME_TYPE extends Comparable<? super OUTCOME_TYPE> declared in class AnnotationStatisticsCompact
<https://builds.apache.org/job/ctakes-trunk-compiletest/org.apache.ctakes$ctakes-assertion/ws/src/main/java/org/apache/ctakes/assertion/eval/AnnotationStatisticsCompact.java>:[330,48]
[unchecked] Possible heap pollution from parameterized vararg type OUTCOME_TYPE
[ERROR]   where OUTCOME_TYPE is a type-variable:
    OUTCOME_TYPE extends Comparable<? super OUTCOME_TYPE> declared in class AnnotationStatisticsCompact
<https://builds.apache.org/job/ctakes-trunk-compiletest/org.apache.ctakes$ctakes-assertion/ws/src/main/java/org/apache/ctakes/assertion/medfacts/cleartk/extractors/CueWordTest2.java>:[94,11]
[unchecked] unchecked call to TypePathExtractor(Class<T>,String) as a member of the
raw type TypePathExtractor
[ERROR]   where T is a type-variable:
    T extends Annotation declared in class TypePathExtractor
<https://builds.apache.org/job/ctakes-trunk-compiletest/org.apache.ctakes$ctakes-assertion/ws/src/main/java/org/apache/ctakes/assertion/medfacts/cleartk/extractors/CueWordTest2.java>:[95,11]
[unchecked] unchecked call to TypePathExtractor(Class<T>,String) as a member of the
raw type TypePathExtractor
[ERROR]   where T is a type-variable:
    T extends Annotation declared in class TypePathExtractor
<https://builds.apache.org/job/ctakes-trunk-compiletest/org.apache.ctakes$ctakes-assertion/ws/src/main/java/org/apache/ctakes/assertion/medfacts/cleartk/extractors/CueWordTest2.java>:[96,11]
[unchecked] unchecked call to TypePathExtractor(Class<T>,String) as a member of the
raw type TypePathExtractor
[ERROR]   where T is a type-variable:
    T extends Annotation declared in class TypePathExtractor
<https://builds.apache.org/job/ctakes-trunk-compiletest/org.apache.ctakes$ctakes-assertion/ws/src/main/java/org/apache/ctakes/assertion/medfacts/cleartk/extractors/CueWordTest2.java>:[91,8]
[unchecked] unchecked call to CombinedExtractor1(FeatureExtractor1<T>,FeatureExtractor1<T>,FeatureExtractor1<T>,FeatureExtractor1<T>)
as a member of the raw type CombinedExtractor1
[ERROR]   where T is a type-variable:
    T extends Annotation declared in class CombinedExtractor1
<https://builds.apache.org/job/ctakes-trunk-compiletest/org.apache.ctakes$ctakes-assertion/ws/src/main/java/org/apache/ctakes/assertion/medfacts/cleartk/extractors/CueWordTest2.java>:[100,8]
[unchecked] unchecked call to CleartkExtractor(Class<SEARCH_T>,FeatureExtractor1<SEARCH_T>,Context...)
as a member of the raw type CleartkExtractor
[ERROR]   where SEARCH_T is a type-variable:
    SEARCH_T extends Annotation declared in class CleartkExtractor
<https://builds.apache.org/job/ctakes-trunk-compiletest/org.apache.ctakes$ctakes-assertion/ws/src/main/java/org/apache/ctakes/assertion/medfacts/cleartk/extractors/CueWordTest2.java>:[113,8]
[unchecked] unchecked call to CleartkExtractor(Class<SEARCH_T>,FeatureExtractor1<SEARCH_T>,Context...)
as a member of the raw type CleartkExtractor
[ERROR]   where SEARCH_T is a type-variable:
    SEARCH_T extends Annotation declared in class CleartkExtractor
<https://builds.apache.org/job/ctakes-trunk-compiletest/org.apache.ctakes$ctakes-assertion/ws/src/main/java/org/apache/ctakes/assertion/medfacts/cleartk/extractors/CueWordTest2.java>:[127,12]
[unchecked] unchecked call to TypePathExtractor(Class<T>,String) as a member of the
raw type TypePathExtractor
[ERROR]   where T is a type-variable:
    T extends Annotation declared in class TypePathExtractor
<https://builds.apache.org/job/ctakes-trunk-compiletest/org.apache.ctakes$ctakes-assertion/ws/src/main/java/org/apache/ctakes/assertion/medfacts/cleartk/extractors/CueWordTest2.java>:[125,8]
[unchecked] unchecked call to CleartkExtractor(Class<SEARCH_T>,FeatureExtractor1<SEARCH_T>,Context...)
as a member of the raw type CleartkExtractor
[ERROR]   where SEARCH_T is a type-variable:
    SEARCH_T extends Annotation declared in class CleartkExtractor
<https://builds.apache.org/job/ctakes-trunk-compiletest/org.apache.ctakes$ctakes-assertion/ws/src/main/java/org/apache/ctakes/assertion/medfacts/cleartk/extractors/CueWordTest2.java>:[165,50]
[unchecked] unchecked call to extractWithin(JCas,FOCUS_T,Annotation) as a member of the raw
type CleartkExtractor
[ERROR]   where FOCUS_T is a type-variable:
    FOCUS_T extends Annotation declared in class CleartkExtractor
<https://builds.apache.org/job/ctakes-trunk-compiletest/org.apache.ctakes$ctakes-assertion/ws/src/main/java/org/apache/ctakes/assertion/medfacts/cleartk/extractors/CueWordTest2.java>:[165,50]
[unchecked] unchecked conversion
[ERROR]   required: List<Feature>
  found:    List
<https://builds.apache.org/job/ctakes-trunk-compiletest/org.apache.ctakes$ctakes-assertion/ws/src/main/java/org/apache/ctakes/assertion/medfacts/cleartk/extractors/CueWordTest2.java>:[175,40]
[unchecked] unchecked call to extractWithin(JCas,FOCUS_T,Annotation) as a member of the raw
type CleartkExtractor
[ERROR]   where FOCUS_T is a type-variable:
    FOCUS_T extends Annotation declared in class CleartkExtractor
<https://builds.apache.org/job/ctakes-trunk-compiletest/org.apache.ctakes$ctakes-assertion/ws/src/main/java/org/apache/ctakes/assertion/medfacts/cleartk/extractors/CueWordTest2.java>:[175,40]
[unchecked] unchecked conversion
[ERROR]   required: List<Feature>
  found:    List
<https://builds.apache.org/job/ctakes-trunk-compiletest/org.apache.ctakes$ctakes-assertion/ws/src/main/java/org/apache/ctakes/assertion/medfacts/cleartk/UncertaintyCleartkAnalysisEngine.java>:[59,35]
[unchecked] unchecked conversion
[ERROR]   required: FeatureExtractor1<IdentifiedAnnotation>
  found:    ContextWordWindowExtractor
<https://builds.apache.org/job/ctakes-trunk-compiletest/org.apache.ctakes$ctakes-assertion/ws/src/main/java/org/apache/ctakes/assertion/medfacts/cleartk/UncertaintyCleartkAnalysisEngine.java>:[60,35]
[unchecked] unchecked conversion
[ERROR]   required: FeatureExtractor1<IdentifiedAnnotation>
  found:    UncertaintyFeatureExtractor
<https://builds.apache.org/job/ctakes-trunk-compiletest/org.apache.ctakes$ctakes-assertion/ws/src/main/java/org/apache/ctakes/assertion/medfacts/cleartk/UncertaintyCleartkAnalysisEngine.java>:[62,43]
error: cannot find symbol
[ERROR]   symbol:   class DependencyPathRegexpFeatureExtractor
  location: class UncertaintyCleartkAnalysisEngine
<https://builds.apache.org/job/ctakes-trunk-compiletest/org.apache.ctakes$ctakes-assertion/ws/src/main/java/org/apache/ctakes/assertion/medfacts/cleartk/UncertaintyCleartkAnalysisEngine.java>:[69,37]
[unchecked] unchecked conversion
[ERROR]   required: FeatureExtractor1<IdentifiedAnnotation>
  found:    AboveLeftFragmentExtractor
<https://builds.apache.org/job/ctakes-trunk-compiletest/org.apache.ctakes$ctakes-assertion/ws/src/main/java/org/apache/ctakes/assertion/medfacts/cleartk/UncertaintyCleartkAnalysisEngine.java>:[73,37]
[unchecked] unchecked conversion
[ERROR]   required: FeatureExtractor1<IdentifiedAnnotation>
  found:    DependencyWordsFragmentExtractor
<https://builds.apache.org/job/ctakes-trunk-compiletest/org.apache.ctakes$ctakes-assertion/ws/src/main/java/org/apache/ctakes/assertion/medfacts/cleartk/UncertaintyCleartkAnalysisEngine.java>:[76,34]
[unchecked] unchecked conversion
[ERROR]   required: FeatureExtractor1<IdentifiedAnnotation>
  found:    AssertionAboveLeftTreeExtractor
<https://builds.apache.org/job/ctakes-trunk-compiletest/org.apache.ctakes$ctakes-assertion/ws/src/main/java/org/apache/ctakes/assertion/medfacts/cleartk/UncertaintyCleartkAnalysisEngine.java>:[80,34]
[unchecked] unchecked conversion
[ERROR]   required: FeatureExtractor1<IdentifiedAnnotation>
  found:    AssertionDependencyTreeExtractor
<https://builds.apache.org/job/ctakes-trunk-compiletest/org.apache.ctakes$ctakes-assertion/ws/src/main/java/org/apache/ctakes/assertion/medfacts/cleartk/HistoryCleartkAnalysisEngine.java>:[70,34]
error: incompatible types
[ERROR]   required: List<FeatureExtractor1<IdentifiedAnnotation>>
  found:    ArrayList<FeatureExtractor1>
<https://builds.apache.org/job/ctakes-trunk-compiletest/org.apache.ctakes$ctakes-assertion/ws/src/main/java/org/apache/ctakes/assertion/medfacts/cleartk/HistoryCleartkAnalysisEngine.java>:[72,35]
[unchecked] unchecked conversion
[ERROR]   required: FeatureExtractor1<IdentifiedAnnotation>
  found:    ContextWordWindowExtractor
<https://builds.apache.org/job/ctakes-trunk-compiletest/org.apache.ctakes$ctakes-assertion/ws/src/main/java/org/apache/ctakes/assertion/medfacts/cleartk/HistoryCleartkAnalysisEngine.java>:[73,35]
[unchecked] unchecked conversion
[ERROR]   required: FeatureExtractor1<IdentifiedAnnotation>
  found:    HistoryFeaturesExtractor
<https://builds.apache.org/job/ctakes-trunk-compiletest/org.apache.ctakes$ctakes-assertion/ws/src/main/java/org/apache/ctakes/assertion/medfacts/cleartk/SubjectCleartkAnalysisEngine.java>:[66,36]
[unchecked] unchecked conversion
[ERROR]   required: FeatureExtractor1<IdentifiedAnnotation>
  found:    SubjectFeaturesExtractor
<https://builds.apache.org/job/ctakes-trunk-compiletest/org.apache.ctakes$ctakes-assertion/ws/src/main/java/org/apache/ctakes/assertion/cr/XmiCollectionReaderCtakes.java>:[80,18]
[unchecked] unchecked call to add(E) as a member of the raw type ArrayList
[ERROR]   where E is a type-variable:
    E extends Object declared in class ArrayList
<https://builds.apache.org/job/ctakes-trunk-compiletest/org.apache.ctakes$ctakes-assertion/ws/src/main/java/org/apache/ctakes/assertion/pipelines/RunJudgeAttributeInstances.java>:[111,35]
[unchecked] unchecked conversion
[ERROR]   required: List<File>
  found:    List
<https://builds.apache.org/job/ctakes-trunk-compiletest/org.apache.ctakes$ctakes-assertion/ws/src/main/java/org/apache/ctakes/assertion/medfacts/cleartk/PolarityCleartkAnalysisEngine.java>:[57,34]
error: incompatible types
[ERROR]   required: List<FeatureExtractor1<IdentifiedAnnotation>>
  found:    ArrayList<FeatureExtractor1>
<https://builds.apache.org/job/ctakes-trunk-compiletest/org.apache.ctakes$ctakes-assertion/ws/src/main/java/org/apache/ctakes/assertion/medfacts/cleartk/PolarityCleartkAnalysisEngine.java>:[62,37]
[unchecked] unchecked conversion
[ERROR]   required: FeatureExtractor1<IdentifiedAnnotation>
  found:    ContextWordWindowExtractor
<https://builds.apache.org/job/ctakes-trunk-compiletest/org.apache.ctakes$ctakes-assertion/ws/src/main/java/org/apache/ctakes/assertion/medfacts/cleartk/PolarityCleartkAnalysisEngine.java>:[67,37]
[unchecked] unchecked conversion
[ERROR]   required: FeatureExtractor1<IdentifiedAnnotation>
  found:    AboveLeftFragmentExtractor
<https://builds.apache.org/job/ctakes-trunk-compiletest/org.apache.ctakes$ctakes-assertion/ws/src/main/java/org/apache/ctakes/assertion/medfacts/cleartk/PolarityCleartkAnalysisEngine.java>:[73,37]
[unchecked] unchecked conversion
[ERROR]   required: FeatureExtractor1<IdentifiedAnnotation>
  found:    DependencyWordsFragmentExtractor
<https://builds.apache.org/job/ctakes-trunk-compiletest/org.apache.ctakes$ctakes-assertion/ws/src/main/java/org/apache/ctakes/assertion/medfacts/cleartk/PolarityCleartkAnalysisEngine.java>:[78,37]
[unchecked] unchecked conversion
[ERROR]   required: FeatureExtractor1<IdentifiedAnnotation>
  found:    NegationDependencyFeatureExtractor
<https://builds.apache.org/job/ctakes-trunk-compiletest/org.apache.ctakes$ctakes-assertion/ws/src/main/java/org/apache/ctakes/assertion/medfacts/cleartk/PolarityCleartkAnalysisEngine.java>:[83,34]
[unchecked] unchecked conversion
[ERROR]   required: FeatureExtractor1<IdentifiedAnnotation>
  found:    AssertionAboveLeftTreeExtractor
<https://builds.apache.org/job/ctakes-trunk-compiletest/org.apache.ctakes$ctakes-assertion/ws/src/main/java/org/apache/ctakes/assertion/medfacts/cleartk/PolarityCleartkAnalysisEngine.java>:[88,34]
[unchecked] unchecked conversion
[ERROR]   required: FeatureExtractor1<IdentifiedAnnotation>
  found:    AssertionDependencyTreeExtractor
<https://builds.apache.org/job/ctakes-trunk-compiletest/org.apache.ctakes$ctakes-assertion/ws/src/main/java/org/apache/ctakes/assertion/medfacts/cleartk/PolarityFedaCleartkAnalysisEngine.java>:[52,34]
error: incompatible types
[ERROR]   required: List<FeatureExtractor1<IdentifiedAnnotation>>
  found:    ArrayList<FeatureExtractor1>
<https://builds.apache.org/job/ctakes-trunk-compiletest/org.apache.ctakes$ctakes-assertion/ws/src/main/java/org/apache/ctakes/assertion/medfacts/cleartk/PolarityFedaCleartkAnalysisEngine.java>:[54,35]
[unchecked] unchecked conversion
[ERROR]   required: FeatureExtractor1<IdentifiedAnnotation>
  found:    NegationDependencyFeatureExtractor
<https://builds.apache.org/job/ctakes-trunk-compiletest/org.apache.ctakes$ctakes-assertion/ws/src/main/java/org/apache/ctakes/assertion/medfacts/cleartk/PolarityFedaCleartkAnalysisEngine.java>:[55,35]
[unchecked] unchecked conversion
[ERROR]   required: FeatureExtractor1<IdentifiedAnnotation>
  found:    ContextWordWindowExtractor
<https://builds.apache.org/job/ctakes-trunk-compiletest/org.apache.ctakes$ctakes-assertion/ws/src/main/java/org/apache/ctakes/assertion/medfacts/cleartk/PolarityFedaCleartkAnalysisEngine.java>:[56,35]
[unchecked] unchecked conversion
[ERROR]   required: FeatureExtractor1<IdentifiedAnnotation>
  found:    AboveLeftFragmentExtractor
<https://builds.apache.org/job/ctakes-trunk-compiletest/org.apache.ctakes$ctakes-assertion/ws/src/main/java/org/apache/ctakes/assertion/medfacts/cleartk/PolarityFedaCleartkAnalysisEngine.java>:[115,32]
[unchecked] unchecked call to FeatureFunctionExtractor(FeatureExtractor1<T>,FeatureFunction...)
as a member of the raw type FeatureFunctionExtractor
[ERROR]   where T is a type-variable:
    T extends Annotation declared in class FeatureFunctionExtractor
<https://builds.apache.org/job/ctakes-trunk-compiletest/org.apache.ctakes$ctakes-assertion/ws/src/main/java/org/apache/ctakes/assertion/medfacts/cleartk/extractors/CueWordTest.java>:[94,11]
[unchecked] unchecked call to TypePathExtractor(Class<T>,String) as a member of the
raw type TypePathExtractor
[ERROR]   where T is a type-variable:
    T extends Annotation declared in class TypePathExtractor
<https://builds.apache.org/job/ctakes-trunk-compiletest/org.apache.ctakes$ctakes-assertion/ws/src/main/java/org/apache/ctakes/assertion/medfacts/cleartk/extractors/CueWordTest.java>:[95,11]
[unchecked] unchecked call to TypePathExtractor(Class<T>,String) as a member of the
raw type TypePathExtractor
[ERROR]   where T is a type-variable:
    T extends Annotation declared in class TypePathExtractor
<https://builds.apache.org/job/ctakes-trunk-compiletest/org.apache.ctakes$ctakes-assertion/ws/src/main/java/org/apache/ctakes/assertion/medfacts/cleartk/extractors/CueWordTest.java>:[96,11]
[unchecked] unchecked call to TypePathExtractor(Class<T>,String) as a member of the
raw type TypePathExtractor
[ERROR]   where T is a type-variable:
    T extends Annotation declared in class TypePathExtractor
<https://builds.apache.org/job/ctakes-trunk-compiletest/org.apache.ctakes$ctakes-assertion/ws/src/main/java/org/apache/ctakes/assertion/medfacts/cleartk/extractors/CueWordTest.java>:[91,8]
[unchecked] unchecked call to CombinedExtractor1(FeatureExtractor1<T>,FeatureExtractor1<T>,FeatureExtractor1<T>,FeatureExtractor1<T>)
as a member of the raw type CombinedExtractor1
[ERROR]   where T is a type-variable:
    T extends Annotation declared in class CombinedExtractor1
<https://builds.apache.org/job/ctakes-trunk-compiletest/org.apache.ctakes$ctakes-assertion/ws/src/main/java/org/apache/ctakes/assertion/medfacts/cleartk/extractors/CueWordTest.java>:[100,8]
[unchecked] unchecked call to CleartkExtractor(Class<SEARCH_T>,FeatureExtractor1<SEARCH_T>,Context...)
as a member of the raw type CleartkExtractor
[ERROR]   where SEARCH_T is a type-variable:
    SEARCH_T extends Annotation declared in class CleartkExtractor
<https://builds.apache.org/job/ctakes-trunk-compiletest/org.apache.ctakes$ctakes-assertion/ws/src/main/java/org/apache/ctakes/assertion/medfacts/cleartk/extractors/CueWordTest.java>:[142,50]
[unchecked] unchecked call to extractWithin(JCas,FOCUS_T,Annotation) as a member of the raw
type CleartkExtractor
[ERROR]   where FOCUS_T is a type-variable:
    FOCUS_T extends Annotation declared in class CleartkExtractor
<https://builds.apache.org/job/ctakes-trunk-compiletest/org.apache.ctakes$ctakes-assertion/ws/src/main/java/org/apache/ctakes/assertion/medfacts/cleartk/extractors/CueWordTest.java>:[142,50]
[unchecked] unchecked conversion
[ERROR]   required: List<Feature>
  found:    List
<https://builds.apache.org/job/ctakes-trunk-compiletest/org.apache.ctakes$ctakes-assertion/ws/src/main/java/org/apache/ctakes/assertion/medfacts/CasIndexer.java>:[74,21]
[unchecked] unchecked cast
[ERROR]   required: T
  found:    Annotation
  where T is a type-variable:
    T extends Annotation declared in class CasIndexer
<https://builds.apache.org/job/ctakes-trunk-compiletest/org.apache.ctakes$ctakes-assertion/ws/src/main/java/org/apache/ctakes/assertion/medfacts/cleartk/extractors/ExtractorListFeatureFunctionConverter.java>:[35,6]
[unchecked] unchecked call to FeatureFunctionExtractor(FeatureExtractor1<T>,FeatureFunction...)
as a member of the raw type FeatureFunctionExtractor
[ERROR]   where T is a type-variable:
    T extends Annotation declared in class FeatureFunctionExtractor
<https://builds.apache.org/job/ctakes-trunk-compiletest/org.apache.ctakes$ctakes-assertion/ws/src/main/java/org/apache/ctakes/assertion/medfacts/cleartk/GenericCleartkAnalysisEngine.java>:[68,34]
error: incompatible types
[ERROR]   required: List<FeatureExtractor1<IdentifiedAnnotation>>
  found:    ArrayList<FeatureExtractor1>
<https://builds.apache.org/job/ctakes-trunk-compiletest/org.apache.ctakes$ctakes-assertion/ws/src/main/java/org/apache/ctakes/assertion/medfacts/cleartk/GenericCleartkAnalysisEngine.java>:[70,35]
[unchecked] unchecked conversion
[ERROR]   required: FeatureExtractor1<IdentifiedAnnotation>
  found:    ContextWordWindowExtractor
<https://builds.apache.org/job/ctakes-trunk-compiletest/org.apache.ctakes$ctakes-assertion/ws/src/main/java/org/apache/ctakes/assertion/medfacts/cleartk/GenericCleartkAnalysisEngine.java>:[71,35]
[unchecked] unchecked conversion
[INFO] 77 errors 
[INFO] -------------------------------------------------------------
[JENKINS] Archiving disabled

Mime
View raw message