ctakes-notifications mailing list archives

Site index · List index
Message view « Date » · « Thread »
Top « Date » · « Thread »
From Apache Jenkins Server <jenk...@builds.apache.org>
Subject Build failed in Jenkins: ctakes-trunk-compiletest #555
Date Wed, 15 Oct 2014 15:29:57 GMT
See <https://builds.apache.org/job/ctakes-trunk-compiletest/555/changes>

Changes:

[tmill] Changed signature of method to allow public access and semantic class info.

------------------------------------------
[...truncated 6047 lines...]
[JENKINS] Archiving disabled
[JENKINS] Archiving disabled
[JENKINS] Archiving disabled
[JENKINS] Archiving disabled
[JENKINS] Archiving disabled
[JENKINS] Archiving disabled
[JENKINS] Archiving disabled
[JENKINS] Archiving disabled
[JENKINS] Archiving disabled
[JENKINS] Archiving disabled
[JENKINS] Archiving disabled
[JENKINS] Archiving disabled
[JENKINS] Archiving disabled
[JENKINS] Archiving disabled
[JENKINS] Archiving disabled
[JENKINS] Archiving disabled
[JENKINS] Archiving disabled
[JENKINS] Archiving disabled
[JENKINS] Archiving disabled
[JENKINS] Archiving disabled
[JENKINS] Archiving disabled
[JENKINS] Archiving disabled
[JENKINS] Archiving disabled
[JENKINS] Archiving disabled
[JENKINS] Archiving disabled
[JENKINS] Archiving disabled
[JENKINS] Archiving disabled
[JENKINS] Archiving disabled
[JENKINS] Archiving disabled
[JENKINS] Archiving disabled
[JENKINS] Archiving disabled
[JENKINS] Archiving disabled
[JENKINS] Archiving disabled
[JENKINS] Archiving disabled
[JENKINS] Archiving disabled
[JENKINS] Archiving disabled
Waiting for Jenkins to finish collecting data
[ERROR] Failed to execute goal org.apache.maven.plugins:maven-compiler-plugin:2.4:compile
(default-compile) on project ctakes-assertion: Compilation failure: Compilation failure:
[ERROR] <https://builds.apache.org/job/ctakes-trunk-compiletest/ws/ctakes-assertion/src/main/java/org/apache/ctakes/assertion/medfacts/cleartk/AssertionCleartkAnalysisEngine.java>:[277,11]
[unchecked] unchecked call to TypePathExtractor(Class<T>,String) as a member of the
raw type TypePathExtractor
[ERROR] where T is a type-variable:
[ERROR] T extends Annotation declared in class TypePathExtractor
[ERROR] <https://builds.apache.org/job/ctakes-trunk-compiletest/ws/ctakes-assertion/src/main/java/org/apache/ctakes/assertion/medfacts/cleartk/AssertionCleartkAnalysisEngine.java>:[278,11]
[unchecked] unchecked call to TypePathExtractor(Class<T>,String) as a member of the
raw type TypePathExtractor
[ERROR] where T is a type-variable:
[ERROR] T extends Annotation declared in class TypePathExtractor
[ERROR] <https://builds.apache.org/job/ctakes-trunk-compiletest/ws/ctakes-assertion/src/main/java/org/apache/ctakes/assertion/medfacts/cleartk/AssertionCleartkAnalysisEngine.java>:[279,11]
[unchecked] unchecked call to TypePathExtractor(Class<T>,String) as a member of the
raw type TypePathExtractor
[ERROR] where T is a type-variable:
[ERROR] T extends Annotation declared in class TypePathExtractor
[ERROR] <https://builds.apache.org/job/ctakes-trunk-compiletest/ws/ctakes-assertion/src/main/java/org/apache/ctakes/assertion/medfacts/cleartk/AssertionCleartkAnalysisEngine.java>:[274,8]
[unchecked] unchecked call to CombinedExtractor1(FeatureExtractor1<T>,FeatureExtractor1<T>,FeatureExtractor1<T>,FeatureExtractor1<T>)
as a member of the raw type CombinedExtractor1
[ERROR] where T is a type-variable:
[ERROR] T extends Annotation declared in class CombinedExtractor1
[ERROR] <https://builds.apache.org/job/ctakes-trunk-compiletest/ws/ctakes-assertion/src/main/java/org/apache/ctakes/assertion/medfacts/cleartk/AssertionCleartkAnalysisEngine.java>:[282,33]
[unchecked] unchecked call to CleartkExtractor(Class<SEARCH_T>,FeatureExtractor1<SEARCH_T>,Context...)
as a member of the raw type CleartkExtractor
[ERROR] where SEARCH_T is a type-variable:
[ERROR] SEARCH_T extends Annotation declared in class CleartkExtractor
[ERROR] <https://builds.apache.org/job/ctakes-trunk-compiletest/ws/ctakes-assertion/src/main/java/org/apache/ctakes/assertion/medfacts/cleartk/AssertionCleartkAnalysisEngine.java>:[282,33]
[unchecked] unchecked conversion
[ERROR] required: CleartkExtractor<IdentifiedAnnotation,BaseToken>
[ERROR] found:    CleartkExtractor
[ERROR] <https://builds.apache.org/job/ctakes-trunk-compiletest/ws/ctakes-assertion/src/main/java/org/apache/ctakes/assertion/medfacts/cleartk/AssertionCleartkAnalysisEngine.java>:[408,41]
[unchecked] unchecked call to extract(JCas,FOCUS_T) as a member of the raw type CleartkExtractor
[ERROR] where FOCUS_T is a type-variable:
[ERROR] FOCUS_T extends Annotation declared in class CleartkExtractor
[ERROR] <https://builds.apache.org/job/ctakes-trunk-compiletest/ws/ctakes-assertion/src/main/java/org/apache/ctakes/assertion/medfacts/cleartk/AssertionCleartkAnalysisEngine.java>:[408,41]
[unchecked] unchecked conversion
[ERROR] required: Collection<Feature>
[ERROR] found:    List
[ERROR] <https://builds.apache.org/job/ctakes-trunk-compiletest/ws/ctakes-assertion/src/main/java/org/apache/ctakes/assertion/medfacts/cleartk/AssertionCleartkAnalysisEngine.java>:[472,41]
[unchecked] unchecked call to extract(JCas,T) as a member of the raw type FeatureExtractor1
[ERROR] where T is a type-variable:
[ERROR] T extends Annotation declared in interface FeatureExtractor1
[ERROR] <https://builds.apache.org/job/ctakes-trunk-compiletest/ws/ctakes-assertion/src/main/java/org/apache/ctakes/assertion/medfacts/cleartk/AssertionCleartkAnalysisEngine.java>:[472,41]
[unchecked] unchecked conversion
[ERROR] required: Collection<Feature>
[ERROR] found:    List
[ERROR] <https://builds.apache.org/job/ctakes-trunk-compiletest/ws/ctakes-assertion/src/main/java/org/apache/ctakes/assertion/medfacts/cleartk/AssertionCleartkAnalysisEngine.java>:[477,41]
[unchecked] unchecked call to extract(JCas,T) as a member of the raw type FeatureExtractor1
[ERROR] where T is a type-variable:
[ERROR] T extends Annotation declared in interface FeatureExtractor1
[ERROR] <https://builds.apache.org/job/ctakes-trunk-compiletest/ws/ctakes-assertion/src/main/java/org/apache/ctakes/assertion/medfacts/cleartk/AssertionCleartkAnalysisEngine.java>:[477,41]
[unchecked] unchecked conversion
[ERROR] required: Collection<Feature>
[ERROR] found:    List
[ERROR] <https://builds.apache.org/job/ctakes-trunk-compiletest/ws/ctakes-assertion/src/main/java/org/apache/ctakes/assertion/medfacts/cleartk/AssertionCleartkAnalysisEngine.java>:[500,41]
[unchecked] unchecked call to extract(JCas,T) as a member of the raw type FeatureFunctionExtractor
[ERROR] where T is a type-variable:
[ERROR] T extends Annotation declared in class FeatureFunctionExtractor
[ERROR] <https://builds.apache.org/job/ctakes-trunk-compiletest/ws/ctakes-assertion/src/main/java/org/apache/ctakes/assertion/medfacts/cleartk/AssertionCleartkAnalysisEngine.java>:[500,41]
[unchecked] unchecked conversion
[ERROR] required: Collection<Feature>
[ERROR] found:    List
[ERROR] <https://builds.apache.org/job/ctakes-trunk-compiletest/ws/ctakes-assertion/src/main/java/org/apache/ctakes/assertion/medfacts/cleartk/AssertionCleartkAnalysisEngine.java>:[575,37]
[unchecked] unchecked conversion
[ERROR] required: List<String>
[ERROR] found:    List
[ERROR] <https://builds.apache.org/job/ctakes-trunk-compiletest/ws/ctakes-assertion/src/main/java/org/apache/ctakes/assertion/eval/AssertionEvaluation.java>:[437,55]
[unchecked] unchecked call to addAll(AnnotationStatisticsCompact<OUTCOME_TYPE>) as a
member of the raw type AnnotationStatisticsCompact
[ERROR] where OUTCOME_TYPE is a type-variable:
[ERROR] OUTCOME_TYPE extends Comparable<? super OUTCOME_TYPE> declared in class AnnotationStatisticsCompact
[ERROR] <https://builds.apache.org/job/ctakes-trunk-compiletest/ws/ctakes-assertion/src/main/java/org/apache/ctakes/assertion/eval/AssertionEvaluation.java>:[456,106]
[unchecked] unchecked call to f1(OUTCOME_TYPE) as a member of the raw type AnnotationStatisticsCompact
[ERROR] where OUTCOME_TYPE is a type-variable:
[ERROR] OUTCOME_TYPE extends Comparable<? super OUTCOME_TYPE> declared in class AnnotationStatisticsCompact
[ERROR] <https://builds.apache.org/job/ctakes-trunk-compiletest/ws/ctakes-assertion/src/main/java/org/apache/ctakes/assertion/eval/AssertionEvaluation.java>:[1042,24]
[unchecked] unchecked call to <ANNOTATION_TYPE,SPAN_TYPE>add(Collection<? extends
ANNOTATION_TYPE>,Collection<? extends ANNOTATION_TYPE>,Function<ANNOTATION_TYPE,SPAN_TYPE>,Function<ANNOTATION_TYPE,OUTCOME_TYPE>)
as a member of the raw type AnnotationStatisticsCompact
[ERROR] where ANNOTATION_TYPE,SPAN_TYPE,OUTCOME_TYPE are type-variables:
[ERROR] ANNOTATION_TYPE extends Object declared in method <ANNOTATION_TYPE,SPAN_TYPE>add(Collection<?
extends ANNOTATION_TYPE>,Collection<? extends ANNOTATION_TYPE>,Function<ANNOTATION_TYPE,SPAN_TYPE>,Function<ANNOTATION_TYPE,OUTCOME_TYPE>)
[ERROR] SPAN_TYPE extends Object declared in method <ANNOTATION_TYPE,SPAN_TYPE>add(Collection<?
extends ANNOTATION_TYPE>,Collection<? extends ANNOTATION_TYPE>,Function<ANNOTATION_TYPE,SPAN_TYPE>,Function<ANNOTATION_TYPE,OUTCOME_TYPE>)
[ERROR] OUTCOME_TYPE extends Comparable<? super OUTCOME_TYPE> declared in class AnnotationStatisticsCompact
[ERROR] <https://builds.apache.org/job/ctakes-trunk-compiletest/ws/ctakes-assertion/src/main/java/org/apache/ctakes/assertion/eval/AssertionEvaluation.java>:[1055,27]
[unchecked] unchecked call to <ANNOTATION_TYPE,SPAN_TYPE>add(Collection<? extends
ANNOTATION_TYPE>,Collection<? extends ANNOTATION_TYPE>,Function<ANNOTATION_TYPE,SPAN_TYPE>,Function<ANNOTATION_TYPE,OUTCOME_TYPE>)
as a member of the raw type AnnotationStatisticsCompact
[ERROR] where ANNOTATION_TYPE,SPAN_TYPE,OUTCOME_TYPE are type-variables:
[ERROR] ANNOTATION_TYPE extends Object declared in method <ANNOTATION_TYPE,SPAN_TYPE>add(Collection<?
extends ANNOTATION_TYPE>,Collection<? extends ANNOTATION_TYPE>,Function<ANNOTATION_TYPE,SPAN_TYPE>,Function<ANNOTATION_TYPE,OUTCOME_TYPE>)
[ERROR] SPAN_TYPE extends Object declared in method <ANNOTATION_TYPE,SPAN_TYPE>add(Collection<?
extends ANNOTATION_TYPE>,Collection<? extends ANNOTATION_TYPE>,Function<ANNOTATION_TYPE,SPAN_TYPE>,Function<ANNOTATION_TYPE,OUTCOME_TYPE>)
[ERROR] OUTCOME_TYPE extends Comparable<? super OUTCOME_TYPE> declared in class AnnotationStatisticsCompact
[ERROR] <https://builds.apache.org/job/ctakes-trunk-compiletest/ws/ctakes-assertion/src/main/java/org/apache/ctakes/assertion/eval/AssertionEvaluation.java>:[1065,27]
[unchecked] unchecked call to <ANNOTATION_TYPE,SPAN_TYPE>add(Collection<? extends
ANNOTATION_TYPE>,Collection<? extends ANNOTATION_TYPE>,Function<ANNOTATION_TYPE,SPAN_TYPE>,Function<ANNOTATION_TYPE,OUTCOME_TYPE>)
as a member of the raw type AnnotationStatisticsCompact
[ERROR] where ANNOTATION_TYPE,SPAN_TYPE,OUTCOME_TYPE are type-variables:
[ERROR] ANNOTATION_TYPE extends Object declared in method <ANNOTATION_TYPE,SPAN_TYPE>add(Collection<?
extends ANNOTATION_TYPE>,Collection<? extends ANNOTATION_TYPE>,Function<ANNOTATION_TYPE,SPAN_TYPE>,Function<ANNOTATION_TYPE,OUTCOME_TYPE>)
[ERROR] SPAN_TYPE extends Object declared in method <ANNOTATION_TYPE,SPAN_TYPE>add(Collection<?
extends ANNOTATION_TYPE>,Collection<? extends ANNOTATION_TYPE>,Function<ANNOTATION_TYPE,SPAN_TYPE>,Function<ANNOTATION_TYPE,OUTCOME_TYPE>)
[ERROR] OUTCOME_TYPE extends Comparable<? super OUTCOME_TYPE> declared in class AnnotationStatisticsCompact
[ERROR] <https://builds.apache.org/job/ctakes-trunk-compiletest/ws/ctakes-assertion/src/main/java/org/apache/ctakes/assertion/eval/AssertionEvaluation.java>:[1075,23]
[unchecked] unchecked call to <ANNOTATION_TYPE,SPAN_TYPE>add(Collection<? extends
ANNOTATION_TYPE>,Collection<? extends ANNOTATION_TYPE>,Function<ANNOTATION_TYPE,SPAN_TYPE>,Function<ANNOTATION_TYPE,OUTCOME_TYPE>)
as a member of the raw type AnnotationStatisticsCompact
[ERROR] where ANNOTATION_TYPE,SPAN_TYPE,OUTCOME_TYPE are type-variables:
[ERROR] ANNOTATION_TYPE extends Object declared in method <ANNOTATION_TYPE,SPAN_TYPE>add(Collection<?
extends ANNOTATION_TYPE>,Collection<? extends ANNOTATION_TYPE>,Function<ANNOTATION_TYPE,SPAN_TYPE>,Function<ANNOTATION_TYPE,OUTCOME_TYPE>)
[ERROR] SPAN_TYPE extends Object declared in method <ANNOTATION_TYPE,SPAN_TYPE>add(Collection<?
extends ANNOTATION_TYPE>,Collection<? extends ANNOTATION_TYPE>,Function<ANNOTATION_TYPE,SPAN_TYPE>,Function<ANNOTATION_TYPE,OUTCOME_TYPE>)
[ERROR] OUTCOME_TYPE extends Comparable<? super OUTCOME_TYPE> declared in class AnnotationStatisticsCompact
[ERROR] <https://builds.apache.org/job/ctakes-trunk-compiletest/ws/ctakes-assertion/src/main/java/org/apache/ctakes/assertion/eval/AssertionEvaluation.java>:[1085,23]
[unchecked] unchecked call to <ANNOTATION_TYPE,SPAN_TYPE>add(Collection<? extends
ANNOTATION_TYPE>,Collection<? extends ANNOTATION_TYPE>,Function<ANNOTATION_TYPE,SPAN_TYPE>,Function<ANNOTATION_TYPE,OUTCOME_TYPE>)
as a member of the raw type AnnotationStatisticsCompact
[ERROR] where ANNOTATION_TYPE,SPAN_TYPE,OUTCOME_TYPE are type-variables:
[ERROR] ANNOTATION_TYPE extends Object declared in method <ANNOTATION_TYPE,SPAN_TYPE>add(Collection<?
extends ANNOTATION_TYPE>,Collection<? extends ANNOTATION_TYPE>,Function<ANNOTATION_TYPE,SPAN_TYPE>,Function<ANNOTATION_TYPE,OUTCOME_TYPE>)
[ERROR] SPAN_TYPE extends Object declared in method <ANNOTATION_TYPE,SPAN_TYPE>add(Collection<?
extends ANNOTATION_TYPE>,Collection<? extends ANNOTATION_TYPE>,Function<ANNOTATION_TYPE,SPAN_TYPE>,Function<ANNOTATION_TYPE,OUTCOME_TYPE>)
[ERROR] OUTCOME_TYPE extends Comparable<? super OUTCOME_TYPE> declared in class AnnotationStatisticsCompact
[ERROR] <https://builds.apache.org/job/ctakes-trunk-compiletest/ws/ctakes-assertion/src/main/java/org/apache/ctakes/assertion/eval/AssertionEvaluation.java>:[1096,23]
[unchecked] unchecked call to <ANNOTATION_TYPE,SPAN_TYPE>add(Collection<? extends
ANNOTATION_TYPE>,Collection<? extends ANNOTATION_TYPE>,Function<ANNOTATION_TYPE,SPAN_TYPE>,Function<ANNOTATION_TYPE,OUTCOME_TYPE>)
as a member of the raw type AnnotationStatisticsCompact
[ERROR] where ANNOTATION_TYPE,SPAN_TYPE,OUTCOME_TYPE are type-variables:
[ERROR] ANNOTATION_TYPE extends Object declared in method <ANNOTATION_TYPE,SPAN_TYPE>add(Collection<?
extends ANNOTATION_TYPE>,Collection<? extends ANNOTATION_TYPE>,Function<ANNOTATION_TYPE,SPAN_TYPE>,Function<ANNOTATION_TYPE,OUTCOME_TYPE>)
[ERROR] SPAN_TYPE extends Object declared in method <ANNOTATION_TYPE,SPAN_TYPE>add(Collection<?
extends ANNOTATION_TYPE>,Collection<? extends ANNOTATION_TYPE>,Function<ANNOTATION_TYPE,SPAN_TYPE>,Function<ANNOTATION_TYPE,OUTCOME_TYPE>)
[ERROR] OUTCOME_TYPE extends Comparable<? super OUTCOME_TYPE> declared in class AnnotationStatisticsCompact
[ERROR] <https://builds.apache.org/job/ctakes-trunk-compiletest/ws/ctakes-assertion/src/main/java/org/apache/ctakes/assertion/eval/AssertionEvaluation.java>:[1164,24]
[unchecked] unchecked call to write(Instance<OUTCOME_TYPE>) as a member of the raw type
DataWriter
[ERROR] where OUTCOME_TYPE is a type-variable:
[ERROR] OUTCOME_TYPE extends Object declared in interface DataWriter
[ERROR] <https://builds.apache.org/job/ctakes-trunk-compiletest/ws/ctakes-assertion/src/main/java/org/apache/ctakes/assertion/eval/AnnotationStatisticsCompact.java>:[270,49]
[unchecked] Possible heap pollution from parameterized vararg type OUTCOME_TYPE
[ERROR] where OUTCOME_TYPE is a type-variable:
[ERROR] OUTCOME_TYPE extends Comparable<? super OUTCOME_TYPE> declared in class AnnotationStatisticsCompact
[ERROR] <https://builds.apache.org/job/ctakes-trunk-compiletest/ws/ctakes-assertion/src/main/java/org/apache/ctakes/assertion/eval/AnnotationStatisticsCompact.java>:[289,49]
[unchecked] Possible heap pollution from parameterized vararg type OUTCOME_TYPE
[ERROR] where OUTCOME_TYPE is a type-variable:
[ERROR] OUTCOME_TYPE extends Comparable<? super OUTCOME_TYPE> declared in class AnnotationStatisticsCompact
[ERROR] <https://builds.apache.org/job/ctakes-trunk-compiletest/ws/ctakes-assertion/src/main/java/org/apache/ctakes/assertion/eval/AnnotationStatisticsCompact.java>:[309,48]
[unchecked] Possible heap pollution from parameterized vararg type OUTCOME_TYPE
[ERROR] where OUTCOME_TYPE is a type-variable:
[ERROR] OUTCOME_TYPE extends Comparable<? super OUTCOME_TYPE> declared in class AnnotationStatisticsCompact
[ERROR] <https://builds.apache.org/job/ctakes-trunk-compiletest/ws/ctakes-assertion/src/main/java/org/apache/ctakes/assertion/eval/AnnotationStatisticsCompact.java>:[330,48]
[unchecked] Possible heap pollution from parameterized vararg type OUTCOME_TYPE
[ERROR] where OUTCOME_TYPE is a type-variable:
[ERROR] OUTCOME_TYPE extends Comparable<? super OUTCOME_TYPE> declared in class AnnotationStatisticsCompact
[ERROR] <https://builds.apache.org/job/ctakes-trunk-compiletest/ws/ctakes-assertion/src/main/java/org/apache/ctakes/assertion/medfacts/cleartk/extractors/CueWordTest2.java>:[94,11]
[unchecked] unchecked call to TypePathExtractor(Class<T>,String) as a member of the
raw type TypePathExtractor
[ERROR] where T is a type-variable:
[ERROR] T extends Annotation declared in class TypePathExtractor
[ERROR] <https://builds.apache.org/job/ctakes-trunk-compiletest/ws/ctakes-assertion/src/main/java/org/apache/ctakes/assertion/medfacts/cleartk/extractors/CueWordTest2.java>:[95,11]
[unchecked] unchecked call to TypePathExtractor(Class<T>,String) as a member of the
raw type TypePathExtractor
[ERROR] where T is a type-variable:
[ERROR] T extends Annotation declared in class TypePathExtractor
[ERROR] <https://builds.apache.org/job/ctakes-trunk-compiletest/ws/ctakes-assertion/src/main/java/org/apache/ctakes/assertion/medfacts/cleartk/extractors/CueWordTest2.java>:[96,11]
[unchecked] unchecked call to TypePathExtractor(Class<T>,String) as a member of the
raw type TypePathExtractor
[ERROR] where T is a type-variable:
[ERROR] T extends Annotation declared in class TypePathExtractor
[ERROR] <https://builds.apache.org/job/ctakes-trunk-compiletest/ws/ctakes-assertion/src/main/java/org/apache/ctakes/assertion/medfacts/cleartk/extractors/CueWordTest2.java>:[91,8]
[unchecked] unchecked call to CombinedExtractor1(FeatureExtractor1<T>,FeatureExtractor1<T>,FeatureExtractor1<T>,FeatureExtractor1<T>)
as a member of the raw type CombinedExtractor1
[ERROR] where T is a type-variable:
[ERROR] T extends Annotation declared in class CombinedExtractor1
[ERROR] <https://builds.apache.org/job/ctakes-trunk-compiletest/ws/ctakes-assertion/src/main/java/org/apache/ctakes/assertion/medfacts/cleartk/extractors/CueWordTest2.java>:[100,8]
[unchecked] unchecked call to CleartkExtractor(Class<SEARCH_T>,FeatureExtractor1<SEARCH_T>,Context...)
as a member of the raw type CleartkExtractor
[ERROR] where SEARCH_T is a type-variable:
[ERROR] SEARCH_T extends Annotation declared in class CleartkExtractor
[ERROR] <https://builds.apache.org/job/ctakes-trunk-compiletest/ws/ctakes-assertion/src/main/java/org/apache/ctakes/assertion/medfacts/cleartk/extractors/CueWordTest2.java>:[113,8]
[unchecked] unchecked call to CleartkExtractor(Class<SEARCH_T>,FeatureExtractor1<SEARCH_T>,Context...)
as a member of the raw type CleartkExtractor
[ERROR] where SEARCH_T is a type-variable:
[ERROR] SEARCH_T extends Annotation declared in class CleartkExtractor
[ERROR] <https://builds.apache.org/job/ctakes-trunk-compiletest/ws/ctakes-assertion/src/main/java/org/apache/ctakes/assertion/medfacts/cleartk/extractors/CueWordTest2.java>:[127,12]
[unchecked] unchecked call to TypePathExtractor(Class<T>,String) as a member of the
raw type TypePathExtractor
[ERROR] where T is a type-variable:
[ERROR] T extends Annotation declared in class TypePathExtractor
[ERROR] <https://builds.apache.org/job/ctakes-trunk-compiletest/ws/ctakes-assertion/src/main/java/org/apache/ctakes/assertion/medfacts/cleartk/extractors/CueWordTest2.java>:[125,8]
[unchecked] unchecked call to CleartkExtractor(Class<SEARCH_T>,FeatureExtractor1<SEARCH_T>,Context...)
as a member of the raw type CleartkExtractor
[ERROR] where SEARCH_T is a type-variable:
[ERROR] SEARCH_T extends Annotation declared in class CleartkExtractor
[ERROR] <https://builds.apache.org/job/ctakes-trunk-compiletest/ws/ctakes-assertion/src/main/java/org/apache/ctakes/assertion/medfacts/cleartk/extractors/CueWordTest2.java>:[165,50]
[unchecked] unchecked call to extractWithin(JCas,FOCUS_T,Annotation) as a member of the raw
type CleartkExtractor
[ERROR] where FOCUS_T is a type-variable:
[ERROR] FOCUS_T extends Annotation declared in class CleartkExtractor
[ERROR] <https://builds.apache.org/job/ctakes-trunk-compiletest/ws/ctakes-assertion/src/main/java/org/apache/ctakes/assertion/medfacts/cleartk/extractors/CueWordTest2.java>:[165,50]
[unchecked] unchecked conversion
[ERROR] required: List<Feature>
[ERROR] found:    List
[ERROR] <https://builds.apache.org/job/ctakes-trunk-compiletest/ws/ctakes-assertion/src/main/java/org/apache/ctakes/assertion/medfacts/cleartk/extractors/CueWordTest2.java>:[175,40]
[unchecked] unchecked call to extractWithin(JCas,FOCUS_T,Annotation) as a member of the raw
type CleartkExtractor
[ERROR] where FOCUS_T is a type-variable:
[ERROR] FOCUS_T extends Annotation declared in class CleartkExtractor
[ERROR] <https://builds.apache.org/job/ctakes-trunk-compiletest/ws/ctakes-assertion/src/main/java/org/apache/ctakes/assertion/medfacts/cleartk/extractors/CueWordTest2.java>:[175,40]
[unchecked] unchecked conversion
[ERROR] required: List<Feature>
[ERROR] found:    List
[ERROR] <https://builds.apache.org/job/ctakes-trunk-compiletest/ws/ctakes-assertion/src/main/java/org/apache/ctakes/assertion/medfacts/cleartk/HistoryCleartkAnalysisEngine.java>:[70,34]
error: incompatible types
[ERROR] required: List<FeatureExtractor1<IdentifiedAnnotation>>
[ERROR] found:    ArrayList<FeatureExtractor1>
[ERROR] <https://builds.apache.org/job/ctakes-trunk-compiletest/ws/ctakes-assertion/src/main/java/org/apache/ctakes/assertion/medfacts/cleartk/HistoryCleartkAnalysisEngine.java>:[73,35]
[unchecked] unchecked conversion
[ERROR] required: FeatureExtractor1<IdentifiedAnnotation>
[ERROR] found:    HistoryFeaturesExtractor
[ERROR] <https://builds.apache.org/job/ctakes-trunk-compiletest/ws/ctakes-assertion/src/main/java/org/apache/ctakes/assertion/medfacts/cleartk/SubjectCleartkAnalysisEngine.java>:[66,36]
[unchecked] unchecked conversion
[ERROR] required: FeatureExtractor1<IdentifiedAnnotation>
[ERROR] found:    SubjectFeaturesExtractor
[ERROR] <https://builds.apache.org/job/ctakes-trunk-compiletest/ws/ctakes-assertion/src/main/java/org/apache/ctakes/assertion/medfacts/cleartk/extractors/DependencyWordsFragmentExtractor.java>:[37,7]
error: DependencyWordsFragmentExtractor is not abstract and does not override abstract method
extract(JCas,IdentifiedAnnotation) in TreeFragmentFeatureExtractor
[ERROR] <https://builds.apache.org/job/ctakes-trunk-compiletest/ws/ctakes-assertion/src/main/java/org/apache/ctakes/assertion/medfacts/cleartk/extractors/DependencyWordsFragmentExtractor.java>:[44,23]
error: name clash: extract(JCas,Annotation) in DependencyWordsFragmentExtractor and extract(JCas,T)
in FeatureExtractor1 have the same erasure, yet neither overrides the other
[ERROR] where T is a type-variable:
[ERROR] T extends Annotation declared in interface FeatureExtractor1
[ERROR] <https://builds.apache.org/job/ctakes-trunk-compiletest/ws/ctakes-assertion/src/main/java/org/apache/ctakes/assertion/cr/XmiCollectionReaderCtakes.java>:[80,18]
[unchecked] unchecked call to add(E) as a member of the raw type ArrayList
[ERROR] where E is a type-variable:
[ERROR] E extends Object declared in class ArrayList
[ERROR] <https://builds.apache.org/job/ctakes-trunk-compiletest/ws/ctakes-assertion/src/main/java/org/apache/ctakes/assertion/pipelines/RunJudgeAttributeInstances.java>:[111,35]
[unchecked] unchecked conversion
[ERROR] required: List<File>
[ERROR] found:    List
[ERROR] <https://builds.apache.org/job/ctakes-trunk-compiletest/ws/ctakes-assertion/src/main/java/org/apache/ctakes/assertion/medfacts/cleartk/PolarityCleartkAnalysisEngine.java>:[57,34]
error: incompatible types
[ERROR] required: List<FeatureExtractor1<IdentifiedAnnotation>>
[ERROR] found:    ArrayList<FeatureExtractor1>
[ERROR] <https://builds.apache.org/job/ctakes-trunk-compiletest/ws/ctakes-assertion/src/main/java/org/apache/ctakes/assertion/medfacts/cleartk/PolarityCleartkAnalysisEngine.java>:[78,37]
[unchecked] unchecked conversion
[ERROR] required: FeatureExtractor1<IdentifiedAnnotation>
[ERROR] found:    NegationDependencyFeatureExtractor
[ERROR] <https://builds.apache.org/job/ctakes-trunk-compiletest/ws/ctakes-assertion/src/main/java/org/apache/ctakes/assertion/medfacts/cleartk/PolarityFedaCleartkAnalysisEngine.java>:[52,34]
error: incompatible types
[ERROR] required: List<FeatureExtractor1<IdentifiedAnnotation>>
[ERROR] found:    ArrayList<FeatureExtractor1>
[ERROR] <https://builds.apache.org/job/ctakes-trunk-compiletest/ws/ctakes-assertion/src/main/java/org/apache/ctakes/assertion/medfacts/cleartk/PolarityFedaCleartkAnalysisEngine.java>:[54,35]
[unchecked] unchecked conversion
[ERROR] required: FeatureExtractor1<IdentifiedAnnotation>
[ERROR] found:    NegationDependencyFeatureExtractor
[ERROR] <https://builds.apache.org/job/ctakes-trunk-compiletest/ws/ctakes-assertion/src/main/java/org/apache/ctakes/assertion/medfacts/cleartk/PolarityFedaCleartkAnalysisEngine.java>:[115,32]
[unchecked] unchecked call to FeatureFunctionExtractor(FeatureExtractor1<T>,FeatureFunction...)
as a member of the raw type FeatureFunctionExtractor
[ERROR] where T is a type-variable:
[ERROR] T extends Annotation declared in class FeatureFunctionExtractor
[ERROR] <https://builds.apache.org/job/ctakes-trunk-compiletest/ws/ctakes-assertion/src/main/java/org/apache/ctakes/assertion/medfacts/cleartk/extractors/CueWordTest.java>:[94,11]
[unchecked] unchecked call to TypePathExtractor(Class<T>,String) as a member of the
raw type TypePathExtractor
[ERROR] where T is a type-variable:
[ERROR] T extends Annotation declared in class TypePathExtractor
[ERROR] <https://builds.apache.org/job/ctakes-trunk-compiletest/ws/ctakes-assertion/src/main/java/org/apache/ctakes/assertion/medfacts/cleartk/extractors/CueWordTest.java>:[95,11]
[unchecked] unchecked call to TypePathExtractor(Class<T>,String) as a member of the
raw type TypePathExtractor
[ERROR] where T is a type-variable:
[ERROR] T extends Annotation declared in class TypePathExtractor
[ERROR] <https://builds.apache.org/job/ctakes-trunk-compiletest/ws/ctakes-assertion/src/main/java/org/apache/ctakes/assertion/medfacts/cleartk/extractors/CueWordTest.java>:[96,11]
[unchecked] unchecked call to TypePathExtractor(Class<T>,String) as a member of the
raw type TypePathExtractor
[ERROR] where T is a type-variable:
[ERROR] T extends Annotation declared in class TypePathExtractor
[ERROR] <https://builds.apache.org/job/ctakes-trunk-compiletest/ws/ctakes-assertion/src/main/java/org/apache/ctakes/assertion/medfacts/cleartk/extractors/CueWordTest.java>:[91,8]
[unchecked] unchecked call to CombinedExtractor1(FeatureExtractor1<T>,FeatureExtractor1<T>,FeatureExtractor1<T>,FeatureExtractor1<T>)
as a member of the raw type CombinedExtractor1
[ERROR] where T is a type-variable:
[ERROR] T extends Annotation declared in class CombinedExtractor1
[ERROR] <https://builds.apache.org/job/ctakes-trunk-compiletest/ws/ctakes-assertion/src/main/java/org/apache/ctakes/assertion/medfacts/cleartk/extractors/CueWordTest.java>:[100,8]
[unchecked] unchecked call to CleartkExtractor(Class<SEARCH_T>,FeatureExtractor1<SEARCH_T>,Context...)
as a member of the raw type CleartkExtractor
[ERROR] where SEARCH_T is a type-variable:
[ERROR] SEARCH_T extends Annotation declared in class CleartkExtractor
[ERROR] <https://builds.apache.org/job/ctakes-trunk-compiletest/ws/ctakes-assertion/src/main/java/org/apache/ctakes/assertion/medfacts/cleartk/extractors/CueWordTest.java>:[142,50]
[unchecked] unchecked call to extractWithin(JCas,FOCUS_T,Annotation) as a member of the raw
type CleartkExtractor
[ERROR] where FOCUS_T is a type-variable:
[ERROR] FOCUS_T extends Annotation declared in class CleartkExtractor
[ERROR] <https://builds.apache.org/job/ctakes-trunk-compiletest/ws/ctakes-assertion/src/main/java/org/apache/ctakes/assertion/medfacts/cleartk/extractors/CueWordTest.java>:[142,50]
[unchecked] unchecked conversion
[ERROR] required: List<Feature>
[ERROR] found:    List
[ERROR] <https://builds.apache.org/job/ctakes-trunk-compiletest/ws/ctakes-assertion/src/main/java/org/apache/ctakes/assertion/medfacts/CasIndexer.java>:[74,21]
[unchecked] unchecked cast
[ERROR] required: T
[ERROR] found:    Annotation
[ERROR] where T is a type-variable:
[ERROR] T extends Annotation declared in class CasIndexer
[ERROR] <https://builds.apache.org/job/ctakes-trunk-compiletest/ws/ctakes-assertion/src/main/java/org/apache/ctakes/assertion/medfacts/cleartk/extractors/ExtractorListFeatureFunctionConverter.java>:[35,6]
[unchecked] unchecked call to FeatureFunctionExtractor(FeatureExtractor1<T>,FeatureFunction...)
as a member of the raw type FeatureFunctionExtractor
[ERROR] where T is a type-variable:
[ERROR] T extends Annotation declared in class FeatureFunctionExtractor
[ERROR] <https://builds.apache.org/job/ctakes-trunk-compiletest/ws/ctakes-assertion/src/main/java/org/apache/ctakes/assertion/medfacts/cleartk/GenericCleartkAnalysisEngine.java>:[68,34]
error: incompatible types
[ERROR] required: List<FeatureExtractor1<IdentifiedAnnotation>>
[ERROR] found:    ArrayList<FeatureExtractor1>
[ERROR] <https://builds.apache.org/job/ctakes-trunk-compiletest/ws/ctakes-assertion/src/main/java/org/apache/ctakes/assertion/medfacts/cleartk/GenericCleartkAnalysisEngine.java>:[71,35]
[unchecked] unchecked conversion
[ERROR] -> [Help 1]
[ERROR] 
[ERROR] To see the full stack trace of the errors, re-run Maven with the -e switch.
[ERROR] Re-run Maven using the -X switch to enable full debug logging.
[ERROR] 
[ERROR] For more information about the errors and possible solutions, please read the following
articles:
[ERROR] [Help 1] http://cwiki.apache.org/confluence/display/MAVEN/MojoFailureException
[ERROR] 
[ERROR] After correcting the problems, you can resume the build with the command
[ERROR]   mvn <goals> -rf :ctakes-assertion
Sending e-mails to: notifications@ctakes.apache.org timothy.miller@childrens.harvard.edu
channel stopped

Mime
View raw message