ctakes-notifications mailing list archives

Site index · List index
Message view « Date » · « Thread »
Top « Date » · « Thread »
From Apache Jenkins Server <jenk...@builds.apache.org>
Subject Build failed in Jenkins: ctakes-trunk-compiletest » Apache cTAKES Assertion #556
Date Wed, 15 Oct 2014 16:29:40 GMT
See <https://builds.apache.org/job/ctakes-trunk-compiletest/org.apache.ctakes$ctakes-assertion/556/changes>

Changes:

[tmill] Corrected a bunch of type issues in assertion inherited from parent class.

[tmill] Clean up types in assertion AE.

------------------------------------------
[INFO]                                                                         
[INFO] ------------------------------------------------------------------------
[INFO] Building Apache cTAKES Assertion 3.2.1-SNAPSHOT
[INFO] ------------------------------------------------------------------------
[INFO] 
[INFO] --- maven-clean-plugin:2.4.1:clean (default-clean) @ ctakes-assertion ---
[INFO] 
[INFO] --- maven-remote-resources-plugin:1.4:process (default) @ ctakes-assertion ---
Downloading: http://repo.maven.apache.org/maven2/jwnl/jwnl/1.3.3/jwnl-1.3.3.pom
[INFO] 
[INFO] --- maven-resources-plugin:2.5:resources (default-resources) @ ctakes-assertion ---
[debug] execute contextualize
[INFO] Using 'UTF-8' encoding to copy filtered resources.
[INFO] Copying 1 resource
[INFO] Copying 3 resources
[INFO] 
[INFO] --- jcasgen-maven-plugin:0.9.3:generate (default) @ ctakes-assertion ---
[INFO] JCasGen: Output going to '<https://builds.apache.org/job/ctakes-trunk-compiletest/org.apache.ctakes$ctakes-assertion/ws/target/generated-sources/jcasgen'>
[INFO] JCasGen: Reading the XML TAE descriptor, and creating types, for xml input file '<https://builds.apache.org/job/ctakes-trunk-compiletest/org.apache.ctakes$ctakes-assertion/ws/src/main/resources/org/apache/ctakes/assertion/types/TypeSystem.xml'.>
[INFO] JCasGen: Creating: 'org.apache.ctakes.assertion.medfacts.types.Assertion'.
[INFO] JCasGen: Creating: 'org.apache.ctakes.assertion.medfacts.types.Assertion_Type'.
[INFO] JCasGen: Creating: 'org.apache.ctakes.assertion.medfacts.types.Concept'.
[INFO] JCasGen: Creating: 'org.apache.ctakes.assertion.medfacts.types.Concept_Type'.
[INFO] 
[INFO] --- maven-compiler-plugin:2.4:compile (default-compile) @ ctakes-assertion ---
[INFO] Compiling 95 source files to <https://builds.apache.org/job/ctakes-trunk-compiletest/org.apache.ctakes$ctakes-assertion/ws/target/classes>
[INFO] -------------------------------------------------------------
[ERROR] COMPILATION ERROR : 
[INFO] -------------------------------------------------------------
[ERROR] <https://builds.apache.org/job/ctakes-trunk-compiletest/org.apache.ctakes$ctakes-assertion/ws/src/main/java/org/apache/ctakes/assertion/eval/AssertionEvaluation.java>:[437,55]
[unchecked] unchecked call to addAll(AnnotationStatisticsCompact<OUTCOME_TYPE>) as a
member of the raw type AnnotationStatisticsCompact
[ERROR]   where OUTCOME_TYPE is a type-variable:
    OUTCOME_TYPE extends Comparable<? super OUTCOME_TYPE> declared in class AnnotationStatisticsCompact
<https://builds.apache.org/job/ctakes-trunk-compiletest/org.apache.ctakes$ctakes-assertion/ws/src/main/java/org/apache/ctakes/assertion/eval/AssertionEvaluation.java>:[456,106]
[unchecked] unchecked call to f1(OUTCOME_TYPE) as a member of the raw type AnnotationStatisticsCompact
[ERROR]   where OUTCOME_TYPE is a type-variable:
    OUTCOME_TYPE extends Comparable<? super OUTCOME_TYPE> declared in class AnnotationStatisticsCompact
<https://builds.apache.org/job/ctakes-trunk-compiletest/org.apache.ctakes$ctakes-assertion/ws/src/main/java/org/apache/ctakes/assertion/eval/AssertionEvaluation.java>:[1042,24]
[unchecked] unchecked call to <ANNOTATION_TYPE,SPAN_TYPE>add(Collection<? extends
ANNOTATION_TYPE>,Collection<? extends ANNOTATION_TYPE>,Function<ANNOTATION_TYPE,SPAN_TYPE>,Function<ANNOTATION_TYPE,OUTCOME_TYPE>)
as a member of the raw type AnnotationStatisticsCompact
[ERROR]   where ANNOTATION_TYPE,SPAN_TYPE,OUTCOME_TYPE are type-variables:
    ANNOTATION_TYPE extends Object declared in method <ANNOTATION_TYPE,SPAN_TYPE>add(Collection<?
extends ANNOTATION_TYPE>,Collection<? extends ANNOTATION_TYPE>,Function<ANNOTATION_TYPE,SPAN_TYPE>,Function<ANNOTATION_TYPE,OUTCOME_TYPE>)
    SPAN_TYPE extends Object declared in method <ANNOTATION_TYPE,SPAN_TYPE>add(Collection<?
extends ANNOTATION_TYPE>,Collection<? extends ANNOTATION_TYPE>,Function<ANNOTATION_TYPE,SPAN_TYPE>,Function<ANNOTATION_TYPE,OUTCOME_TYPE>)
    OUTCOME_TYPE extends Comparable<? super OUTCOME_TYPE> declared in class AnnotationStatisticsCompact
<https://builds.apache.org/job/ctakes-trunk-compiletest/org.apache.ctakes$ctakes-assertion/ws/src/main/java/org/apache/ctakes/assertion/eval/AssertionEvaluation.java>:[1055,27]
[unchecked] unchecked call to <ANNOTATION_TYPE,SPAN_TYPE>add(Collection<? extends
ANNOTATION_TYPE>,Collection<? extends ANNOTATION_TYPE>,Function<ANNOTATION_TYPE,SPAN_TYPE>,Function<ANNOTATION_TYPE,OUTCOME_TYPE>)
as a member of the raw type AnnotationStatisticsCompact
[ERROR]   where ANNOTATION_TYPE,SPAN_TYPE,OUTCOME_TYPE are type-variables:
    ANNOTATION_TYPE extends Object declared in method <ANNOTATION_TYPE,SPAN_TYPE>add(Collection<?
extends ANNOTATION_TYPE>,Collection<? extends ANNOTATION_TYPE>,Function<ANNOTATION_TYPE,SPAN_TYPE>,Function<ANNOTATION_TYPE,OUTCOME_TYPE>)
    SPAN_TYPE extends Object declared in method <ANNOTATION_TYPE,SPAN_TYPE>add(Collection<?
extends ANNOTATION_TYPE>,Collection<? extends ANNOTATION_TYPE>,Function<ANNOTATION_TYPE,SPAN_TYPE>,Function<ANNOTATION_TYPE,OUTCOME_TYPE>)
    OUTCOME_TYPE extends Comparable<? super OUTCOME_TYPE> declared in class AnnotationStatisticsCompact
<https://builds.apache.org/job/ctakes-trunk-compiletest/org.apache.ctakes$ctakes-assertion/ws/src/main/java/org/apache/ctakes/assertion/eval/AssertionEvaluation.java>:[1065,27]
[unchecked] unchecked call to <ANNOTATION_TYPE,SPAN_TYPE>add(Collection<? extends
ANNOTATION_TYPE>,Collection<? extends ANNOTATION_TYPE>,Function<ANNOTATION_TYPE,SPAN_TYPE>,Function<ANNOTATION_TYPE,OUTCOME_TYPE>)
as a member of the raw type AnnotationStatisticsCompact
[ERROR]   where ANNOTATION_TYPE,SPAN_TYPE,OUTCOME_TYPE are type-variables:
    ANNOTATION_TYPE extends Object declared in method <ANNOTATION_TYPE,SPAN_TYPE>add(Collection<?
extends ANNOTATION_TYPE>,Collection<? extends ANNOTATION_TYPE>,Function<ANNOTATION_TYPE,SPAN_TYPE>,Function<ANNOTATION_TYPE,OUTCOME_TYPE>)
    SPAN_TYPE extends Object declared in method <ANNOTATION_TYPE,SPAN_TYPE>add(Collection<?
extends ANNOTATION_TYPE>,Collection<? extends ANNOTATION_TYPE>,Function<ANNOTATION_TYPE,SPAN_TYPE>,Function<ANNOTATION_TYPE,OUTCOME_TYPE>)
    OUTCOME_TYPE extends Comparable<? super OUTCOME_TYPE> declared in class AnnotationStatisticsCompact
<https://builds.apache.org/job/ctakes-trunk-compiletest/org.apache.ctakes$ctakes-assertion/ws/src/main/java/org/apache/ctakes/assertion/eval/AssertionEvaluation.java>:[1075,23]
[unchecked] unchecked call to <ANNOTATION_TYPE,SPAN_TYPE>add(Collection<? extends
ANNOTATION_TYPE>,Collection<? extends ANNOTATION_TYPE>,Function<ANNOTATION_TYPE,SPAN_TYPE>,Function<ANNOTATION_TYPE,OUTCOME_TYPE>)
as a member of the raw type AnnotationStatisticsCompact
[ERROR]   where ANNOTATION_TYPE,SPAN_TYPE,OUTCOME_TYPE are type-variables:
    ANNOTATION_TYPE extends Object declared in method <ANNOTATION_TYPE,SPAN_TYPE>add(Collection<?
extends ANNOTATION_TYPE>,Collection<? extends ANNOTATION_TYPE>,Function<ANNOTATION_TYPE,SPAN_TYPE>,Function<ANNOTATION_TYPE,OUTCOME_TYPE>)
    SPAN_TYPE extends Object declared in method <ANNOTATION_TYPE,SPAN_TYPE>add(Collection<?
extends ANNOTATION_TYPE>,Collection<? extends ANNOTATION_TYPE>,Function<ANNOTATION_TYPE,SPAN_TYPE>,Function<ANNOTATION_TYPE,OUTCOME_TYPE>)
    OUTCOME_TYPE extends Comparable<? super OUTCOME_TYPE> declared in class AnnotationStatisticsCompact
<https://builds.apache.org/job/ctakes-trunk-compiletest/org.apache.ctakes$ctakes-assertion/ws/src/main/java/org/apache/ctakes/assertion/eval/AssertionEvaluation.java>:[1085,23]
[unchecked] unchecked call to <ANNOTATION_TYPE,SPAN_TYPE>add(Collection<? extends
ANNOTATION_TYPE>,Collection<? extends ANNOTATION_TYPE>,Function<ANNOTATION_TYPE,SPAN_TYPE>,Function<ANNOTATION_TYPE,OUTCOME_TYPE>)
as a member of the raw type AnnotationStatisticsCompact
[ERROR]   where ANNOTATION_TYPE,SPAN_TYPE,OUTCOME_TYPE are type-variables:
    ANNOTATION_TYPE extends Object declared in method <ANNOTATION_TYPE,SPAN_TYPE>add(Collection<?
extends ANNOTATION_TYPE>,Collection<? extends ANNOTATION_TYPE>,Function<ANNOTATION_TYPE,SPAN_TYPE>,Function<ANNOTATION_TYPE,OUTCOME_TYPE>)
    SPAN_TYPE extends Object declared in method <ANNOTATION_TYPE,SPAN_TYPE>add(Collection<?
extends ANNOTATION_TYPE>,Collection<? extends ANNOTATION_TYPE>,Function<ANNOTATION_TYPE,SPAN_TYPE>,Function<ANNOTATION_TYPE,OUTCOME_TYPE>)
    OUTCOME_TYPE extends Comparable<? super OUTCOME_TYPE> declared in class AnnotationStatisticsCompact
<https://builds.apache.org/job/ctakes-trunk-compiletest/org.apache.ctakes$ctakes-assertion/ws/src/main/java/org/apache/ctakes/assertion/eval/AssertionEvaluation.java>:[1096,23]
[unchecked] unchecked call to <ANNOTATION_TYPE,SPAN_TYPE>add(Collection<? extends
ANNOTATION_TYPE>,Collection<? extends ANNOTATION_TYPE>,Function<ANNOTATION_TYPE,SPAN_TYPE>,Function<ANNOTATION_TYPE,OUTCOME_TYPE>)
as a member of the raw type AnnotationStatisticsCompact
[ERROR]   where ANNOTATION_TYPE,SPAN_TYPE,OUTCOME_TYPE are type-variables:
    ANNOTATION_TYPE extends Object declared in method <ANNOTATION_TYPE,SPAN_TYPE>add(Collection<?
extends ANNOTATION_TYPE>,Collection<? extends ANNOTATION_TYPE>,Function<ANNOTATION_TYPE,SPAN_TYPE>,Function<ANNOTATION_TYPE,OUTCOME_TYPE>)
    SPAN_TYPE extends Object declared in method <ANNOTATION_TYPE,SPAN_TYPE>add(Collection<?
extends ANNOTATION_TYPE>,Collection<? extends ANNOTATION_TYPE>,Function<ANNOTATION_TYPE,SPAN_TYPE>,Function<ANNOTATION_TYPE,OUTCOME_TYPE>)
    OUTCOME_TYPE extends Comparable<? super OUTCOME_TYPE> declared in class AnnotationStatisticsCompact
<https://builds.apache.org/job/ctakes-trunk-compiletest/org.apache.ctakes$ctakes-assertion/ws/src/main/java/org/apache/ctakes/assertion/eval/AssertionEvaluation.java>:[1164,24]
[unchecked] unchecked call to write(Instance<OUTCOME_TYPE>) as a member of the raw type
DataWriter
[ERROR]   where OUTCOME_TYPE is a type-variable:
    OUTCOME_TYPE extends Object declared in interface DataWriter
<https://builds.apache.org/job/ctakes-trunk-compiletest/org.apache.ctakes$ctakes-assertion/ws/src/main/java/org/apache/ctakes/assertion/eval/AnnotationStatisticsCompact.java>:[270,49]
[unchecked] Possible heap pollution from parameterized vararg type OUTCOME_TYPE
[ERROR]   where OUTCOME_TYPE is a type-variable:
    OUTCOME_TYPE extends Comparable<? super OUTCOME_TYPE> declared in class AnnotationStatisticsCompact
<https://builds.apache.org/job/ctakes-trunk-compiletest/org.apache.ctakes$ctakes-assertion/ws/src/main/java/org/apache/ctakes/assertion/eval/AnnotationStatisticsCompact.java>:[289,49]
[unchecked] Possible heap pollution from parameterized vararg type OUTCOME_TYPE
[ERROR]   where OUTCOME_TYPE is a type-variable:
    OUTCOME_TYPE extends Comparable<? super OUTCOME_TYPE> declared in class AnnotationStatisticsCompact
<https://builds.apache.org/job/ctakes-trunk-compiletest/org.apache.ctakes$ctakes-assertion/ws/src/main/java/org/apache/ctakes/assertion/eval/AnnotationStatisticsCompact.java>:[309,48]
[unchecked] Possible heap pollution from parameterized vararg type OUTCOME_TYPE
[ERROR]   where OUTCOME_TYPE is a type-variable:
    OUTCOME_TYPE extends Comparable<? super OUTCOME_TYPE> declared in class AnnotationStatisticsCompact
<https://builds.apache.org/job/ctakes-trunk-compiletest/org.apache.ctakes$ctakes-assertion/ws/src/main/java/org/apache/ctakes/assertion/eval/AnnotationStatisticsCompact.java>:[330,48]
[unchecked] Possible heap pollution from parameterized vararg type OUTCOME_TYPE
[ERROR]   where OUTCOME_TYPE is a type-variable:
    OUTCOME_TYPE extends Comparable<? super OUTCOME_TYPE> declared in class AnnotationStatisticsCompact
<https://builds.apache.org/job/ctakes-trunk-compiletest/org.apache.ctakes$ctakes-assertion/ws/src/main/java/org/apache/ctakes/assertion/medfacts/cleartk/extractors/CueWordTest2.java>:[94,11]
[unchecked] unchecked call to TypePathExtractor(Class<T>,String) as a member of the
raw type TypePathExtractor
[ERROR]   where T is a type-variable:
    T extends Annotation declared in class TypePathExtractor
<https://builds.apache.org/job/ctakes-trunk-compiletest/org.apache.ctakes$ctakes-assertion/ws/src/main/java/org/apache/ctakes/assertion/medfacts/cleartk/extractors/CueWordTest2.java>:[95,11]
[unchecked] unchecked call to TypePathExtractor(Class<T>,String) as a member of the
raw type TypePathExtractor
[ERROR]   where T is a type-variable:
    T extends Annotation declared in class TypePathExtractor
<https://builds.apache.org/job/ctakes-trunk-compiletest/org.apache.ctakes$ctakes-assertion/ws/src/main/java/org/apache/ctakes/assertion/medfacts/cleartk/extractors/CueWordTest2.java>:[96,11]
[unchecked] unchecked call to TypePathExtractor(Class<T>,String) as a member of the
raw type TypePathExtractor
[ERROR]   where T is a type-variable:
    T extends Annotation declared in class TypePathExtractor
<https://builds.apache.org/job/ctakes-trunk-compiletest/org.apache.ctakes$ctakes-assertion/ws/src/main/java/org/apache/ctakes/assertion/medfacts/cleartk/extractors/CueWordTest2.java>:[91,8]
[unchecked] unchecked call to CombinedExtractor1(FeatureExtractor1<T>,FeatureExtractor1<T>,FeatureExtractor1<T>,FeatureExtractor1<T>)
as a member of the raw type CombinedExtractor1
[ERROR]   where T is a type-variable:
    T extends Annotation declared in class CombinedExtractor1
<https://builds.apache.org/job/ctakes-trunk-compiletest/org.apache.ctakes$ctakes-assertion/ws/src/main/java/org/apache/ctakes/assertion/medfacts/cleartk/extractors/CueWordTest2.java>:[100,8]
[unchecked] unchecked call to CleartkExtractor(Class<SEARCH_T>,FeatureExtractor1<SEARCH_T>,Context...)
as a member of the raw type CleartkExtractor
[ERROR]   where SEARCH_T is a type-variable:
    SEARCH_T extends Annotation declared in class CleartkExtractor
<https://builds.apache.org/job/ctakes-trunk-compiletest/org.apache.ctakes$ctakes-assertion/ws/src/main/java/org/apache/ctakes/assertion/medfacts/cleartk/extractors/CueWordTest2.java>:[113,8]
[unchecked] unchecked call to CleartkExtractor(Class<SEARCH_T>,FeatureExtractor1<SEARCH_T>,Context...)
as a member of the raw type CleartkExtractor
[ERROR]   where SEARCH_T is a type-variable:
    SEARCH_T extends Annotation declared in class CleartkExtractor
<https://builds.apache.org/job/ctakes-trunk-compiletest/org.apache.ctakes$ctakes-assertion/ws/src/main/java/org/apache/ctakes/assertion/medfacts/cleartk/extractors/CueWordTest2.java>:[127,12]
[unchecked] unchecked call to TypePathExtractor(Class<T>,String) as a member of the
raw type TypePathExtractor
[ERROR]   where T is a type-variable:
    T extends Annotation declared in class TypePathExtractor
<https://builds.apache.org/job/ctakes-trunk-compiletest/org.apache.ctakes$ctakes-assertion/ws/src/main/java/org/apache/ctakes/assertion/medfacts/cleartk/extractors/CueWordTest2.java>:[125,8]
[unchecked] unchecked call to CleartkExtractor(Class<SEARCH_T>,FeatureExtractor1<SEARCH_T>,Context...)
as a member of the raw type CleartkExtractor
[ERROR]   where SEARCH_T is a type-variable:
    SEARCH_T extends Annotation declared in class CleartkExtractor
<https://builds.apache.org/job/ctakes-trunk-compiletest/org.apache.ctakes$ctakes-assertion/ws/src/main/java/org/apache/ctakes/assertion/medfacts/cleartk/extractors/CueWordTest2.java>:[165,50]
[unchecked] unchecked call to extractWithin(JCas,FOCUS_T,Annotation) as a member of the raw
type CleartkExtractor
[ERROR]   where FOCUS_T is a type-variable:
    FOCUS_T extends Annotation declared in class CleartkExtractor
<https://builds.apache.org/job/ctakes-trunk-compiletest/org.apache.ctakes$ctakes-assertion/ws/src/main/java/org/apache/ctakes/assertion/medfacts/cleartk/extractors/CueWordTest2.java>:[165,50]
[unchecked] unchecked conversion
[ERROR]   required: List<Feature>
  found:    List
<https://builds.apache.org/job/ctakes-trunk-compiletest/org.apache.ctakes$ctakes-assertion/ws/src/main/java/org/apache/ctakes/assertion/medfacts/cleartk/extractors/CueWordTest2.java>:[175,40]
[unchecked] unchecked call to extractWithin(JCas,FOCUS_T,Annotation) as a member of the raw
type CleartkExtractor
[ERROR]   where FOCUS_T is a type-variable:
    FOCUS_T extends Annotation declared in class CleartkExtractor
<https://builds.apache.org/job/ctakes-trunk-compiletest/org.apache.ctakes$ctakes-assertion/ws/src/main/java/org/apache/ctakes/assertion/medfacts/cleartk/extractors/CueWordTest2.java>:[175,40]
[unchecked] unchecked conversion
[ERROR]   required: List<Feature>
  found:    List
<https://builds.apache.org/job/ctakes-trunk-compiletest/org.apache.ctakes$ctakes-assertion/ws/src/main/java/org/apache/ctakes/assertion/medfacts/cleartk/HistoryCleartkAnalysisEngine.java>:[73,35]
[unchecked] unchecked conversion
[ERROR]   required: FeatureExtractor1<IdentifiedAnnotation>
  found:    HistoryFeaturesExtractor
<https://builds.apache.org/job/ctakes-trunk-compiletest/org.apache.ctakes$ctakes-assertion/ws/src/main/java/org/apache/ctakes/assertion/medfacts/cleartk/SubjectCleartkAnalysisEngine.java>:[66,36]
[unchecked] unchecked conversion
[ERROR]   required: FeatureExtractor1<IdentifiedAnnotation>
  found:    SubjectFeaturesExtractor
<https://builds.apache.org/job/ctakes-trunk-compiletest/org.apache.ctakes$ctakes-assertion/ws/src/main/java/org/apache/ctakes/assertion/medfacts/cleartk/extractors/DependencyWordsFragmentExtractor.java>:[37,7]
error: DependencyWordsFragmentExtractor is not abstract and does not override abstract method
extract(JCas,IdentifiedAnnotation) in TreeFragmentFeatureExtractor
[ERROR] <https://builds.apache.org/job/ctakes-trunk-compiletest/org.apache.ctakes$ctakes-assertion/ws/src/main/java/org/apache/ctakes/assertion/medfacts/cleartk/extractors/DependencyWordsFragmentExtractor.java>:[44,23]
error: name clash: extract(JCas,Annotation) in DependencyWordsFragmentExtractor and extract(JCas,T)
in FeatureExtractor1 have the same erasure, yet neither overrides the other
[ERROR]   where T is a type-variable:
    T extends Annotation declared in interface FeatureExtractor1
<https://builds.apache.org/job/ctakes-trunk-compiletest/org.apache.ctakes$ctakes-assertion/ws/src/main/java/org/apache/ctakes/assertion/cr/XmiCollectionReaderCtakes.java>:[80,18]
[unchecked] unchecked call to add(E) as a member of the raw type ArrayList
[ERROR]   where E is a type-variable:
    E extends Object declared in class ArrayList
<https://builds.apache.org/job/ctakes-trunk-compiletest/org.apache.ctakes$ctakes-assertion/ws/src/main/java/org/apache/ctakes/assertion/pipelines/RunJudgeAttributeInstances.java>:[111,35]
[unchecked] unchecked conversion
[ERROR]   required: List<File>
  found:    List
<https://builds.apache.org/job/ctakes-trunk-compiletest/org.apache.ctakes$ctakes-assertion/ws/src/main/java/org/apache/ctakes/assertion/medfacts/cleartk/extractors/CueWordTest.java>:[94,11]
[unchecked] unchecked call to TypePathExtractor(Class<T>,String) as a member of the
raw type TypePathExtractor
[ERROR]   where T is a type-variable:
    T extends Annotation declared in class TypePathExtractor
<https://builds.apache.org/job/ctakes-trunk-compiletest/org.apache.ctakes$ctakes-assertion/ws/src/main/java/org/apache/ctakes/assertion/medfacts/cleartk/extractors/CueWordTest.java>:[95,11]
[unchecked] unchecked call to TypePathExtractor(Class<T>,String) as a member of the
raw type TypePathExtractor
[ERROR]   where T is a type-variable:
    T extends Annotation declared in class TypePathExtractor
<https://builds.apache.org/job/ctakes-trunk-compiletest/org.apache.ctakes$ctakes-assertion/ws/src/main/java/org/apache/ctakes/assertion/medfacts/cleartk/extractors/CueWordTest.java>:[96,11]
[unchecked] unchecked call to TypePathExtractor(Class<T>,String) as a member of the
raw type TypePathExtractor
[ERROR]   where T is a type-variable:
    T extends Annotation declared in class TypePathExtractor
<https://builds.apache.org/job/ctakes-trunk-compiletest/org.apache.ctakes$ctakes-assertion/ws/src/main/java/org/apache/ctakes/assertion/medfacts/cleartk/extractors/CueWordTest.java>:[91,8]
[unchecked] unchecked call to CombinedExtractor1(FeatureExtractor1<T>,FeatureExtractor1<T>,FeatureExtractor1<T>,FeatureExtractor1<T>)
as a member of the raw type CombinedExtractor1
[ERROR]   where T is a type-variable:
    T extends Annotation declared in class CombinedExtractor1
<https://builds.apache.org/job/ctakes-trunk-compiletest/org.apache.ctakes$ctakes-assertion/ws/src/main/java/org/apache/ctakes/assertion/medfacts/cleartk/extractors/CueWordTest.java>:[100,8]
[unchecked] unchecked call to CleartkExtractor(Class<SEARCH_T>,FeatureExtractor1<SEARCH_T>,Context...)
as a member of the raw type CleartkExtractor
[ERROR]   where SEARCH_T is a type-variable:
    SEARCH_T extends Annotation declared in class CleartkExtractor
<https://builds.apache.org/job/ctakes-trunk-compiletest/org.apache.ctakes$ctakes-assertion/ws/src/main/java/org/apache/ctakes/assertion/medfacts/cleartk/extractors/CueWordTest.java>:[142,50]
[unchecked] unchecked call to extractWithin(JCas,FOCUS_T,Annotation) as a member of the raw
type CleartkExtractor
[ERROR]   where FOCUS_T is a type-variable:
    FOCUS_T extends Annotation declared in class CleartkExtractor
<https://builds.apache.org/job/ctakes-trunk-compiletest/org.apache.ctakes$ctakes-assertion/ws/src/main/java/org/apache/ctakes/assertion/medfacts/cleartk/extractors/CueWordTest.java>:[142,50]
[unchecked] unchecked conversion
[ERROR]   required: List<Feature>
  found:    List
<https://builds.apache.org/job/ctakes-trunk-compiletest/org.apache.ctakes$ctakes-assertion/ws/src/main/java/org/apache/ctakes/assertion/medfacts/CasIndexer.java>:[74,21]
[unchecked] unchecked cast
[ERROR]   required: T
  found:    Annotation
  where T is a type-variable:
    T extends Annotation declared in class CasIndexer
<https://builds.apache.org/job/ctakes-trunk-compiletest/org.apache.ctakes$ctakes-assertion/ws/src/main/java/org/apache/ctakes/assertion/medfacts/cleartk/GenericCleartkAnalysisEngine.java>:[71,35]
[unchecked] unchecked conversion
[INFO] 40 errors 
[INFO] -------------------------------------------------------------
[JENKINS] Archiving disabled

Mime
View raw message