ctakes-notifications mailing list archives

Site index · List index
Message view « Date » · « Thread »
Top « Date » · « Thread »
From Apache Jenkins Server <jenk...@builds.apache.org>
Subject Build failed in Jenkins: ctakes-trunk-compiletest #556
Date Wed, 15 Oct 2014 16:29:48 GMT
See <https://builds.apache.org/job/ctakes-trunk-compiletest/556/changes>

Changes:

[tmill] Corrected a bunch of type issues in assertion inherited from parent class.

[tmill] Clean up types in assertion AE.

------------------------------------------
[...truncated 5913 lines...]
[INFO] Reactor Summary:
[INFO] 
[INFO] Apache cTAKES ..................................... SUCCESS [8.986s]
[INFO] Apache cTAKES common type system .................. SUCCESS [10.610s]
[INFO] Apache cTAKES utils ............................... SUCCESS [3.542s]
[INFO] Apache cTAKES Resources core ...................... SUCCESS [2.318s]
[INFO] Apache cTAKES core ................................ SUCCESS [12.202s]
[INFO] Apache cTAKES Resources pos-tagger ................ SUCCESS [2.013s]
[INFO] Apache cTAKES part-of-speech tagger ............... SUCCESS [5.149s]
[INFO] Apache cTAKES Resources ctakes-chunker-res ........ SUCCESS [0.923s]
[INFO] Apache cTAKES chunker ............................. SUCCESS [3.692s]
[INFO] Apache cTAKES document preprocessor ............... SUCCESS [5.078s]
[INFO] Apache cTAKES Resources dictionary-lookup ......... SUCCESS [12.133s]
[INFO] Apache cTAKES dictionary lookup ................... SUCCESS [5.673s]
[INFO] Apache cTAKES context dependent tokenizer ......... SUCCESS [2.648s]
[INFO] Apache cTAKES Resources lvg ....................... SUCCESS [2.334s]
[INFO] Apache cTAKES LVG lexical tools ................... SUCCESS [2.456s]
[INFO] Apache cTAKES Resources ne-contexts ............... SUCCESS [0.738s]
[INFO] Apache cTAKES named entity contexts ............... SUCCESS [4.856s]
[INFO] Apache cTAKES Resources constituency-parser ....... SUCCESS [3.422s]
[INFO] Apache cTAKES Constituency Parser ................. SUCCESS [5.733s]
[INFO] Apache cTAKES Resources coreference ............... SUCCESS [3.009s]
[INFO] Apache cTAKES Resources relation-extractor ........ SUCCESS [0.802s]
[INFO] Apache cTAKES Resources dependency-parser ......... SUCCESS [2.656s]
[INFO] Apache cTAKES Dependency Parser ................... SUCCESS [34.614s]
[INFO] Apache cTAKES Relation Extractor .................. SUCCESS [9.253s]
[INFO] Apache cTAKES CoReference Resolver ................ SUCCESS [7.865s]
[INFO] Apache cTAKES Resources drug-ner .................. SUCCESS [0.882s]
[INFO] Apache cTAKES Drug NER ............................ SUCCESS [5.198s]
[INFO] Apache cTAKES Resources side-effect ............... SUCCESS [2.229s]
[INFO] Apache cTAKES Side Effects ........................ SUCCESS [6.720s]
[INFO] Apache cTAKES Resources smoking-status ............ SUCCESS [0.889s]
[INFO] Apache cTAKES Smoking Status ...................... SUCCESS [5.960s]
[INFO] Apache cTAKES Resources assertion ................. SUCCESS [1.189s]
[INFO] Apache cTAKES Assertion ........................... FAILURE [5.020s]
[INFO] Apache cTAKES Resources assertion-zoner ........... SKIPPED
[INFO] Apache cTAKES Assertion's zoner ................... SKIPPED
[INFO] Apache cTAKES Resources temporal .................. SKIPPED
[INFO] Apache cTAKES Resources ctakes-ytex-res ........... SKIPPED
[INFO] Apache cTAKES YTEX ................................ SKIPPED
[INFO] Apache cTAKES YTEX UIMA ........................... SKIPPED
[INFO] Apache cTAKES ctakes-clinical-pipeline ............ SKIPPED
[INFO] Apache cTAKES Temporal Information Extraction ..... SKIPPED
[INFO] Apache cTAKES YTEX Web ............................ SKIPPED
[INFO] Apache cTAKES Distribution ........................ SKIPPED
[INFO] Apache cTAKES Regression-test ..................... SKIPPED
[INFO] Apache cTAKES template filler ..................... SKIPPED
[INFO] ctakes-examples ................................... SKIPPED
[INFO] Apache cTAKES Resources dictionary-lookup-fast-res  SKIPPED
[INFO] Apache cTAKES dictionary lookup fast .............. SKIPPED
[INFO] ------------------------------------------------------------------------
[INFO] BUILD FAILURE
[INFO] ------------------------------------------------------------------------
[INFO] Total time: 3:19.415s
[INFO] Finished at: Wed Oct 15 16:29:28 UTC 2014
[INFO] Final Memory: 56M/277M
[INFO] ------------------------------------------------------------------------
[JENKINS] Archiving disabled
[JENKINS] Archiving disabled
[JENKINS] Archiving disabled
[JENKINS] Archiving disabled
[JENKINS] Archiving disabled
[JENKINS] Archiving disabled
[JENKINS] Archiving disabled
[JENKINS] Archiving disabled
[JENKINS] Archiving disabled
[JENKINS] Archiving disabled
[JENKINS] Archiving disabled
[JENKINS] Archiving disabled
[JENKINS] Archiving disabled
[JENKINS] Archiving disabled
[JENKINS] Archiving disabled
[JENKINS] Archiving disabled
[JENKINS] Archiving disabled
[JENKINS] Archiving disabled
[JENKINS] Archiving disabled
[JENKINS] Archiving disabled
[JENKINS] Archiving disabled
[JENKINS] Archiving disabled
[JENKINS] Archiving disabled
[JENKINS] Archiving disabled
[JENKINS] Archiving disabled
[JENKINS] Archiving disabled
[JENKINS] Archiving disabled
[JENKINS] Archiving disabled
[JENKINS] Archiving disabled
[JENKINS] Archiving disabled
[JENKINS] Archiving disabled
[JENKINS] Archiving disabled
[JENKINS] Archiving disabled
[JENKINS] Archiving disabled
[JENKINS] Archiving disabled
[JENKINS] Archiving disabled
[JENKINS] Archiving disabled
[JENKINS] Archiving disabled
[JENKINS] Archiving disabled
[JENKINS] Archiving disabled
[JENKINS] Archiving disabled
[JENKINS] Archiving disabled
[JENKINS] Archiving disabled
[JENKINS] Archiving disabled
[JENKINS] Archiving disabled
[JENKINS] Archiving disabled
[JENKINS] Archiving disabled
[JENKINS] Archiving disabled
Waiting for Jenkins to finish collecting data
[ERROR] Failed to execute goal org.apache.maven.plugins:maven-compiler-plugin:2.4:compile
(default-compile) on project ctakes-assertion: Compilation failure: Compilation failure:
[ERROR] <https://builds.apache.org/job/ctakes-trunk-compiletest/ws/ctakes-assertion/src/main/java/org/apache/ctakes/assertion/eval/AssertionEvaluation.java>:[437,55]
[unchecked] unchecked call to addAll(AnnotationStatisticsCompact<OUTCOME_TYPE>) as a
member of the raw type AnnotationStatisticsCompact
[ERROR] where OUTCOME_TYPE is a type-variable:
[ERROR] OUTCOME_TYPE extends Comparable<? super OUTCOME_TYPE> declared in class AnnotationStatisticsCompact
[ERROR] <https://builds.apache.org/job/ctakes-trunk-compiletest/ws/ctakes-assertion/src/main/java/org/apache/ctakes/assertion/eval/AssertionEvaluation.java>:[456,106]
[unchecked] unchecked call to f1(OUTCOME_TYPE) as a member of the raw type AnnotationStatisticsCompact
[ERROR] where OUTCOME_TYPE is a type-variable:
[ERROR] OUTCOME_TYPE extends Comparable<? super OUTCOME_TYPE> declared in class AnnotationStatisticsCompact
[ERROR] <https://builds.apache.org/job/ctakes-trunk-compiletest/ws/ctakes-assertion/src/main/java/org/apache/ctakes/assertion/eval/AssertionEvaluation.java>:[1042,24]
[unchecked] unchecked call to <ANNOTATION_TYPE,SPAN_TYPE>add(Collection<? extends
ANNOTATION_TYPE>,Collection<? extends ANNOTATION_TYPE>,Function<ANNOTATION_TYPE,SPAN_TYPE>,Function<ANNOTATION_TYPE,OUTCOME_TYPE>)
as a member of the raw type AnnotationStatisticsCompact
[ERROR] where ANNOTATION_TYPE,SPAN_TYPE,OUTCOME_TYPE are type-variables:
[ERROR] ANNOTATION_TYPE extends Object declared in method <ANNOTATION_TYPE,SPAN_TYPE>add(Collection<?
extends ANNOTATION_TYPE>,Collection<? extends ANNOTATION_TYPE>,Function<ANNOTATION_TYPE,SPAN_TYPE>,Function<ANNOTATION_TYPE,OUTCOME_TYPE>)
[ERROR] SPAN_TYPE extends Object declared in method <ANNOTATION_TYPE,SPAN_TYPE>add(Collection<?
extends ANNOTATION_TYPE>,Collection<? extends ANNOTATION_TYPE>,Function<ANNOTATION_TYPE,SPAN_TYPE>,Function<ANNOTATION_TYPE,OUTCOME_TYPE>)
[ERROR] OUTCOME_TYPE extends Comparable<? super OUTCOME_TYPE> declared in class AnnotationStatisticsCompact
[ERROR] <https://builds.apache.org/job/ctakes-trunk-compiletest/ws/ctakes-assertion/src/main/java/org/apache/ctakes/assertion/eval/AssertionEvaluation.java>:[1055,27]
[unchecked] unchecked call to <ANNOTATION_TYPE,SPAN_TYPE>add(Collection<? extends
ANNOTATION_TYPE>,Collection<? extends ANNOTATION_TYPE>,Function<ANNOTATION_TYPE,SPAN_TYPE>,Function<ANNOTATION_TYPE,OUTCOME_TYPE>)
as a member of the raw type AnnotationStatisticsCompact
[ERROR] where ANNOTATION_TYPE,SPAN_TYPE,OUTCOME_TYPE are type-variables:
[ERROR] ANNOTATION_TYPE extends Object declared in method <ANNOTATION_TYPE,SPAN_TYPE>add(Collection<?
extends ANNOTATION_TYPE>,Collection<? extends ANNOTATION_TYPE>,Function<ANNOTATION_TYPE,SPAN_TYPE>,Function<ANNOTATION_TYPE,OUTCOME_TYPE>)
[ERROR] SPAN_TYPE extends Object declared in method <ANNOTATION_TYPE,SPAN_TYPE>add(Collection<?
extends ANNOTATION_TYPE>,Collection<? extends ANNOTATION_TYPE>,Function<ANNOTATION_TYPE,SPAN_TYPE>,Function<ANNOTATION_TYPE,OUTCOME_TYPE>)
[ERROR] OUTCOME_TYPE extends Comparable<? super OUTCOME_TYPE> declared in class AnnotationStatisticsCompact
[ERROR] <https://builds.apache.org/job/ctakes-trunk-compiletest/ws/ctakes-assertion/src/main/java/org/apache/ctakes/assertion/eval/AssertionEvaluation.java>:[1065,27]
[unchecked] unchecked call to <ANNOTATION_TYPE,SPAN_TYPE>add(Collection<? extends
ANNOTATION_TYPE>,Collection<? extends ANNOTATION_TYPE>,Function<ANNOTATION_TYPE,SPAN_TYPE>,Function<ANNOTATION_TYPE,OUTCOME_TYPE>)
as a member of the raw type AnnotationStatisticsCompact
[ERROR] where ANNOTATION_TYPE,SPAN_TYPE,OUTCOME_TYPE are type-variables:
[ERROR] ANNOTATION_TYPE extends Object declared in method <ANNOTATION_TYPE,SPAN_TYPE>add(Collection<?
extends ANNOTATION_TYPE>,Collection<? extends ANNOTATION_TYPE>,Function<ANNOTATION_TYPE,SPAN_TYPE>,Function<ANNOTATION_TYPE,OUTCOME_TYPE>)
[ERROR] SPAN_TYPE extends Object declared in method <ANNOTATION_TYPE,SPAN_TYPE>add(Collection<?
extends ANNOTATION_TYPE>,Collection<? extends ANNOTATION_TYPE>,Function<ANNOTATION_TYPE,SPAN_TYPE>,Function<ANNOTATION_TYPE,OUTCOME_TYPE>)
[ERROR] OUTCOME_TYPE extends Comparable<? super OUTCOME_TYPE> declared in class AnnotationStatisticsCompact
[ERROR] <https://builds.apache.org/job/ctakes-trunk-compiletest/ws/ctakes-assertion/src/main/java/org/apache/ctakes/assertion/eval/AssertionEvaluation.java>:[1075,23]
[unchecked] unchecked call to <ANNOTATION_TYPE,SPAN_TYPE>add(Collection<? extends
ANNOTATION_TYPE>,Collection<? extends ANNOTATION_TYPE>,Function<ANNOTATION_TYPE,SPAN_TYPE>,Function<ANNOTATION_TYPE,OUTCOME_TYPE>)
as a member of the raw type AnnotationStatisticsCompact
[ERROR] where ANNOTATION_TYPE,SPAN_TYPE,OUTCOME_TYPE are type-variables:
[ERROR] ANNOTATION_TYPE extends Object declared in method <ANNOTATION_TYPE,SPAN_TYPE>add(Collection<?
extends ANNOTATION_TYPE>,Collection<? extends ANNOTATION_TYPE>,Function<ANNOTATION_TYPE,SPAN_TYPE>,Function<ANNOTATION_TYPE,OUTCOME_TYPE>)
[ERROR] SPAN_TYPE extends Object declared in method <ANNOTATION_TYPE,SPAN_TYPE>add(Collection<?
extends ANNOTATION_TYPE>,Collection<? extends ANNOTATION_TYPE>,Function<ANNOTATION_TYPE,SPAN_TYPE>,Function<ANNOTATION_TYPE,OUTCOME_TYPE>)
[ERROR] OUTCOME_TYPE extends Comparable<? super OUTCOME_TYPE> declared in class AnnotationStatisticsCompact
[ERROR] <https://builds.apache.org/job/ctakes-trunk-compiletest/ws/ctakes-assertion/src/main/java/org/apache/ctakes/assertion/eval/AssertionEvaluation.java>:[1085,23]
[unchecked] unchecked call to <ANNOTATION_TYPE,SPAN_TYPE>add(Collection<? extends
ANNOTATION_TYPE>,Collection<? extends ANNOTATION_TYPE>,Function<ANNOTATION_TYPE,SPAN_TYPE>,Function<ANNOTATION_TYPE,OUTCOME_TYPE>)
as a member of the raw type AnnotationStatisticsCompact
[ERROR] where ANNOTATION_TYPE,SPAN_TYPE,OUTCOME_TYPE are type-variables:
[ERROR] ANNOTATION_TYPE extends Object declared in method <ANNOTATION_TYPE,SPAN_TYPE>add(Collection<?
extends ANNOTATION_TYPE>,Collection<? extends ANNOTATION_TYPE>,Function<ANNOTATION_TYPE,SPAN_TYPE>,Function<ANNOTATION_TYPE,OUTCOME_TYPE>)
[ERROR] SPAN_TYPE extends Object declared in method <ANNOTATION_TYPE,SPAN_TYPE>add(Collection<?
extends ANNOTATION_TYPE>,Collection<? extends ANNOTATION_TYPE>,Function<ANNOTATION_TYPE,SPAN_TYPE>,Function<ANNOTATION_TYPE,OUTCOME_TYPE>)
[ERROR] OUTCOME_TYPE extends Comparable<? super OUTCOME_TYPE> declared in class AnnotationStatisticsCompact
[ERROR] <https://builds.apache.org/job/ctakes-trunk-compiletest/ws/ctakes-assertion/src/main/java/org/apache/ctakes/assertion/eval/AssertionEvaluation.java>:[1096,23]
[unchecked] unchecked call to <ANNOTATION_TYPE,SPAN_TYPE>add(Collection<? extends
ANNOTATION_TYPE>,Collection<? extends ANNOTATION_TYPE>,Function<ANNOTATION_TYPE,SPAN_TYPE>,Function<ANNOTATION_TYPE,OUTCOME_TYPE>)
as a member of the raw type AnnotationStatisticsCompact
[ERROR] where ANNOTATION_TYPE,SPAN_TYPE,OUTCOME_TYPE are type-variables:
[ERROR] ANNOTATION_TYPE extends Object declared in method <ANNOTATION_TYPE,SPAN_TYPE>add(Collection<?
extends ANNOTATION_TYPE>,Collection<? extends ANNOTATION_TYPE>,Function<ANNOTATION_TYPE,SPAN_TYPE>,Function<ANNOTATION_TYPE,OUTCOME_TYPE>)
[ERROR] SPAN_TYPE extends Object declared in method <ANNOTATION_TYPE,SPAN_TYPE>add(Collection<?
extends ANNOTATION_TYPE>,Collection<? extends ANNOTATION_TYPE>,Function<ANNOTATION_TYPE,SPAN_TYPE>,Function<ANNOTATION_TYPE,OUTCOME_TYPE>)
[ERROR] OUTCOME_TYPE extends Comparable<? super OUTCOME_TYPE> declared in class AnnotationStatisticsCompact
[ERROR] <https://builds.apache.org/job/ctakes-trunk-compiletest/ws/ctakes-assertion/src/main/java/org/apache/ctakes/assertion/eval/AssertionEvaluation.java>:[1164,24]
[unchecked] unchecked call to write(Instance<OUTCOME_TYPE>) as a member of the raw type
DataWriter
[ERROR] where OUTCOME_TYPE is a type-variable:
[ERROR] OUTCOME_TYPE extends Object declared in interface DataWriter
[ERROR] <https://builds.apache.org/job/ctakes-trunk-compiletest/ws/ctakes-assertion/src/main/java/org/apache/ctakes/assertion/eval/AnnotationStatisticsCompact.java>:[270,49]
[unchecked] Possible heap pollution from parameterized vararg type OUTCOME_TYPE
[ERROR] where OUTCOME_TYPE is a type-variable:
[ERROR] OUTCOME_TYPE extends Comparable<? super OUTCOME_TYPE> declared in class AnnotationStatisticsCompact
[ERROR] <https://builds.apache.org/job/ctakes-trunk-compiletest/ws/ctakes-assertion/src/main/java/org/apache/ctakes/assertion/eval/AnnotationStatisticsCompact.java>:[289,49]
[unchecked] Possible heap pollution from parameterized vararg type OUTCOME_TYPE
[ERROR] where OUTCOME_TYPE is a type-variable:
[ERROR] OUTCOME_TYPE extends Comparable<? super OUTCOME_TYPE> declared in class AnnotationStatisticsCompact
[ERROR] <https://builds.apache.org/job/ctakes-trunk-compiletest/ws/ctakes-assertion/src/main/java/org/apache/ctakes/assertion/eval/AnnotationStatisticsCompact.java>:[309,48]
[unchecked] Possible heap pollution from parameterized vararg type OUTCOME_TYPE
[ERROR] where OUTCOME_TYPE is a type-variable:
[ERROR] OUTCOME_TYPE extends Comparable<? super OUTCOME_TYPE> declared in class AnnotationStatisticsCompact
[ERROR] <https://builds.apache.org/job/ctakes-trunk-compiletest/ws/ctakes-assertion/src/main/java/org/apache/ctakes/assertion/eval/AnnotationStatisticsCompact.java>:[330,48]
[unchecked] Possible heap pollution from parameterized vararg type OUTCOME_TYPE
[ERROR] where OUTCOME_TYPE is a type-variable:
[ERROR] OUTCOME_TYPE extends Comparable<? super OUTCOME_TYPE> declared in class AnnotationStatisticsCompact
[ERROR] <https://builds.apache.org/job/ctakes-trunk-compiletest/ws/ctakes-assertion/src/main/java/org/apache/ctakes/assertion/medfacts/cleartk/extractors/CueWordTest2.java>:[94,11]
[unchecked] unchecked call to TypePathExtractor(Class<T>,String) as a member of the
raw type TypePathExtractor
[ERROR] where T is a type-variable:
[ERROR] T extends Annotation declared in class TypePathExtractor
[ERROR] <https://builds.apache.org/job/ctakes-trunk-compiletest/ws/ctakes-assertion/src/main/java/org/apache/ctakes/assertion/medfacts/cleartk/extractors/CueWordTest2.java>:[95,11]
[unchecked] unchecked call to TypePathExtractor(Class<T>,String) as a member of the
raw type TypePathExtractor
[ERROR] where T is a type-variable:
[ERROR] T extends Annotation declared in class TypePathExtractor
[ERROR] <https://builds.apache.org/job/ctakes-trunk-compiletest/ws/ctakes-assertion/src/main/java/org/apache/ctakes/assertion/medfacts/cleartk/extractors/CueWordTest2.java>:[96,11]
[unchecked] unchecked call to TypePathExtractor(Class<T>,String) as a member of the
raw type TypePathExtractor
[ERROR] where T is a type-variable:
[ERROR] T extends Annotation declared in class TypePathExtractor
[ERROR] <https://builds.apache.org/job/ctakes-trunk-compiletest/ws/ctakes-assertion/src/main/java/org/apache/ctakes/assertion/medfacts/cleartk/extractors/CueWordTest2.java>:[91,8]
[unchecked] unchecked call to CombinedExtractor1(FeatureExtractor1<T>,FeatureExtractor1<T>,FeatureExtractor1<T>,FeatureExtractor1<T>)
as a member of the raw type CombinedExtractor1
[ERROR] where T is a type-variable:
[ERROR] T extends Annotation declared in class CombinedExtractor1
[ERROR] <https://builds.apache.org/job/ctakes-trunk-compiletest/ws/ctakes-assertion/src/main/java/org/apache/ctakes/assertion/medfacts/cleartk/extractors/CueWordTest2.java>:[100,8]
[unchecked] unchecked call to CleartkExtractor(Class<SEARCH_T>,FeatureExtractor1<SEARCH_T>,Context...)
as a member of the raw type CleartkExtractor
[ERROR] where SEARCH_T is a type-variable:
[ERROR] SEARCH_T extends Annotation declared in class CleartkExtractor
[ERROR] <https://builds.apache.org/job/ctakes-trunk-compiletest/ws/ctakes-assertion/src/main/java/org/apache/ctakes/assertion/medfacts/cleartk/extractors/CueWordTest2.java>:[113,8]
[unchecked] unchecked call to CleartkExtractor(Class<SEARCH_T>,FeatureExtractor1<SEARCH_T>,Context...)
as a member of the raw type CleartkExtractor
[ERROR] where SEARCH_T is a type-variable:
[ERROR] SEARCH_T extends Annotation declared in class CleartkExtractor
[ERROR] <https://builds.apache.org/job/ctakes-trunk-compiletest/ws/ctakes-assertion/src/main/java/org/apache/ctakes/assertion/medfacts/cleartk/extractors/CueWordTest2.java>:[127,12]
[unchecked] unchecked call to TypePathExtractor(Class<T>,String) as a member of the
raw type TypePathExtractor
[ERROR] where T is a type-variable:
[ERROR] T extends Annotation declared in class TypePathExtractor
[ERROR] <https://builds.apache.org/job/ctakes-trunk-compiletest/ws/ctakes-assertion/src/main/java/org/apache/ctakes/assertion/medfacts/cleartk/extractors/CueWordTest2.java>:[125,8]
[unchecked] unchecked call to CleartkExtractor(Class<SEARCH_T>,FeatureExtractor1<SEARCH_T>,Context...)
as a member of the raw type CleartkExtractor
[ERROR] where SEARCH_T is a type-variable:
[ERROR] SEARCH_T extends Annotation declared in class CleartkExtractor
[ERROR] <https://builds.apache.org/job/ctakes-trunk-compiletest/ws/ctakes-assertion/src/main/java/org/apache/ctakes/assertion/medfacts/cleartk/extractors/CueWordTest2.java>:[165,50]
[unchecked] unchecked call to extractWithin(JCas,FOCUS_T,Annotation) as a member of the raw
type CleartkExtractor
[ERROR] where FOCUS_T is a type-variable:
[ERROR] FOCUS_T extends Annotation declared in class CleartkExtractor
[ERROR] <https://builds.apache.org/job/ctakes-trunk-compiletest/ws/ctakes-assertion/src/main/java/org/apache/ctakes/assertion/medfacts/cleartk/extractors/CueWordTest2.java>:[165,50]
[unchecked] unchecked conversion
[ERROR] required: List<Feature>
[ERROR] found:    List
[ERROR] <https://builds.apache.org/job/ctakes-trunk-compiletest/ws/ctakes-assertion/src/main/java/org/apache/ctakes/assertion/medfacts/cleartk/extractors/CueWordTest2.java>:[175,40]
[unchecked] unchecked call to extractWithin(JCas,FOCUS_T,Annotation) as a member of the raw
type CleartkExtractor
[ERROR] where FOCUS_T is a type-variable:
[ERROR] FOCUS_T extends Annotation declared in class CleartkExtractor
[ERROR] <https://builds.apache.org/job/ctakes-trunk-compiletest/ws/ctakes-assertion/src/main/java/org/apache/ctakes/assertion/medfacts/cleartk/extractors/CueWordTest2.java>:[175,40]
[unchecked] unchecked conversion
[ERROR] required: List<Feature>
[ERROR] found:    List
[ERROR] <https://builds.apache.org/job/ctakes-trunk-compiletest/ws/ctakes-assertion/src/main/java/org/apache/ctakes/assertion/medfacts/cleartk/HistoryCleartkAnalysisEngine.java>:[73,35]
[unchecked] unchecked conversion
[ERROR] required: FeatureExtractor1<IdentifiedAnnotation>
[ERROR] found:    HistoryFeaturesExtractor
[ERROR] <https://builds.apache.org/job/ctakes-trunk-compiletest/ws/ctakes-assertion/src/main/java/org/apache/ctakes/assertion/medfacts/cleartk/SubjectCleartkAnalysisEngine.java>:[66,36]
[unchecked] unchecked conversion
[ERROR] required: FeatureExtractor1<IdentifiedAnnotation>
[ERROR] found:    SubjectFeaturesExtractor
[ERROR] <https://builds.apache.org/job/ctakes-trunk-compiletest/ws/ctakes-assertion/src/main/java/org/apache/ctakes/assertion/medfacts/cleartk/extractors/DependencyWordsFragmentExtractor.java>:[37,7]
error: DependencyWordsFragmentExtractor is not abstract and does not override abstract method
extract(JCas,IdentifiedAnnotation) in TreeFragmentFeatureExtractor
[ERROR] <https://builds.apache.org/job/ctakes-trunk-compiletest/ws/ctakes-assertion/src/main/java/org/apache/ctakes/assertion/medfacts/cleartk/extractors/DependencyWordsFragmentExtractor.java>:[44,23]
error: name clash: extract(JCas,Annotation) in DependencyWordsFragmentExtractor and extract(JCas,T)
in FeatureExtractor1 have the same erasure, yet neither overrides the other
[ERROR] where T is a type-variable:
[ERROR] T extends Annotation declared in interface FeatureExtractor1
[ERROR] <https://builds.apache.org/job/ctakes-trunk-compiletest/ws/ctakes-assertion/src/main/java/org/apache/ctakes/assertion/cr/XmiCollectionReaderCtakes.java>:[80,18]
[unchecked] unchecked call to add(E) as a member of the raw type ArrayList
[ERROR] where E is a type-variable:
[ERROR] E extends Object declared in class ArrayList
[ERROR] <https://builds.apache.org/job/ctakes-trunk-compiletest/ws/ctakes-assertion/src/main/java/org/apache/ctakes/assertion/pipelines/RunJudgeAttributeInstances.java>:[111,35]
[unchecked] unchecked conversion
[ERROR] required: List<File>
[ERROR] found:    List
[ERROR] <https://builds.apache.org/job/ctakes-trunk-compiletest/ws/ctakes-assertion/src/main/java/org/apache/ctakes/assertion/medfacts/cleartk/extractors/CueWordTest.java>:[94,11]
[unchecked] unchecked call to TypePathExtractor(Class<T>,String) as a member of the
raw type TypePathExtractor
[ERROR] where T is a type-variable:
[ERROR] T extends Annotation declared in class TypePathExtractor
[ERROR] <https://builds.apache.org/job/ctakes-trunk-compiletest/ws/ctakes-assertion/src/main/java/org/apache/ctakes/assertion/medfacts/cleartk/extractors/CueWordTest.java>:[95,11]
[unchecked] unchecked call to TypePathExtractor(Class<T>,String) as a member of the
raw type TypePathExtractor
[ERROR] where T is a type-variable:
[ERROR] T extends Annotation declared in class TypePathExtractor
[ERROR] <https://builds.apache.org/job/ctakes-trunk-compiletest/ws/ctakes-assertion/src/main/java/org/apache/ctakes/assertion/medfacts/cleartk/extractors/CueWordTest.java>:[96,11]
[unchecked] unchecked call to TypePathExtractor(Class<T>,String) as a member of the
raw type TypePathExtractor
[ERROR] where T is a type-variable:
[ERROR] T extends Annotation declared in class TypePathExtractor
[ERROR] <https://builds.apache.org/job/ctakes-trunk-compiletest/ws/ctakes-assertion/src/main/java/org/apache/ctakes/assertion/medfacts/cleartk/extractors/CueWordTest.java>:[91,8]
[unchecked] unchecked call to CombinedExtractor1(FeatureExtractor1<T>,FeatureExtractor1<T>,FeatureExtractor1<T>,FeatureExtractor1<T>)
as a member of the raw type CombinedExtractor1
[ERROR] where T is a type-variable:
[ERROR] T extends Annotation declared in class CombinedExtractor1
[ERROR] <https://builds.apache.org/job/ctakes-trunk-compiletest/ws/ctakes-assertion/src/main/java/org/apache/ctakes/assertion/medfacts/cleartk/extractors/CueWordTest.java>:[100,8]
[unchecked] unchecked call to CleartkExtractor(Class<SEARCH_T>,FeatureExtractor1<SEARCH_T>,Context...)
as a member of the raw type CleartkExtractor
[ERROR] where SEARCH_T is a type-variable:
[ERROR] SEARCH_T extends Annotation declared in class CleartkExtractor
[ERROR] <https://builds.apache.org/job/ctakes-trunk-compiletest/ws/ctakes-assertion/src/main/java/org/apache/ctakes/assertion/medfacts/cleartk/extractors/CueWordTest.java>:[142,50]
[unchecked] unchecked call to extractWithin(JCas,FOCUS_T,Annotation) as a member of the raw
type CleartkExtractor
[ERROR] where FOCUS_T is a type-variable:
[ERROR] FOCUS_T extends Annotation declared in class CleartkExtractor
[ERROR] <https://builds.apache.org/job/ctakes-trunk-compiletest/ws/ctakes-assertion/src/main/java/org/apache/ctakes/assertion/medfacts/cleartk/extractors/CueWordTest.java>:[142,50]
[unchecked] unchecked conversion
[ERROR] required: List<Feature>
[ERROR] found:    List
[ERROR] <https://builds.apache.org/job/ctakes-trunk-compiletest/ws/ctakes-assertion/src/main/java/org/apache/ctakes/assertion/medfacts/CasIndexer.java>:[74,21]
[unchecked] unchecked cast
[ERROR] required: T
[ERROR] found:    Annotation
[ERROR] where T is a type-variable:
[ERROR] T extends Annotation declared in class CasIndexer
[ERROR] <https://builds.apache.org/job/ctakes-trunk-compiletest/ws/ctakes-assertion/src/main/java/org/apache/ctakes/assertion/medfacts/cleartk/GenericCleartkAnalysisEngine.java>:[71,35]
[unchecked] unchecked conversion
[ERROR] -> [Help 1]
[ERROR] 
[ERROR] To see the full stack trace of the errors, re-run Maven with the -e switch.
[ERROR] Re-run Maven using the -X switch to enable full debug logging.
[ERROR] 
[ERROR] For more information about the errors and possible solutions, please read the following
articles:
[ERROR] [Help 1] http://cwiki.apache.org/confluence/display/MAVEN/MojoFailureException
[ERROR] 
[ERROR] After correcting the problems, you can resume the build with the command
[ERROR]   mvn <goals> -rf :ctakes-assertion
Sending e-mails to: notifications@ctakes.apache.org timothy.miller@childrens.harvard.edu
channel stopped

Mime
View raw message