ctakes-notifications mailing list archives

Site index · List index
Message view « Date » · « Thread »
Top « Date » · « Thread »
From Apache Jenkins Server <jenk...@builds.apache.org>
Subject Build failed in Jenkins: ctakes-trunk-package » Apache cTAKES core #254
Date Tue, 26 Aug 2014 11:48:19 GMT
See <https://builds.apache.org/job/ctakes-trunk-package/org.apache.ctakes$ctakes-core/254/>

------------------------------------------
[INFO]                                                                         
[INFO] ------------------------------------------------------------------------
[INFO] Building Apache cTAKES core 3.2.1-SNAPSHOT
[INFO] ------------------------------------------------------------------------
Downloading: http://repo.maven.apache.org/maven2/org/jdom/jdom2/2.0.3/jdom2-2.0.3.pom
Downloaded: http://repo.maven.apache.org/maven2/org/jdom/jdom2/2.0.3/jdom2-2.0.3.pom (5 KB
at 43.6 KB/sec)
Downloading: http://repo.maven.apache.org/maven2/org/cleartk/cleartk-util/0.9.2/cleartk-util-0.9.2.pom
Downloaded: http://repo.maven.apache.org/maven2/org/cleartk/cleartk-util/0.9.2/cleartk-util-0.9.2.pom
(3 KB at 37.4 KB/sec)
Downloading: http://repo.maven.apache.org/maven2/com/google/guava/guava/10.0/guava-10.0.pom
Downloaded: http://repo.maven.apache.org/maven2/com/google/guava/guava/10.0/guava-10.0.pom
(6 KB at 75.1 KB/sec)
Downloading: http://repo.maven.apache.org/maven2/com/google/guava/guava-parent/10.0/guava-parent-10.0.pom
Downloaded: http://repo.maven.apache.org/maven2/com/google/guava/guava-parent/10.0/guava-parent-10.0.pom
(2 KB at 27.3 KB/sec)
Downloading: http://repo.maven.apache.org/maven2/com/carrotsearch/hppc/0.4.1/hppc-0.4.1.pom
Downloaded: http://repo.maven.apache.org/maven2/com/carrotsearch/hppc/0.4.1/hppc-0.4.1.pom
(14 KB at 191.9 KB/sec)
Downloading: http://repo.maven.apache.org/maven2/com/carrotsearch/hppc-parent/0.4.1/hppc-parent-0.4.1.pom
Downloaded: http://repo.maven.apache.org/maven2/com/carrotsearch/hppc-parent/0.4.1/hppc-parent-0.4.1.pom
(10 KB at 131.8 KB/sec)
Downloading: http://repo.maven.apache.org/maven2/org/apache/opennlp/opennlp-maxent/3.0.2-incubating/opennlp-maxent-3.0.2-incubating.pom
Downloaded: http://repo.maven.apache.org/maven2/org/apache/opennlp/opennlp-maxent/3.0.2-incubating/opennlp-maxent-3.0.2-incubating.pom
(3 KB at 40.7 KB/sec)
Downloading: http://repo.maven.apache.org/maven2/org/apache/opennlp/opennlp/1.5.2-incubating/opennlp-1.5.2-incubating.pom
Downloaded: http://repo.maven.apache.org/maven2/org/apache/opennlp/opennlp/1.5.2-incubating/opennlp-1.5.2-incubating.pom
(6 KB at 80.9 KB/sec)
Downloading: http://repo.maven.apache.org/maven2/org/apache/opennlp/opennlp-tools/1.5.2-incubating/opennlp-tools-1.5.2-incubating.pom
Downloaded: http://repo.maven.apache.org/maven2/org/apache/opennlp/opennlp-tools/1.5.2-incubating/opennlp-tools-1.5.2-incubating.pom
(6 KB at 76.4 KB/sec)
Downloading: http://repo.maven.apache.org/maven2/jwnl/jwnl/1.3.3/jwnl-1.3.3.pom
Downloading: http://opennlp.sourceforge.net/maven2/jwnl/jwnl/1.3.3/jwnl-1.3.3.pom
[WARNING] Checksum validation failed, expected <html> but is 37d922b558db37710887551abcee8921d837a68d
for http://opennlp.sourceforge.net/maven2/jwnl/jwnl/1.3.3/jwnl-1.3.3.pom
[WARNING] Checksum validation failed, expected <html> but is 37d922b558db37710887551abcee8921d837a68d
for http://opennlp.sourceforge.net/maven2/jwnl/jwnl/1.3.3/jwnl-1.3.3.pom
Downloaded: http://opennlp.sourceforge.net/maven2/jwnl/jwnl/1.3.3/jwnl-1.3.3.pom (2 KB at
4.4 KB/sec)
[WARNING] The POM for jwnl:jwnl:jar:1.3.3 is invalid, transitive dependencies (if any) will
not be available, enable debug logging for more details
Downloading: http://repo.maven.apache.org/maven2/edu/mit/findstruct/findstructapi/0.0.1/findstructapi-0.0.1.pom
Downloaded: http://repo.maven.apache.org/maven2/edu/mit/findstruct/findstructapi/0.0.1/findstructapi-0.0.1.pom
(990 B at 9.3 KB/sec)
Downloading: http://repo.maven.apache.org/maven2/com/googlecode/armbrust-file-utils/sqlwrapper/0.0.1/sqlwrapper-0.0.1.pom
Downloaded: http://repo.maven.apache.org/maven2/com/googlecode/armbrust-file-utils/sqlwrapper/0.0.1/sqlwrapper-0.0.1.pom
(855 B at 11.8 KB/sec)
Downloading: http://repo.maven.apache.org/maven2/net/sourceforge/openai/openaifsm/0.0.1/openaifsm-0.0.1.pom
Downloaded: http://repo.maven.apache.org/maven2/net/sourceforge/openai/openaifsm/0.0.1/openaifsm-0.0.1.pom
(892 B at 12.3 KB/sec)
Downloading: http://repo.maven.apache.org/maven2/org/apache/uima/uimaj-examples/2.4.0/uimaj-examples-2.4.0.pom
Downloaded: http://repo.maven.apache.org/maven2/org/apache/uima/uimaj-examples/2.4.0/uimaj-examples-2.4.0.pom
(5 KB at 68.0 KB/sec)
Downloading: http://repo.maven.apache.org/maven2/org/jdom/jdom2/2.0.3/jdom2-2.0.3.jar
Downloading: http://repo.maven.apache.org/maven2/com/carrotsearch/hppc/0.4.1/hppc-0.4.1.jar
Downloading: http://repo.maven.apache.org/maven2/org/cleartk/cleartk-util/0.9.2/cleartk-util-0.9.2.jar
Downloading: http://repo.maven.apache.org/maven2/com/google/guava/guava/10.0/guava-10.0.jar
Downloading: http://repo.maven.apache.org/maven2/org/apache/opennlp/opennlp-maxent/3.0.2-incubating/opennlp-maxent-3.0.2-incubating.jar
Downloaded: http://repo.maven.apache.org/maven2/org/cleartk/cleartk-util/0.9.2/cleartk-util-0.9.2.jar
(71 KB at 331.4 KB/sec)
Downloading: http://repo.maven.apache.org/maven2/org/apache/opennlp/opennlp-tools/1.5.2-incubating/opennlp-tools-1.5.2-incubating.jar
Downloaded: http://repo.maven.apache.org/maven2/org/apache/opennlp/opennlp-maxent/3.0.2-incubating/opennlp-maxent-3.0.2-incubating.jar
(108 KB at 432.9 KB/sec)
Downloading: http://repo.maven.apache.org/maven2/jwnl/jwnl/1.3.3/jwnl-1.3.3.jar
Downloading: http://repo.maven.apache.org/maven2/edu/mit/findstruct/findstructapi/0.0.1/findstructapi-0.0.1.jar
Downloaded: http://repo.maven.apache.org/maven2/edu/mit/findstruct/findstructapi/0.0.1/findstructapi-0.0.1.jar
(14 KB at 121.3 KB/sec)
Downloading: http://repo.maven.apache.org/maven2/com/googlecode/armbrust-file-utils/sqlwrapper/0.0.1/sqlwrapper-0.0.1.jar
Downloaded: http://repo.maven.apache.org/maven2/org/jdom/jdom2/2.0.3/jdom2-2.0.3.jar (291
KB at 719.5 KB/sec)
Downloading: http://repo.maven.apache.org/maven2/net/sourceforge/openai/openaifsm/0.0.1/openaifsm-0.0.1.jar
Downloaded: http://repo.maven.apache.org/maven2/net/sourceforge/openai/openaifsm/0.0.1/openaifsm-0.0.1.jar
(13 KB at 185.3 KB/sec)
Downloading: http://repo.maven.apache.org/maven2/org/apache/uima/uimaj-examples/2.4.0/uimaj-examples-2.4.0.jar
Downloaded: http://repo.maven.apache.org/maven2/com/googlecode/armbrust-file-utils/sqlwrapper/0.0.1/sqlwrapper-0.0.1.jar
(17 KB at 158.2 KB/sec)
Downloaded: http://repo.maven.apache.org/maven2/com/carrotsearch/hppc/0.4.1/hppc-0.4.1.jar
(1199 KB at 1974.3 KB/sec)
Downloaded: http://repo.maven.apache.org/maven2/org/apache/uima/uimaj-examples/2.4.0/uimaj-examples-2.4.0.jar
(157 KB at 1137.5 KB/sec)
Downloaded: http://repo.maven.apache.org/maven2/org/apache/opennlp/opennlp-tools/1.5.2-incubating/opennlp-tools-1.5.2-incubating.jar
(661 KB at 1540.7 KB/sec)
Downloaded: http://repo.maven.apache.org/maven2/com/google/guava/guava/10.0/guava-10.0.jar
(1468 KB at 2230.3 KB/sec)
Downloading: http://opennlp.sourceforge.net/maven2/jwnl/jwnl/1.3.3/jwnl-1.3.3.jar
[WARNING] Checksum validation failed, expected <html> but is 37d922b558db37710887551abcee8921d837a68d
for http://opennlp.sourceforge.net/maven2/jwnl/jwnl/1.3.3/jwnl-1.3.3.jar
[WARNING] Checksum validation failed, expected <html> but is 37d922b558db37710887551abcee8921d837a68d
for http://opennlp.sourceforge.net/maven2/jwnl/jwnl/1.3.3/jwnl-1.3.3.jar
Downloaded: http://opennlp.sourceforge.net/maven2/jwnl/jwnl/1.3.3/jwnl-1.3.3.jar (2 KB at
5.8 KB/sec)
[INFO] 
[INFO] --- maven-clean-plugin:2.4.1:clean (default-clean) @ ctakes-core ---
[INFO] 
[INFO] --- maven-remote-resources-plugin:1.4:process (default) @ ctakes-core ---
[WARNING] Invalid POM for jwnl:jwnl:jar:1.3.3, transitive dependencies (if any) will not be
available, enable debug logging for more details
Downloading: http://repo.maven.apache.org/maven2/jwnl/jwnl/1.3.3/jwnl-1.3.3.pom
[INFO] 
[INFO] --- maven-resources-plugin:2.5:resources (default-resources) @ ctakes-core ---
[debug] execute contextualize
[INFO] Using 'UTF-8' encoding to copy filtered resources.
[INFO] skip non existing resourceDirectory <https://builds.apache.org/job/ctakes-trunk-package/org.apache.ctakes$ctakes-core/ws/src/main/resources>
[INFO] Copying 3 resources
[INFO] 
[INFO] --- maven-compiler-plugin:2.4:compile (default-compile) @ ctakes-core ---
[INFO] Compiling 142 source files to <https://builds.apache.org/job/ctakes-trunk-package/org.apache.ctakes$ctakes-core/ws/target/classes>
[INFO] -------------------------------------------------------------
[ERROR] COMPILATION ERROR : 
[INFO] -------------------------------------------------------------
[ERROR] error: error reading /home/jenkins/jenkins-slave/maven-repositories/1/jwnl/jwnl/1.3.3/jwnl-1.3.3.jar;
error in opening zip file
[INFO] 1 error
[INFO] -------------------------------------------------------------

Mime
View raw message