ctakes-notifications mailing list archives

Site index · List index
Message view « Date » · « Thread »
Top « Date » · « Thread »
From Apache Jenkins Server <jenk...@builds.apache.org>
Subject Build failed in Jenkins: ctakes-trunk-compiletest » Apache cTAKES Temporal Information Extraction #515
Date Wed, 16 Jul 2014 14:07:31 GMT
See <https://builds.apache.org/job/ctakes-trunk-compiletest/org.apache.ctakes$ctakes-temporal/515/>

------------------------------------------
[INFO]                                                                         
[INFO] ------------------------------------------------------------------------
[INFO] Building Apache cTAKES Temporal Information Extraction 3.2.1-SNAPSHOT
[INFO] ------------------------------------------------------------------------
[INFO] 
[INFO] --- maven-clean-plugin:2.4.1:clean (default-clean) @ ctakes-temporal ---
[INFO] 
[INFO] --- maven-dependency-plugin:2.6:unpack (unpack) @ ctakes-temporal ---
[INFO] Configured Artifact: net.sourceforge.ctakesresources:ctakes-resources-umls2011ab:3.1.1:jar
[INFO] Unpacking /home/jenkins/jenkins-slave/maven-repositories/1/net/sourceforge/ctakesresources/ctakes-resources-umls2011ab/3.1.1/ctakes-resources-umls2011ab-3.1.1.jar
to <https://builds.apache.org/job/ctakes-trunk-compiletest/org.apache.ctakes$ctakes-temporal/ws/target/unpacked>
with includes "" and excludes ""
[INFO] 
[INFO] --- maven-remote-resources-plugin:1.4:process (default) @ ctakes-temporal ---
Downloading: http://repo.maven.apache.org/maven2/jwnl/jwnl/1.3.3/jwnl-1.3.3.pom
[INFO] 
[INFO] --- maven-resources-plugin:2.5:resources (default-resources) @ ctakes-temporal ---
[debug] execute contextualize
[INFO] Using 'UTF-8' encoding to copy filtered resources.
[INFO] Copying 3 resources
[INFO] Copying 3 resources
[INFO] 
[INFO] --- maven-compiler-plugin:2.4:compile (default-compile) @ ctakes-temporal ---
[INFO] Compiling 134 source files to <https://builds.apache.org/job/ctakes-trunk-compiletest/org.apache.ctakes$ctakes-temporal/ws/target/classes>
[INFO] -------------------------------------------------------------
[ERROR] COMPILATION ERROR : 
[INFO] -------------------------------------------------------------
[ERROR] <https://builds.apache.org/job/ctakes-trunk-compiletest/org.apache.ctakes$ctakes-temporal/ws/src/main/java/org/apache/ctakes/temporal/data/analysis/CoreferenceLinkDistanceAnalyzer.java>:[17,67]
error: package org.apache.ctakes.temporal.eval.EvaluationOfEventCoreference does not exist
[ERROR] <https://builds.apache.org/job/ctakes-trunk-compiletest/org.apache.ctakes$ctakes-temporal/ws/src/main/java/org/apache/ctakes/temporal/eval/EvaluationOfEventTimeRelations.java>:[331,29]
[deprecation] createAnnotatorDescription(File) in EventTimeRelationAnnotator has been deprecated
[ERROR] <https://builds.apache.org/job/ctakes-trunk-compiletest/org.apache.ctakes$ctakes-temporal/ws/src/main/java/org/apache/ctakes/temporal/eval/EvaluationOfEventEventRelations.java>:[139,35]
[deprecation] createAnnotatorDescription(File) in EventEventRelationAnnotator has been deprecated
[ERROR] <https://builds.apache.org/job/ctakes-trunk-compiletest/org.apache.ctakes$ctakes-temporal/ws/src/main/java/org/apache/ctakes/temporal/eval/EvaluationOfTemporalRelations.java>:[351,29]
[deprecation] createAnnotatorDescription(File) in EventTimeRelationAnnotator has been deprecated
[ERROR] <https://builds.apache.org/job/ctakes-trunk-compiletest/org.apache.ctakes$ctakes-temporal/ws/src/main/java/org/apache/ctakes/temporal/eval/EvaluationOfTemporalRelations.java>:[352,50]
[deprecation] createAnnotatorDescription(File) in EventEventRelationAnnotator has been deprecated
[ERROR] <https://builds.apache.org/job/ctakes-trunk-compiletest/org.apache.ctakes$ctakes-temporal/ws/src/main/java/org/apache/ctakes/temporal/eval/EvaluationOfTemporalRelations.java>:[353,50]
[deprecation] createAnnotatorDescription(File) in EventDischargeTimeAnnotator has been deprecated
[ERROR] <https://builds.apache.org/job/ctakes-trunk-compiletest/org.apache.ctakes$ctakes-temporal/ws/src/main/java/org/apache/ctakes/temporal/eval/EvaluationOfTemporalRelations.java>:[354,50]
[deprecation] createAnnotatorDescription(File) in EventAdmissionTimeAnnotator has been deprecated
[ERROR] <https://builds.apache.org/job/ctakes-trunk-compiletest/org.apache.ctakes$ctakes-temporal/ws/src/main/java/org/apache/ctakes/temporal/data/analysis/CoreferenceLinkDistanceAnalyzer.java>:[71,74]
error: cannot find symbol
[ERROR]   symbol:   class ParagraphAnnotator
  location: class CoreferenceLinkDistanceAnalyzer
<https://builds.apache.org/job/ctakes-trunk-compiletest/org.apache.ctakes$ctakes-temporal/ws/src/main/java/org/apache/ctakes/temporal/eval/EvaluationOfEventProperties.java>:[180,42]
[deprecation] createAnnotatorDescription(File) in DocTimeRelAnnotator has been deprecated
[ERROR] <https://builds.apache.org/job/ctakes-trunk-compiletest/org.apache.ctakes$ctakes-temporal/ws/src/main/java/org/apache/ctakes/temporal/eval/EvaluationOfEventProperties.java>:[181,50]
[deprecation] createAnnotatorDescription(File) in ContextualModalityAnnotator has been deprecated
[ERROR] <https://builds.apache.org/job/ctakes-trunk-compiletest/org.apache.ctakes$ctakes-temporal/ws/src/main/java/org/apache/ctakes/temporal/ae/MetaTimeAnnotator.java>:[75,38]
[deprecation] createEnsembleDescription(File,String) in BackwardsTimeAnnotator has been deprecated
[ERROR] <https://builds.apache.org/job/ctakes-trunk-compiletest/org.apache.ctakes$ctakes-temporal/ws/src/main/java/org/apache/ctakes/temporal/ae/MetaTimeAnnotator.java>:[78,46]
[deprecation] createEnsembleDescription(File,String) in ConstituencyBasedTimeAnnotator has
been deprecated
[ERROR] <https://builds.apache.org/job/ctakes-trunk-compiletest/org.apache.ctakes$ctakes-temporal/ws/src/main/java/org/apache/ctakes/temporal/ae/MetaTimeAnnotator.java>:[81,32]
[deprecation] createEnsembleDescription(File,String) in CRFTimeAnnotator has been deprecated
[ERROR] <https://builds.apache.org/job/ctakes-trunk-compiletest/org.apache.ctakes$ctakes-temporal/ws/src/main/java/org/apache/ctakes/temporal/ae/MetaTimeAnnotator.java>:[104,38]
[deprecation] createEnsembleDescription(File,String) in BackwardsTimeAnnotator has been deprecated
[ERROR] <https://builds.apache.org/job/ctakes-trunk-compiletest/org.apache.ctakes$ctakes-temporal/ws/src/main/java/org/apache/ctakes/temporal/ae/MetaTimeAnnotator.java>:[107,46]
[deprecation] createEnsembleDescription(File,String) in ConstituencyBasedTimeAnnotator has
been deprecated
[ERROR] <https://builds.apache.org/job/ctakes-trunk-compiletest/org.apache.ctakes$ctakes-temporal/ws/src/main/java/org/apache/ctakes/temporal/ae/MetaTimeAnnotator.java>:[110,32]
[deprecation] createEnsembleDescription(File,String) in CRFTimeAnnotator has been deprecated
[ERROR] <https://builds.apache.org/job/ctakes-trunk-compiletest/org.apache.ctakes$ctakes-temporal/ws/src/main/java/org/apache/ctakes/temporal/eval/EvaluationOfTimeSpans.java>:[248,23]
[deprecation] createAnnotatorDescription(File) in TimeAnnotator has been deprecated
[ERROR] <https://builds.apache.org/job/ctakes-trunk-compiletest/org.apache.ctakes$ctakes-temporal/ws/src/main/java/org/apache/ctakes/temporal/eval/EvaluationOfNEPredicateEventSpans.java>:[77,37]
[deprecation] createAnnotatorDescription(File) in NEPredicateEventAnnotator has been deprecated
[INFO] 18 errors 
[INFO] -------------------------------------------------------------
[JENKINS] Archiving disabled

Mime
View raw message