ctakes-notifications mailing list archives

Site index · List index
Message view « Date » · « Thread »
Top « Date » · « Thread »
From Apache Jenkins Server <jenk...@builds.apache.org>
Subject Build failed in Jenkins: ctakes-trunk-compiletest » Apache cTAKES Temporal Information Extraction #514
Date Tue, 15 Jul 2014 21:38:53 GMT
See <https://builds.apache.org/job/ctakes-trunk-compiletest/org.apache.ctakes$ctakes-temporal/514/changes>

Changes:

[tmill] Added class for analyzing coref links relative to paragraph similarity.

------------------------------------------
[INFO]                                                                         
[INFO] ------------------------------------------------------------------------
[INFO] Building Apache cTAKES Temporal Information Extraction 3.2.1-SNAPSHOT
[INFO] ------------------------------------------------------------------------
Downloading: http://repo.maven.apache.org/maven2/org/cleartk/cleartk-timeml/1.1.0/cleartk-timeml-1.1.0.pom
Downloaded: http://repo.maven.apache.org/maven2/org/cleartk/cleartk-timeml/1.1.0/cleartk-timeml-1.1.0.pom
(4 KB at 52.9 KB/sec)
Downloading: http://repo.maven.apache.org/maven2/org/jdom/jdom/2.0.2/jdom-2.0.2.pom
Downloaded: http://repo.maven.apache.org/maven2/org/jdom/jdom/2.0.2/jdom-2.0.2.pom (5 KB at
91.6 KB/sec)
Downloading: http://repo.maven.apache.org/maven2/org/cleartk/cleartk-type-system/1.2.0/cleartk-type-system-1.2.0.pom
Downloaded: http://repo.maven.apache.org/maven2/org/cleartk/cleartk-type-system/1.2.0/cleartk-type-system-1.2.0.pom
(3 KB at 56.9 KB/sec)
Downloading: http://repo.maven.apache.org/maven2/org/cleartk/cleartk-feature/0.8.0/cleartk-feature-0.8.0.pom
Downloaded: http://repo.maven.apache.org/maven2/org/cleartk/cleartk-feature/0.8.0/cleartk-feature-0.8.0.pom
(3 KB at 46.0 KB/sec)
Downloading: http://repo.maven.apache.org/maven2/org/cleartk/cleartk-corpus/0.8.0/cleartk-corpus-0.8.0.pom
Downloaded: http://repo.maven.apache.org/maven2/org/cleartk/cleartk-corpus/0.8.0/cleartk-corpus-0.8.0.pom
(3 KB at 43.0 KB/sec)
Downloading: http://repo.maven.apache.org/maven2/org/cleartk/cleartk-token/0.9.0/cleartk-token-0.9.0.pom
Downloaded: http://repo.maven.apache.org/maven2/org/cleartk/cleartk-token/0.9.0/cleartk-token-0.9.0.pom
(3 KB at 45.7 KB/sec)
Downloading: http://repo.maven.apache.org/maven2/org/cleartk/cleartk-snowball/0.9.3/cleartk-snowball-0.9.3.pom
Downloaded: http://repo.maven.apache.org/maven2/org/cleartk/cleartk-snowball/0.9.3/cleartk-snowball-0.9.3.pom
(3 KB at 18.6 KB/sec)
Downloading: http://repo.maven.apache.org/maven2/org/apache/lucene/lucene-snowball/3.0.3/lucene-snowball-3.0.3.pom
Downloaded: http://repo.maven.apache.org/maven2/org/apache/lucene/lucene-snowball/3.0.3/lucene-snowball-3.0.3.pom
(2 KB at 28.7 KB/sec)
Downloading: http://repo.maven.apache.org/maven2/org/apache/lucene/lucene-contrib/3.0.3/lucene-contrib-3.0.3.pom
Downloaded: http://repo.maven.apache.org/maven2/org/apache/lucene/lucene-contrib/3.0.3/lucene-contrib-3.0.3.pom
(2 KB at 38.3 KB/sec)
Downloading: http://repo.maven.apache.org/maven2/org/apache/lucene/lucene-parent/3.0.3/lucene-parent-3.0.3.pom
Downloaded: http://repo.maven.apache.org/maven2/org/apache/lucene/lucene-parent/3.0.3/lucene-parent-3.0.3.pom
(4 KB at 62.4 KB/sec)
Downloading: http://repo.maven.apache.org/maven2/org/cleartk/cleartk-opennlp-tools/0.10.3/cleartk-opennlp-tools-0.10.3.pom
Downloaded: http://repo.maven.apache.org/maven2/org/cleartk/cleartk-opennlp-tools/0.10.3/cleartk-opennlp-tools-0.10.3.pom
(3 KB at 23.5 KB/sec)
Downloading: http://repo.maven.apache.org/maven2/org/apache/opennlp/opennlp-uima/1.5.2-incubating/opennlp-uima-1.5.2-incubating.pom
Downloaded: http://repo.maven.apache.org/maven2/org/apache/opennlp/opennlp-uima/1.5.2-incubating/opennlp-uima-1.5.2-incubating.pom
(3 KB at 60.5 KB/sec)
Downloading: http://repo.maven.apache.org/maven2/org/cleartk/cleartk-ml-svmlight/1.2.0/cleartk-ml-svmlight-1.2.0.pom
Downloaded: http://repo.maven.apache.org/maven2/org/cleartk/cleartk-ml-svmlight/1.2.0/cleartk-ml-svmlight-1.2.0.pom
(2 KB at 37.6 KB/sec)
Downloading: http://repo.maven.apache.org/maven2/org/cleartk/cleartk-syntax/0.7.0/cleartk-syntax-0.7.0.pom
Downloaded: http://repo.maven.apache.org/maven2/org/cleartk/cleartk-syntax/0.7.0/cleartk-syntax-0.7.0.pom
(3 KB at 43.0 KB/sec)
Downloading: http://repo.maven.apache.org/maven2/org/cleartk/cleartk-ml-tksvmlight/0.5.0/cleartk-ml-tksvmlight-0.5.0.pom
Downloaded: http://repo.maven.apache.org/maven2/org/cleartk/cleartk-ml-tksvmlight/0.5.0/cleartk-ml-tksvmlight-0.5.0.pom
(3 KB at 43.6 KB/sec)
Downloading: http://repo.maven.apache.org/maven2/org/cleartk/cleartk-ml-crfsuite/0.2.2/cleartk-ml-crfsuite-0.2.2.pom
Downloaded: http://repo.maven.apache.org/maven2/org/cleartk/cleartk-ml-crfsuite/0.2.2/cleartk-ml-crfsuite-0.2.2.pom
(3 KB at 51.3 KB/sec)
Downloading: http://repo.maven.apache.org/maven2/de/tudarmstadt/ukp/dkpro/core/de.tudarmstadt.ukp.dkpro.core.api.resources-asl/1.4.0/de.tudarmstadt.ukp.dkpro.core.api.resources-asl-1.4.0.pom
Downloaded: http://repo.maven.apache.org/maven2/de/tudarmstadt/ukp/dkpro/core/de.tudarmstadt.ukp.dkpro.core.api.resources-asl/1.4.0/de.tudarmstadt.ukp.dkpro.core.api.resources-asl-1.4.0.pom
(2 KB at 38.3 KB/sec)
Downloading: http://repo.maven.apache.org/maven2/de/tudarmstadt/ukp/dkpro/core/de.tudarmstadt.ukp.dkpro.core-asl/1.4.0/de.tudarmstadt.ukp.dkpro.core-asl-1.4.0.pom
Downloaded: http://repo.maven.apache.org/maven2/de/tudarmstadt/ukp/dkpro/core/de.tudarmstadt.ukp.dkpro.core-asl/1.4.0/de.tudarmstadt.ukp.dkpro.core-asl-1.4.0.pom
(29 KB at 395.8 KB/sec)
Downloading: http://repo.maven.apache.org/maven2/de/tudarmstadt/ukp/dkpro/core/dkpro-parent-pom/3/dkpro-parent-pom-3.pom
Downloaded: http://repo.maven.apache.org/maven2/de/tudarmstadt/ukp/dkpro/core/dkpro-parent-pom/3/dkpro-parent-pom-3.pom
(11 KB at 219.5 KB/sec)
Downloading: http://repo.maven.apache.org/maven2/info/bethard/timenorm/0.9.0/timenorm-0.9.0.pom
Downloaded: http://repo.maven.apache.org/maven2/info/bethard/timenorm/0.9.0/timenorm-0.9.0.pom
(7 KB at 137.9 KB/sec)
Downloading: http://repo.maven.apache.org/maven2/org/scala-lang/scala-library/2.10.1/scala-library-2.10.1.pom
Downloaded: http://repo.maven.apache.org/maven2/org/scala-lang/scala-library/2.10.1/scala-library-2.10.1.pom
(2 KB at 39.4 KB/sec)
Downloading: http://repo.maven.apache.org/maven2/org/threeten/threetenbp/0.8.1/threetenbp-0.8.1.pom
Downloaded: http://repo.maven.apache.org/maven2/org/threeten/threetenbp/0.8.1/threetenbp-0.8.1.pom
(12 KB at 233.8 KB/sec)
Downloading: http://repo.maven.apache.org/maven2/com/googlecode/java-diff-utils/diffutils/1.3.0/diffutils-1.3.0.pom
Downloaded: http://repo.maven.apache.org/maven2/com/googlecode/java-diff-utils/diffutils/1.3.0/diffutils-1.3.0.pom
(3 KB at 55.3 KB/sec)
Downloading: http://repo.maven.apache.org/maven2/org/cleartk/cleartk-timeml/1.1.0/cleartk-timeml-1.1.0.jar
Downloading: http://repo.maven.apache.org/maven2/org/jdom/jdom/2.0.2/jdom-2.0.2.jar
Downloading: http://repo.maven.apache.org/maven2/org/cleartk/cleartk-feature/0.8.0/cleartk-feature-0.8.0.jar
Downloading: http://repo.maven.apache.org/maven2/org/cleartk/cleartk-corpus/0.8.0/cleartk-corpus-0.8.0.jar
Downloading: http://repo.maven.apache.org/maven2/org/cleartk/cleartk-token/0.9.0/cleartk-token-0.9.0.jar
Downloaded: http://repo.maven.apache.org/maven2/org/cleartk/cleartk-feature/0.8.0/cleartk-feature-0.8.0.jar
(22 KB at 221.6 KB/sec)
Downloading: http://repo.maven.apache.org/maven2/org/cleartk/cleartk-snowball/0.9.3/cleartk-snowball-0.9.3.jar
Downloaded: http://repo.maven.apache.org/maven2/org/cleartk/cleartk-token/0.9.0/cleartk-token-0.9.0.jar
(41 KB at 344.7 KB/sec)
Downloading: http://repo.maven.apache.org/maven2/org/apache/lucene/lucene-snowball/3.0.3/lucene-snowball-3.0.3.jar
Downloaded: http://repo.maven.apache.org/maven2/org/cleartk/cleartk-snowball/0.9.3/cleartk-snowball-0.9.3.jar
(6 KB at 112.7 KB/sec)
Downloading: http://repo.maven.apache.org/maven2/org/cleartk/cleartk-opennlp-tools/0.10.3/cleartk-opennlp-tools-0.10.3.jar
Downloaded: http://repo.maven.apache.org/maven2/org/cleartk/cleartk-corpus/0.8.0/cleartk-corpus-0.8.0.jar
(148 KB at 763.8 KB/sec)
Downloading: http://repo.maven.apache.org/maven2/org/apache/opennlp/opennlp-uima/1.5.2-incubating/opennlp-uima-1.5.2-incubating.jar
Downloaded: http://repo.maven.apache.org/maven2/org/apache/lucene/lucene-snowball/3.0.3/lucene-snowball-3.0.3.jar
(113 KB at 945.8 KB/sec)
Downloading: http://repo.maven.apache.org/maven2/org/cleartk/cleartk-ml-svmlight/1.2.0/cleartk-ml-svmlight-1.2.0.jar
Downloaded: http://repo.maven.apache.org/maven2/org/jdom/jdom/2.0.2/jdom-2.0.2.jar (289 KB
at 1163.0 KB/sec)
Downloading: http://repo.maven.apache.org/maven2/org/cleartk/cleartk-syntax/0.7.0/cleartk-syntax-0.7.0.jar
Downloaded: http://repo.maven.apache.org/maven2/org/apache/opennlp/opennlp-uima/1.5.2-incubating/opennlp-uima-1.5.2-incubating.jar
(87 KB at 1151.8 KB/sec)
Downloading: http://repo.maven.apache.org/maven2/org/cleartk/cleartk-ml-tksvmlight/0.5.0/cleartk-ml-tksvmlight-0.5.0.jar
Downloaded: http://repo.maven.apache.org/maven2/org/cleartk/cleartk-ml-svmlight/1.2.0/cleartk-ml-svmlight-1.2.0.jar
(56 KB at 781.9 KB/sec)
Downloading: http://repo.maven.apache.org/maven2/org/cleartk/cleartk-type-system/1.2.0/cleartk-type-system-1.2.0.jar
Downloaded: http://repo.maven.apache.org/maven2/org/cleartk/cleartk-ml-tksvmlight/0.5.0/cleartk-ml-tksvmlight-0.5.0.jar
(50 KB at 671.6 KB/sec)
Downloading: http://repo.maven.apache.org/maven2/org/cleartk/cleartk-ml-crfsuite/0.2.2/cleartk-ml-crfsuite-0.2.2.jar
Downloaded: http://repo.maven.apache.org/maven2/org/cleartk/cleartk-syntax/0.7.0/cleartk-syntax-0.7.0.jar
(45 KB at 341.6 KB/sec)
Downloading: http://repo.maven.apache.org/maven2/de/tudarmstadt/ukp/dkpro/core/de.tudarmstadt.ukp.dkpro.core.api.resources-asl/1.4.0/de.tudarmstadt.ukp.dkpro.core.api.resources-asl-1.4.0.jar
Downloaded: http://repo.maven.apache.org/maven2/org/cleartk/cleartk-type-system/1.2.0/cleartk-type-system-1.2.0.jar
(149 KB at 1258.2 KB/sec)
Downloading: http://repo.maven.apache.org/maven2/info/bethard/timenorm/0.9.0/timenorm-0.9.0.jar
Downloaded: http://repo.maven.apache.org/maven2/de/tudarmstadt/ukp/dkpro/core/de.tudarmstadt.ukp.dkpro.core.api.resources-asl/1.4.0/de.tudarmstadt.ukp.dkpro.core.api.resources-asl-1.4.0.jar
(23 KB at 432.1 KB/sec)
Downloading: http://repo.maven.apache.org/maven2/org/scala-lang/scala-library/2.10.1/scala-library-2.10.1.jar
Downloaded: http://repo.maven.apache.org/maven2/org/cleartk/cleartk-ml-crfsuite/0.2.2/cleartk-ml-crfsuite-0.2.2.jar
(868 KB at 3212.1 KB/sec)
Downloading: http://repo.maven.apache.org/maven2/org/threeten/threetenbp/0.8.1/threetenbp-0.8.1.jar
Downloaded: http://repo.maven.apache.org/maven2/info/bethard/timenorm/0.9.0/timenorm-0.9.0.jar
(466 KB at 2447.9 KB/sec)
Downloading: http://repo.maven.apache.org/maven2/com/googlecode/java-diff-utils/diffutils/1.3.0/diffutils-1.3.0.jar
Downloaded: http://repo.maven.apache.org/maven2/com/googlecode/java-diff-utils/diffutils/1.3.0/diffutils-1.3.0.jar
(34 KB at 694.4 KB/sec)
Downloaded: http://repo.maven.apache.org/maven2/org/cleartk/cleartk-timeml/1.1.0/cleartk-timeml-1.1.0.jar
(4679 KB at 6870.8 KB/sec)
Downloaded: http://repo.maven.apache.org/maven2/org/threeten/threetenbp/0.8.1/threetenbp-0.8.1.jar
(435 KB at 4263.9 KB/sec)
Downloaded: http://repo.maven.apache.org/maven2/org/scala-lang/scala-library/2.10.1/scala-library-2.10.1.jar
(6971 KB at 12018.3 KB/sec)
Downloaded: http://repo.maven.apache.org/maven2/org/cleartk/cleartk-opennlp-tools/0.10.3/cleartk-opennlp-tools-0.10.3.jar
(41617 KB at 20075.6 KB/sec)
[INFO] 
[INFO] --- maven-clean-plugin:2.4.1:clean (default-clean) @ ctakes-temporal ---
[INFO] 
[INFO] --- maven-dependency-plugin:2.6:unpack (unpack) @ ctakes-temporal ---
[INFO] Configured Artifact: net.sourceforge.ctakesresources:ctakes-resources-umls2011ab:3.1.1:jar
[INFO] Unpacking /home/jenkins/jenkins-slave/maven-repositories/1/net/sourceforge/ctakesresources/ctakes-resources-umls2011ab/3.1.1/ctakes-resources-umls2011ab-3.1.1.jar
to <https://builds.apache.org/job/ctakes-trunk-compiletest/org.apache.ctakes$ctakes-temporal/ws/target/unpacked>
with includes "" and excludes ""
[INFO] 
[INFO] --- maven-remote-resources-plugin:1.4:process (default) @ ctakes-temporal ---
Downloading: http://repo.maven.apache.org/maven2/jwnl/jwnl/1.3.3/jwnl-1.3.3.pom
[INFO] 
[INFO] --- maven-resources-plugin:2.5:resources (default-resources) @ ctakes-temporal ---
[debug] execute contextualize
[INFO] Using 'UTF-8' encoding to copy filtered resources.
[INFO] Copying 3 resources
[INFO] Copying 3 resources
[INFO] 
[INFO] --- maven-compiler-plugin:2.4:compile (default-compile) @ ctakes-temporal ---
[INFO] Compiling 134 source files to <https://builds.apache.org/job/ctakes-trunk-compiletest/org.apache.ctakes$ctakes-temporal/ws/target/classes>
[INFO] -------------------------------------------------------------
[ERROR] COMPILATION ERROR : 
[INFO] -------------------------------------------------------------
[ERROR] <https://builds.apache.org/job/ctakes-trunk-compiletest/org.apache.ctakes$ctakes-temporal/ws/src/main/java/org/apache/ctakes/temporal/data/analysis/CoreferenceLinkDistanceAnalyzer.java>:[17,67]
error: package org.apache.ctakes.temporal.eval.EvaluationOfEventCoreference does not exist
[ERROR] <https://builds.apache.org/job/ctakes-trunk-compiletest/org.apache.ctakes$ctakes-temporal/ws/src/main/java/org/apache/ctakes/temporal/data/analysis/CoreferenceLinkDistanceAnalyzer.java>:[23,48]
error: cannot find symbol
[ERROR]   symbol:   class Markable
  location: package org.apache.ctakes.typesystem.type.textsem
<https://builds.apache.org/job/ctakes-trunk-compiletest/org.apache.ctakes$ctakes-temporal/ws/src/main/java/org/apache/ctakes/temporal/eval/EvaluationOfEventTimeRelations.java>:[331,29]
[deprecation] createAnnotatorDescription(File) in EventTimeRelationAnnotator has been deprecated
[ERROR] <https://builds.apache.org/job/ctakes-trunk-compiletest/org.apache.ctakes$ctakes-temporal/ws/src/main/java/org/apache/ctakes/temporal/eval/EvaluationOfEventEventRelations.java>:[139,35]
[deprecation] createAnnotatorDescription(File) in EventEventRelationAnnotator has been deprecated
[ERROR] <https://builds.apache.org/job/ctakes-trunk-compiletest/org.apache.ctakes$ctakes-temporal/ws/src/main/java/org/apache/ctakes/temporal/eval/EvaluationOfTemporalRelations.java>:[351,29]
[deprecation] createAnnotatorDescription(File) in EventTimeRelationAnnotator has been deprecated
[ERROR] <https://builds.apache.org/job/ctakes-trunk-compiletest/org.apache.ctakes$ctakes-temporal/ws/src/main/java/org/apache/ctakes/temporal/eval/EvaluationOfTemporalRelations.java>:[352,50]
[deprecation] createAnnotatorDescription(File) in EventEventRelationAnnotator has been deprecated
[ERROR] <https://builds.apache.org/job/ctakes-trunk-compiletest/org.apache.ctakes$ctakes-temporal/ws/src/main/java/org/apache/ctakes/temporal/eval/EvaluationOfTemporalRelations.java>:[353,50]
[deprecation] createAnnotatorDescription(File) in EventDischargeTimeAnnotator has been deprecated
[ERROR] <https://builds.apache.org/job/ctakes-trunk-compiletest/org.apache.ctakes$ctakes-temporal/ws/src/main/java/org/apache/ctakes/temporal/eval/EvaluationOfTemporalRelations.java>:[354,50]
[deprecation] createAnnotatorDescription(File) in EventAdmissionTimeAnnotator has been deprecated
[ERROR] <https://builds.apache.org/job/ctakes-trunk-compiletest/org.apache.ctakes$ctakes-temporal/ws/src/main/java/org/apache/ctakes/temporal/data/analysis/CoreferenceLinkDistanceAnalyzer.java>:[71,74]
error: cannot find symbol
[ERROR]   symbol:   class ParagraphAnnotator
  location: class CoreferenceLinkDistanceAnalyzer
<https://builds.apache.org/job/ctakes-trunk-compiletest/org.apache.ctakes$ctakes-temporal/ws/src/main/java/org/apache/ctakes/temporal/data/analysis/CoreferenceLinkDistanceAnalyzer.java>:[92,10]
error: cannot find symbol
[ERROR]   symbol:   class Markable
  location: class CoreferenceLinkDistanceAnalyzer
<https://builds.apache.org/job/ctakes-trunk-compiletest/org.apache.ctakes$ctakes-temporal/ws/src/main/java/org/apache/ctakes/temporal/data/analysis/CoreferenceLinkDistanceAnalyzer.java>:[92,54]
error: unexpected type
[ERROR]   required: class
  found:    <K,V>HashMap<K,V>
  where K,V are type-variables:
    K extends Object declared in class HashMap
    V extends Object declared in class HashMap
<https://builds.apache.org/job/ctakes-trunk-compiletest/org.apache.ctakes$ctakes-temporal/ws/src/main/java/org/apache/ctakes/temporal/data/analysis/CoreferenceLinkDistanceAnalyzer.java>:[97,19]
error: cannot find symbol
[ERROR]   symbol:   class Markable
  location: class CoreferenceLinkDistanceAnalyzer
<https://builds.apache.org/job/ctakes-trunk-compiletest/org.apache.ctakes$ctakes-temporal/ws/src/main/java/org/apache/ctakes/temporal/data/analysis/CoreferenceLinkDistanceAnalyzer.java>:[97,74]
error: cannot find symbol
[ERROR]   symbol:   class Markable
  location: class CoreferenceLinkDistanceAnalyzer
<https://builds.apache.org/job/ctakes-trunk-compiletest/org.apache.ctakes$ctakes-temporal/ws/src/main/java/org/apache/ctakes/temporal/data/analysis/CoreferenceLinkDistanceAnalyzer.java>:[98,12]
error: cannot find symbol
[ERROR]   symbol:   class Markable
  location: class CoreferenceLinkDistanceAnalyzer
<https://builds.apache.org/job/ctakes-trunk-compiletest/org.apache.ctakes$ctakes-temporal/ws/src/main/java/org/apache/ctakes/temporal/data/analysis/CoreferenceLinkDistanceAnalyzer.java>:[181,10]
error: cannot find symbol
[ERROR]   symbol:   class Markable
  location: class CoreferenceLinkDistanceAnalyzer
<https://builds.apache.org/job/ctakes-trunk-compiletest/org.apache.ctakes$ctakes-temporal/ws/src/main/java/org/apache/ctakes/temporal/data/analysis/CoreferenceLinkDistanceAnalyzer.java>:[181,29]
error: cannot find symbol
[ERROR]   symbol:   class Markable
  location: class CoreferenceLinkDistanceAnalyzer
<https://builds.apache.org/job/ctakes-trunk-compiletest/org.apache.ctakes$ctakes-temporal/ws/src/main/java/org/apache/ctakes/temporal/eval/EvaluationOfEventProperties.java>:[180,42]
[deprecation] createAnnotatorDescription(File) in DocTimeRelAnnotator has been deprecated
[ERROR] <https://builds.apache.org/job/ctakes-trunk-compiletest/org.apache.ctakes$ctakes-temporal/ws/src/main/java/org/apache/ctakes/temporal/eval/EvaluationOfEventProperties.java>:[181,50]
[deprecation] createAnnotatorDescription(File) in ContextualModalityAnnotator has been deprecated
[ERROR] <https://builds.apache.org/job/ctakes-trunk-compiletest/org.apache.ctakes$ctakes-temporal/ws/src/main/java/org/apache/ctakes/temporal/ae/MetaTimeAnnotator.java>:[75,38]
[deprecation] createEnsembleDescription(File,String) in BackwardsTimeAnnotator has been deprecated
[ERROR] <https://builds.apache.org/job/ctakes-trunk-compiletest/org.apache.ctakes$ctakes-temporal/ws/src/main/java/org/apache/ctakes/temporal/ae/MetaTimeAnnotator.java>:[78,46]
[deprecation] createEnsembleDescription(File,String) in ConstituencyBasedTimeAnnotator has
been deprecated
[ERROR] <https://builds.apache.org/job/ctakes-trunk-compiletest/org.apache.ctakes$ctakes-temporal/ws/src/main/java/org/apache/ctakes/temporal/ae/MetaTimeAnnotator.java>:[81,32]
[deprecation] createEnsembleDescription(File,String) in CRFTimeAnnotator has been deprecated
[ERROR] <https://builds.apache.org/job/ctakes-trunk-compiletest/org.apache.ctakes$ctakes-temporal/ws/src/main/java/org/apache/ctakes/temporal/ae/MetaTimeAnnotator.java>:[104,38]
[deprecation] createEnsembleDescription(File,String) in BackwardsTimeAnnotator has been deprecated
[ERROR] <https://builds.apache.org/job/ctakes-trunk-compiletest/org.apache.ctakes$ctakes-temporal/ws/src/main/java/org/apache/ctakes/temporal/ae/MetaTimeAnnotator.java>:[107,46]
[deprecation] createEnsembleDescription(File,String) in ConstituencyBasedTimeAnnotator has
been deprecated
[ERROR] <https://builds.apache.org/job/ctakes-trunk-compiletest/org.apache.ctakes$ctakes-temporal/ws/src/main/java/org/apache/ctakes/temporal/ae/MetaTimeAnnotator.java>:[110,32]
[deprecation] createEnsembleDescription(File,String) in CRFTimeAnnotator has been deprecated
[ERROR] <https://builds.apache.org/job/ctakes-trunk-compiletest/org.apache.ctakes$ctakes-temporal/ws/src/main/java/org/apache/ctakes/temporal/eval/EvaluationOfTimeSpans.java>:[248,23]
[deprecation] createAnnotatorDescription(File) in TimeAnnotator has been deprecated
[ERROR] <https://builds.apache.org/job/ctakes-trunk-compiletest/org.apache.ctakes$ctakes-temporal/ws/src/main/java/org/apache/ctakes/temporal/eval/EvaluationOfNEPredicateEventSpans.java>:[77,37]
[deprecation] createAnnotatorDescription(File) in NEPredicateEventAnnotator has been deprecated
[INFO] 26 errors 
[INFO] -------------------------------------------------------------
[JENKINS] Archiving disabled

Mime
View raw message