ctakes-notifications mailing list archives

Site index · List index
Message view « Date » · « Thread »
Top « Date » · « Thread »
From Apache Jenkins Server <jenk...@builds.apache.org>
Subject Build failed in Jenkins: ctakes-trunk-compiletest #514
Date Tue, 15 Jul 2014 21:38:56 GMT
See <https://builds.apache.org/job/ctakes-trunk-compiletest/514/changes>

Changes:

[tmill] CTAKES-304: Added classes for reading/querying neural word embeddings.

[tmill] Added class for analyzing coref links relative to paragraph similarity.

------------------------------------------
[...truncated 10955 lines...]
Downloaded: http://repo.maven.apache.org/maven2/de/tudarmstadt/ukp/dkpro/core/de.tudarmstadt.ukp.dkpro.core.api.resources-asl/1.4.0/de.tudarmstadt.ukp.dkpro.core.api.resources-asl-1.4.0.jar
(23 KB at 432.1 KB/sec)
Downloading: http://repo.maven.apache.org/maven2/org/scala-lang/scala-library/2.10.1/scala-library-2.10.1.jar
Downloaded: http://repo.maven.apache.org/maven2/org/cleartk/cleartk-ml-crfsuite/0.2.2/cleartk-ml-crfsuite-0.2.2.jar
(868 KB at 3212.1 KB/sec)
Downloading: http://repo.maven.apache.org/maven2/org/threeten/threetenbp/0.8.1/threetenbp-0.8.1.jar
Downloaded: http://repo.maven.apache.org/maven2/info/bethard/timenorm/0.9.0/timenorm-0.9.0.jar
(466 KB at 2447.9 KB/sec)
Downloading: http://repo.maven.apache.org/maven2/com/googlecode/java-diff-utils/diffutils/1.3.0/diffutils-1.3.0.jar
Downloaded: http://repo.maven.apache.org/maven2/com/googlecode/java-diff-utils/diffutils/1.3.0/diffutils-1.3.0.jar
(34 KB at 694.4 KB/sec)
Downloaded: http://repo.maven.apache.org/maven2/org/cleartk/cleartk-timeml/1.1.0/cleartk-timeml-1.1.0.jar
(4679 KB at 6870.8 KB/sec)
Downloaded: http://repo.maven.apache.org/maven2/org/threeten/threetenbp/0.8.1/threetenbp-0.8.1.jar
(435 KB at 4263.9 KB/sec)
Downloaded: http://repo.maven.apache.org/maven2/org/scala-lang/scala-library/2.10.1/scala-library-2.10.1.jar
(6971 KB at 12018.3 KB/sec)
Downloaded: http://repo.maven.apache.org/maven2/org/cleartk/cleartk-opennlp-tools/0.10.3/cleartk-opennlp-tools-0.10.3.jar
(41617 KB at 20075.6 KB/sec)
[INFO] 
[INFO] --- maven-clean-plugin:2.4.1:clean (default-clean) @ ctakes-temporal ---
[INFO] 
[INFO] --- maven-dependency-plugin:2.6:unpack (unpack) @ ctakes-temporal ---
[INFO] Configured Artifact: net.sourceforge.ctakesresources:ctakes-resources-umls2011ab:3.1.1:jar
[INFO] Unpacking /home/jenkins/jenkins-slave/maven-repositories/1/net/sourceforge/ctakesresources/ctakes-resources-umls2011ab/3.1.1/ctakes-resources-umls2011ab-3.1.1.jar
to <https://builds.apache.org/job/ctakes-trunk-compiletest/ws/ctakes-temporal/target/unpacked>
with includes "" and excludes ""
[INFO] 
[INFO] --- maven-remote-resources-plugin:1.4:process (default) @ ctakes-temporal ---
Downloading: http://repo.maven.apache.org/maven2/jwnl/jwnl/1.3.3/jwnl-1.3.3.pom
[INFO] 
[INFO] --- maven-resources-plugin:2.5:resources (default-resources) @ ctakes-temporal ---
[debug] execute contextualize
[INFO] Using 'UTF-8' encoding to copy filtered resources.
[INFO] Copying 3 resources
[INFO] Copying 3 resources
[INFO] 
[INFO] --- maven-compiler-plugin:2.4:compile (default-compile) @ ctakes-temporal ---
[INFO] Compiling 134 source files to <https://builds.apache.org/job/ctakes-trunk-compiletest/ws/ctakes-temporal/target/classes>
[INFO] -------------------------------------------------------------
[ERROR] COMPILATION ERROR : 
[INFO] -------------------------------------------------------------
[ERROR] <https://builds.apache.org/job/ctakes-trunk-compiletest/ws/ctakes-temporal/src/main/java/org/apache/ctakes/temporal/data/analysis/CoreferenceLinkDistanceAnalyzer.java>:[17,67]
error: package org.apache.ctakes.temporal.eval.EvaluationOfEventCoreference does not exist
[ERROR] <https://builds.apache.org/job/ctakes-trunk-compiletest/ws/ctakes-temporal/src/main/java/org/apache/ctakes/temporal/data/analysis/CoreferenceLinkDistanceAnalyzer.java>:[23,48]
error: cannot find symbol
[ERROR]   symbol:   class Markable
  location: package org.apache.ctakes.typesystem.type.textsem
<https://builds.apache.org/job/ctakes-trunk-compiletest/ws/ctakes-temporal/src/main/java/org/apache/ctakes/temporal/eval/EvaluationOfEventTimeRelations.java>:[331,29]
[deprecation] createAnnotatorDescription(File) in EventTimeRelationAnnotator has been deprecated
[ERROR] <https://builds.apache.org/job/ctakes-trunk-compiletest/ws/ctakes-temporal/src/main/java/org/apache/ctakes/temporal/eval/EvaluationOfEventEventRelations.java>:[139,35]
[deprecation] createAnnotatorDescription(File) in EventEventRelationAnnotator has been deprecated
[ERROR] <https://builds.apache.org/job/ctakes-trunk-compiletest/ws/ctakes-temporal/src/main/java/org/apache/ctakes/temporal/eval/EvaluationOfTemporalRelations.java>:[351,29]
[deprecation] createAnnotatorDescription(File) in EventTimeRelationAnnotator has been deprecated
[ERROR] <https://builds.apache.org/job/ctakes-trunk-compiletest/ws/ctakes-temporal/src/main/java/org/apache/ctakes/temporal/eval/EvaluationOfTemporalRelations.java>:[352,50]
[deprecation] createAnnotatorDescription(File) in EventEventRelationAnnotator has been deprecated
[ERROR] <https://builds.apache.org/job/ctakes-trunk-compiletest/ws/ctakes-temporal/src/main/java/org/apache/ctakes/temporal/eval/EvaluationOfTemporalRelations.java>:[353,50]
[deprecation] createAnnotatorDescription(File) in EventDischargeTimeAnnotator has been deprecated
[ERROR] <https://builds.apache.org/job/ctakes-trunk-compiletest/ws/ctakes-temporal/src/main/java/org/apache/ctakes/temporal/eval/EvaluationOfTemporalRelations.java>:[354,50]
[deprecation] createAnnotatorDescription(File) in EventAdmissionTimeAnnotator has been deprecated
[ERROR] <https://builds.apache.org/job/ctakes-trunk-compiletest/ws/ctakes-temporal/src/main/java/org/apache/ctakes/temporal/data/analysis/CoreferenceLinkDistanceAnalyzer.java>:[71,74]
error: cannot find symbol
[ERROR]   symbol:   class ParagraphAnnotator
  location: class CoreferenceLinkDistanceAnalyzer
<https://builds.apache.org/job/ctakes-trunk-compiletest/ws/ctakes-temporal/src/main/java/org/apache/ctakes/temporal/data/analysis/CoreferenceLinkDistanceAnalyzer.java>:[92,10]
error: cannot find symbol
[ERROR]   symbol:   class Markable
  location: class CoreferenceLinkDistanceAnalyzer
<https://builds.apache.org/job/ctakes-trunk-compiletest/ws/ctakes-temporal/src/main/java/org/apache/ctakes/temporal/data/analysis/CoreferenceLinkDistanceAnalyzer.java>:[92,54]
error: unexpected type
[ERROR]   required: class
  found:    <K,V>HashMap<K,V>
  where K,V are type-variables:
    K extends Object declared in class HashMap
    V extends Object declared in class HashMap
<https://builds.apache.org/job/ctakes-trunk-compiletest/ws/ctakes-temporal/src/main/java/org/apache/ctakes/temporal/data/analysis/CoreferenceLinkDistanceAnalyzer.java>:[97,19]
error: cannot find symbol
[ERROR]   symbol:   class Markable
  location: class CoreferenceLinkDistanceAnalyzer
<https://builds.apache.org/job/ctakes-trunk-compiletest/ws/ctakes-temporal/src/main/java/org/apache/ctakes/temporal/data/analysis/CoreferenceLinkDistanceAnalyzer.java>:[97,74]
error: cannot find symbol
[ERROR]   symbol:   class Markable
  location: class CoreferenceLinkDistanceAnalyzer
<https://builds.apache.org/job/ctakes-trunk-compiletest/ws/ctakes-temporal/src/main/java/org/apache/ctakes/temporal/data/analysis/CoreferenceLinkDistanceAnalyzer.java>:[98,12]
error: cannot find symbol
[ERROR]   symbol:   class Markable
  location: class CoreferenceLinkDistanceAnalyzer
<https://builds.apache.org/job/ctakes-trunk-compiletest/ws/ctakes-temporal/src/main/java/org/apache/ctakes/temporal/data/analysis/CoreferenceLinkDistanceAnalyzer.java>:[181,10]
error: cannot find symbol
[ERROR]   symbol:   class Markable
  location: class CoreferenceLinkDistanceAnalyzer
<https://builds.apache.org/job/ctakes-trunk-compiletest/ws/ctakes-temporal/src/main/java/org/apache/ctakes/temporal/data/analysis/CoreferenceLinkDistanceAnalyzer.java>:[181,29]
error: cannot find symbol
[ERROR]   symbol:   class Markable
  location: class CoreferenceLinkDistanceAnalyzer
<https://builds.apache.org/job/ctakes-trunk-compiletest/ws/ctakes-temporal/src/main/java/org/apache/ctakes/temporal/eval/EvaluationOfEventProperties.java>:[180,42]
[deprecation] createAnnotatorDescription(File) in DocTimeRelAnnotator has been deprecated
[ERROR] <https://builds.apache.org/job/ctakes-trunk-compiletest/ws/ctakes-temporal/src/main/java/org/apache/ctakes/temporal/eval/EvaluationOfEventProperties.java>:[181,50]
[deprecation] createAnnotatorDescription(File) in ContextualModalityAnnotator has been deprecated
[ERROR] <https://builds.apache.org/job/ctakes-trunk-compiletest/ws/ctakes-temporal/src/main/java/org/apache/ctakes/temporal/ae/MetaTimeAnnotator.java>:[75,38]
[deprecation] createEnsembleDescription(File,String) in BackwardsTimeAnnotator has been deprecated
[ERROR] <https://builds.apache.org/job/ctakes-trunk-compiletest/ws/ctakes-temporal/src/main/java/org/apache/ctakes/temporal/ae/MetaTimeAnnotator.java>:[78,46]
[deprecation] createEnsembleDescription(File,String) in ConstituencyBasedTimeAnnotator has
been deprecated
[ERROR] <https://builds.apache.org/job/ctakes-trunk-compiletest/ws/ctakes-temporal/src/main/java/org/apache/ctakes/temporal/ae/MetaTimeAnnotator.java>:[81,32]
[deprecation] createEnsembleDescription(File,String) in CRFTimeAnnotator has been deprecated
[ERROR] <https://builds.apache.org/job/ctakes-trunk-compiletest/ws/ctakes-temporal/src/main/java/org/apache/ctakes/temporal/ae/MetaTimeAnnotator.java>:[104,38]
[deprecation] createEnsembleDescription(File,String) in BackwardsTimeAnnotator has been deprecated
[ERROR] <https://builds.apache.org/job/ctakes-trunk-compiletest/ws/ctakes-temporal/src/main/java/org/apache/ctakes/temporal/ae/MetaTimeAnnotator.java>:[107,46]
[deprecation] createEnsembleDescription(File,String) in ConstituencyBasedTimeAnnotator has
been deprecated
[ERROR] <https://builds.apache.org/job/ctakes-trunk-compiletest/ws/ctakes-temporal/src/main/java/org/apache/ctakes/temporal/ae/MetaTimeAnnotator.java>:[110,32]
[deprecation] createEnsembleDescription(File,String) in CRFTimeAnnotator has been deprecated
[ERROR] <https://builds.apache.org/job/ctakes-trunk-compiletest/ws/ctakes-temporal/src/main/java/org/apache/ctakes/temporal/eval/EvaluationOfTimeSpans.java>:[248,23]
[deprecation] createAnnotatorDescription(File) in TimeAnnotator has been deprecated
[ERROR] <https://builds.apache.org/job/ctakes-trunk-compiletest/ws/ctakes-temporal/src/main/java/org/apache/ctakes/temporal/eval/EvaluationOfNEPredicateEventSpans.java>:[77,37]
[deprecation] createAnnotatorDescription(File) in NEPredicateEventAnnotator has been deprecated
[INFO] 26 errors 
[INFO] -------------------------------------------------------------
[JENKINS] Archiving disabled
[INFO] ------------------------------------------------------------------------
[INFO] Reactor Summary:
[INFO] 
[INFO] Apache cTAKES ..................................... SUCCESS [33.004s]
[INFO] Apache cTAKES common type system .................. SUCCESS [18.421s]
[INFO] Apache cTAKES utils ............................... SUCCESS [6.887s]
[INFO] Apache cTAKES Resources core ...................... SUCCESS [5.766s]
[INFO] Apache cTAKES core ................................ SUCCESS [23.380s]
[INFO] Apache cTAKES Resources pos-tagger ................ SUCCESS [2.609s]
[INFO] Apache cTAKES part-of-speech tagger ............... SUCCESS [8.394s]
[INFO] Apache cTAKES Resources ctakes-chunker-res ........ SUCCESS [2.878s]
[INFO] Apache cTAKES chunker ............................. SUCCESS [6.123s]
[INFO] Apache cTAKES document preprocessor ............... SUCCESS [6.278s]
[INFO] Apache cTAKES Resources dictionary-lookup ......... SUCCESS [1:03.022s]
[INFO] Apache cTAKES dictionary lookup ................... SUCCESS [8.713s]
[INFO] Apache cTAKES context dependent tokenizer ......... SUCCESS [3.386s]
[INFO] Apache cTAKES Resources lvg ....................... SUCCESS [3.017s]
[INFO] Apache cTAKES LVG lexical tools ................... SUCCESS [8.074s]
[INFO] Apache cTAKES Resources ne-contexts ............... SUCCESS [2.780s]
[INFO] Apache cTAKES named entity contexts ............... SUCCESS [8.312s]
[INFO] Apache cTAKES Resources constituency-parser ....... SUCCESS [3.130s]
[INFO] Apache cTAKES Constituency Parser ................. SUCCESS [6.401s]
[INFO] Apache cTAKES Resources coreference ............... SUCCESS [3.233s]
[INFO] Apache cTAKES Resources relation-extractor ........ SUCCESS [2.684s]
[INFO] Apache cTAKES Resources dependency-parser ......... SUCCESS [2.764s]
[INFO] Apache cTAKES Dependency Parser ................... SUCCESS [35.492s]
[INFO] Apache cTAKES Relation Extractor .................. SUCCESS [17.377s]
[INFO] Apache cTAKES CoReference Resolver ................ SUCCESS [56.336s]
[INFO] Apache cTAKES Resources drug-ner .................. SUCCESS [2.840s]
[INFO] Apache cTAKES Drug NER ............................ SUCCESS [5.837s]
[INFO] Apache cTAKES Resources side-effect ............... SUCCESS [2.316s]
[INFO] Apache cTAKES Side Effects ........................ SUCCESS [6.879s]
[INFO] Apache cTAKES Resources smoking-status ............ SUCCESS [1.148s]
[INFO] Apache cTAKES Smoking Status ...................... SUCCESS [6.937s]
[INFO] Apache cTAKES Resources assertion ................. SUCCESS [3.399s]
[INFO] Apache cTAKES Resources assertion-zoner ........... SUCCESS [1.198s]
[INFO] Apache cTAKES Assertion's zoner ................... SUCCESS [6.318s]
[INFO] Apache cTAKES Assertion ........................... SUCCESS [11.906s]
[INFO] Apache cTAKES Resources temporal .................. SUCCESS [2.543s]
[INFO] Apache cTAKES Resources ctakes-ytex-res ........... SUCCESS [2.572s]
[INFO] Apache cTAKES YTEX ................................ SUCCESS [14.350s]
[INFO] Apache cTAKES YTEX UIMA ........................... SUCCESS [8.724s]
[INFO] Apache cTAKES ctakes-clinical-pipeline ............ SUCCESS [5.612s]
[INFO] Apache cTAKES Temporal Information Extraction ..... FAILURE [15.563s]
[INFO] Apache cTAKES YTEX Web ............................ SKIPPED
[INFO] Apache cTAKES Distribution ........................ SKIPPED
[INFO] Apache cTAKES Regression-test ..................... SKIPPED
[INFO] Apache cTAKES template filler ..................... SKIPPED
[INFO] ctakes-examples ................................... SKIPPED
[INFO] Apache cTAKES Resources dictionary-lookup-fast-res  SKIPPED
[INFO] Apache cTAKES dictionary lookup fast .............. SKIPPED
[INFO] ------------------------------------------------------------------------
[INFO] BUILD FAILURE
[INFO] ------------------------------------------------------------------------
[INFO] Total time: 8:13.120s
[INFO] Finished at: Tue Jul 15 21:37:53 UTC 2014
[INFO] Final Memory: 80M/298M
[INFO] ------------------------------------------------------------------------
[JENKINS] Archiving disabled
[JENKINS] Archiving disabled
[JENKINS] Archiving disabled
[JENKINS] Archiving disabled
[JENKINS] Archiving disabled
[JENKINS] Archiving disabled
[JENKINS] Archiving disabled
[JENKINS] Archiving disabled
[JENKINS] Archiving disabled
[JENKINS] Archiving disabled
[JENKINS] Archiving disabled
[JENKINS] Archiving disabled
[JENKINS] Archiving disabled
[JENKINS] Archiving disabled
[JENKINS] Archiving disabled
[JENKINS] Archiving disabled
[JENKINS] Archiving disabled
[JENKINS] Archiving disabled
[JENKINS] Archiving disabled
[JENKINS] Archiving disabled
[JENKINS] Archiving disabled
[JENKINS] Archiving disabled
[JENKINS] Archiving disabled
[JENKINS] Archiving disabled
[JENKINS] Archiving disabled
[JENKINS] Archiving disabled
[JENKINS] Archiving disabled
[JENKINS] Archiving disabled
[JENKINS] Archiving disabled
[JENKINS] Archiving disabled
[JENKINS] Archiving disabled
[JENKINS] Archiving disabled
[JENKINS] Archiving disabled
[JENKINS] Archiving disabled
[JENKINS] Archiving disabled
[JENKINS] Archiving disabled
[JENKINS] Archiving disabled
[JENKINS] Archiving disabled
[JENKINS] Archiving disabled
[JENKINS] Archiving disabled
[JENKINS] Archiving disabled
[JENKINS] Archiving disabled
[JENKINS] Archiving disabled
[JENKINS] Archiving disabled
[JENKINS] Archiving disabled
[JENKINS] Archiving disabled
[JENKINS] Archiving disabled
[JENKINS] Archiving disabled
Waiting for Jenkins to finish collecting data
[ERROR] Failed to execute goal org.apache.maven.plugins:maven-compiler-plugin:2.4:compile
(default-compile) on project ctakes-temporal: Compilation failure: Compilation failure:
[ERROR] <https://builds.apache.org/job/ctakes-trunk-compiletest/ws/ctakes-temporal/src/main/java/org/apache/ctakes/temporal/data/analysis/CoreferenceLinkDistanceAnalyzer.java>:[17,67]
error: package org.apache.ctakes.temporal.eval.EvaluationOfEventCoreference does not exist
[ERROR] <https://builds.apache.org/job/ctakes-trunk-compiletest/ws/ctakes-temporal/src/main/java/org/apache/ctakes/temporal/data/analysis/CoreferenceLinkDistanceAnalyzer.java>:[23,48]
error: cannot find symbol
[ERROR] symbol:   class Markable
[ERROR] location: package org.apache.ctakes.typesystem.type.textsem
[ERROR] <https://builds.apache.org/job/ctakes-trunk-compiletest/ws/ctakes-temporal/src/main/java/org/apache/ctakes/temporal/eval/EvaluationOfEventTimeRelations.java>:[331,29]
[deprecation] createAnnotatorDescription(File) in EventTimeRelationAnnotator has been deprecated
[ERROR] <https://builds.apache.org/job/ctakes-trunk-compiletest/ws/ctakes-temporal/src/main/java/org/apache/ctakes/temporal/eval/EvaluationOfEventEventRelations.java>:[139,35]
[deprecation] createAnnotatorDescription(File) in EventEventRelationAnnotator has been deprecated
[ERROR] <https://builds.apache.org/job/ctakes-trunk-compiletest/ws/ctakes-temporal/src/main/java/org/apache/ctakes/temporal/eval/EvaluationOfTemporalRelations.java>:[351,29]
[deprecation] createAnnotatorDescription(File) in EventTimeRelationAnnotator has been deprecated
[ERROR] <https://builds.apache.org/job/ctakes-trunk-compiletest/ws/ctakes-temporal/src/main/java/org/apache/ctakes/temporal/eval/EvaluationOfTemporalRelations.java>:[352,50]
[deprecation] createAnnotatorDescription(File) in EventEventRelationAnnotator has been deprecated
[ERROR] <https://builds.apache.org/job/ctakes-trunk-compiletest/ws/ctakes-temporal/src/main/java/org/apache/ctakes/temporal/eval/EvaluationOfTemporalRelations.java>:[353,50]
[deprecation] createAnnotatorDescription(File) in EventDischargeTimeAnnotator has been deprecated
[ERROR] <https://builds.apache.org/job/ctakes-trunk-compiletest/ws/ctakes-temporal/src/main/java/org/apache/ctakes/temporal/eval/EvaluationOfTemporalRelations.java>:[354,50]
[deprecation] createAnnotatorDescription(File) in EventAdmissionTimeAnnotator has been deprecated
[ERROR] <https://builds.apache.org/job/ctakes-trunk-compiletest/ws/ctakes-temporal/src/main/java/org/apache/ctakes/temporal/data/analysis/CoreferenceLinkDistanceAnalyzer.java>:[71,74]
error: cannot find symbol
[ERROR] symbol:   class ParagraphAnnotator
[ERROR] location: class CoreferenceLinkDistanceAnalyzer
[ERROR] <https://builds.apache.org/job/ctakes-trunk-compiletest/ws/ctakes-temporal/src/main/java/org/apache/ctakes/temporal/data/analysis/CoreferenceLinkDistanceAnalyzer.java>:[92,10]
error: cannot find symbol
[ERROR] symbol:   class Markable
[ERROR] location: class CoreferenceLinkDistanceAnalyzer
[ERROR] <https://builds.apache.org/job/ctakes-trunk-compiletest/ws/ctakes-temporal/src/main/java/org/apache/ctakes/temporal/data/analysis/CoreferenceLinkDistanceAnalyzer.java>:[92,54]
error: unexpected type
[ERROR] required: class
[ERROR] found:    <K,V>HashMap<K,V>
[ERROR] where K,V are type-variables:
[ERROR] K extends Object declared in class HashMap
[ERROR] V extends Object declared in class HashMap
[ERROR] <https://builds.apache.org/job/ctakes-trunk-compiletest/ws/ctakes-temporal/src/main/java/org/apache/ctakes/temporal/data/analysis/CoreferenceLinkDistanceAnalyzer.java>:[97,19]
error: cannot find symbol
[ERROR] symbol:   class Markable
[ERROR] location: class CoreferenceLinkDistanceAnalyzer
[ERROR] <https://builds.apache.org/job/ctakes-trunk-compiletest/ws/ctakes-temporal/src/main/java/org/apache/ctakes/temporal/data/analysis/CoreferenceLinkDistanceAnalyzer.java>:[97,74]
error: cannot find symbol
[ERROR] symbol:   class Markable
[ERROR] location: class CoreferenceLinkDistanceAnalyzer
[ERROR] <https://builds.apache.org/job/ctakes-trunk-compiletest/ws/ctakes-temporal/src/main/java/org/apache/ctakes/temporal/data/analysis/CoreferenceLinkDistanceAnalyzer.java>:[98,12]
error: cannot find symbol
[ERROR] symbol:   class Markable
[ERROR] location: class CoreferenceLinkDistanceAnalyzer
[ERROR] <https://builds.apache.org/job/ctakes-trunk-compiletest/ws/ctakes-temporal/src/main/java/org/apache/ctakes/temporal/data/analysis/CoreferenceLinkDistanceAnalyzer.java>:[181,10]
error: cannot find symbol
[ERROR] symbol:   class Markable
[ERROR] location: class CoreferenceLinkDistanceAnalyzer
[ERROR] <https://builds.apache.org/job/ctakes-trunk-compiletest/ws/ctakes-temporal/src/main/java/org/apache/ctakes/temporal/data/analysis/CoreferenceLinkDistanceAnalyzer.java>:[181,29]
error: cannot find symbol
[ERROR] symbol:   class Markable
[ERROR] location: class CoreferenceLinkDistanceAnalyzer
[ERROR] <https://builds.apache.org/job/ctakes-trunk-compiletest/ws/ctakes-temporal/src/main/java/org/apache/ctakes/temporal/eval/EvaluationOfEventProperties.java>:[180,42]
[deprecation] createAnnotatorDescription(File) in DocTimeRelAnnotator has been deprecated
[ERROR] <https://builds.apache.org/job/ctakes-trunk-compiletest/ws/ctakes-temporal/src/main/java/org/apache/ctakes/temporal/eval/EvaluationOfEventProperties.java>:[181,50]
[deprecation] createAnnotatorDescription(File) in ContextualModalityAnnotator has been deprecated
[ERROR] <https://builds.apache.org/job/ctakes-trunk-compiletest/ws/ctakes-temporal/src/main/java/org/apache/ctakes/temporal/ae/MetaTimeAnnotator.java>:[75,38]
[deprecation] createEnsembleDescription(File,String) in BackwardsTimeAnnotator has been deprecated
[ERROR] <https://builds.apache.org/job/ctakes-trunk-compiletest/ws/ctakes-temporal/src/main/java/org/apache/ctakes/temporal/ae/MetaTimeAnnotator.java>:[78,46]
[deprecation] createEnsembleDescription(File,String) in ConstituencyBasedTimeAnnotator has
been deprecated
[ERROR] <https://builds.apache.org/job/ctakes-trunk-compiletest/ws/ctakes-temporal/src/main/java/org/apache/ctakes/temporal/ae/MetaTimeAnnotator.java>:[81,32]
[deprecation] createEnsembleDescription(File,String) in CRFTimeAnnotator has been deprecated
[ERROR] <https://builds.apache.org/job/ctakes-trunk-compiletest/ws/ctakes-temporal/src/main/java/org/apache/ctakes/temporal/ae/MetaTimeAnnotator.java>:[104,38]
[deprecation] createEnsembleDescription(File,String) in BackwardsTimeAnnotator has been deprecated
[ERROR] <https://builds.apache.org/job/ctakes-trunk-compiletest/ws/ctakes-temporal/src/main/java/org/apache/ctakes/temporal/ae/MetaTimeAnnotator.java>:[107,46]
[deprecation] createEnsembleDescription(File,String) in ConstituencyBasedTimeAnnotator has
been deprecated
[ERROR] <https://builds.apache.org/job/ctakes-trunk-compiletest/ws/ctakes-temporal/src/main/java/org/apache/ctakes/temporal/ae/MetaTimeAnnotator.java>:[110,32]
[deprecation] createEnsembleDescription(File,String) in CRFTimeAnnotator has been deprecated
[ERROR] <https://builds.apache.org/job/ctakes-trunk-compiletest/ws/ctakes-temporal/src/main/java/org/apache/ctakes/temporal/eval/EvaluationOfTimeSpans.java>:[248,23]
[deprecation] createAnnotatorDescription(File) in TimeAnnotator has been deprecated
[ERROR] <https://builds.apache.org/job/ctakes-trunk-compiletest/ws/ctakes-temporal/src/main/java/org/apache/ctakes/temporal/eval/EvaluationOfNEPredicateEventSpans.java>:[77,37]
[deprecation] createAnnotatorDescription(File) in NEPredicateEventAnnotator has been deprecated
[ERROR] -> [Help 1]
[ERROR] 
[ERROR] To see the full stack trace of the errors, re-run Maven with the -e switch.
[ERROR] Re-run Maven using the -X switch to enable full debug logging.
[ERROR] 
[ERROR] For more information about the errors and possible solutions, please read the following
articles:
[ERROR] [Help 1] http://cwiki.apache.org/confluence/display/MAVEN/MojoFailureException
[ERROR] 
[ERROR] After correcting the problems, you can resume the build with the command
[ERROR]   mvn <goals> -rf :ctakes-temporal
Sending e-mails to: notifications@ctakes.apache.org timothy.miller@childrens.harvard.edu
channel stopped

Mime
View raw message