ctakes-notifications mailing list archives

Site index · List index
Message view « Date » · « Thread »
Top « Date » · « Thread »
From Apache Jenkins Server <jenk...@builds.apache.org>
Subject Build failed in Jenkins: ctakes-trunk-package #223
Date Wed, 30 Apr 2014 23:38:20 GMT
See <https://builds.apache.org/job/ctakes-trunk-package/223/>

------------------------------------------
Started by user chenpei
Building remotely on ubuntu5 (Ubuntu ubuntu) in workspace <https://builds.apache.org/job/ctakes-trunk-package/ws/>
Cleaning up <https://builds.apache.org/job/ctakes-trunk-package/ws/.>
Updating http://svn.apache.org/repos/asf/ctakes/trunk at revision '2014-04-30T23:36:31.822
+0000'
At revision 1591510
no change for http://svn.apache.org/repos/asf/ctakes/trunk since the previous build
Parsing POMs
Modules changed, recalculating dependency graph
maven3-agent.jar already up to date
maven3-interceptor.jar already up to date
maven3-interceptor-commons.jar already up to date
[ctakes-trunk-package] $ /home/hudson/tools/java/latest1.7/bin/java -cp /home/jenkins/jenkins-slave/maven3-agent.jar:/home/jenkins/jenkins-slave/tools/hudson.tasks.Maven_MavenInstallation/Maven_3.0.5/boot/plexus-classworlds-2.4.jar
org.jvnet.hudson.maven3.agent.Maven3Main /home/jenkins/jenkins-slave/tools/hudson.tasks.Maven_MavenInstallation/Maven_3.0.5
/home/jenkins/jenkins-slave/slave.jar /home/jenkins/jenkins-slave/maven3-interceptor.jar /home/jenkins/jenkins-slave/maven3-interceptor-commons.jar
35173
<===[JENKINS REMOTING CAPACITY]===>   channel started
Executing Maven:  -B -f <https://builds.apache.org/job/ctakes-trunk-package/ws/pom.xml>
-Dmaven.repo.local=/home/jenkins/jenkins-slave/maven-repositories/1 clean install -DskipTests=true
-pl ctakes-utils,ctakes-core,ctakes-type-system,ctakes-pos-tagger,ctakes-chunker,ctakes-preprocessor,ctakes-dictionary-lookup,ctakes-context-tokenizer,ctakes-lvg,ctakes-ne-contexts,ctakes-constituency-parser,ctakes-coreference,ctakes-drug-ner,ctakes-side-effect,ctakes-smoking-status,ctakes-dependency-parser,ctakes-relation-extractor,ctakes-assertion,ctakes-assertion-zoner,ctakes-temporal,ctakes-clinical-pipeline,ctakes-regression-test,ctakes-assertion-res,ctakes-chunker-res,ctakes-constituency-parser-res,ctakes-core-res,ctakes-coreference-res,ctakes-dependency-parser-res,ctakes-dictionary-lookup-res,ctakes-lvg-res,ctakes-pad-term-spotter-res,ctakes-pos-tagger-res,ctakes-relation-extractor-res,ctakes-side-effect-res,ctakes-smoking-status-res,ctakes-temporal-res,ctakes-assertion-zoner-res,ctakes-drug-ner-res,ctakes-ne-contexts-res,ctakes-template-filler,ctakes-examples
[INFO] Scanning for projects...
[WARNING] 
[WARNING] Some problems were encountered while building the effective model for org.apache.ctakes:ctakes-assertion:jar:3.1.2-SNAPSHOT
[WARNING] 'dependencies.dependency.(groupId:artifactId:type:classifier)' must be unique: junit:junit:jar
-> duplicate declaration of version (?) @ line 154, column 15
[WARNING] 'dependencies.dependency.systemPath' for org.mitre.medfacts:medfacts-i2b2:jar should
not point at files within the project directory, ${project.basedir}/lib/med-facts-i2b2-1.2-SNAPSHOT.jar
will be unresolvable by dependent projects @ line 197, column 16
[WARNING] 'dependencies.dependency.systemPath' for org.mitre.medfacts:medfacts-zoner:jar should
not point at files within the project directory, ${project.basedir}/lib/med-facts-zoner-1.1.jar
will be unresolvable by dependent projects @ line 204, column 16
[WARNING] 'dependencies.dependency.systemPath' for org.mitre.jcarafe.core:jcarafe.core:jar
should not point at files within the project directory, ${project.basedir}/lib/jcarafe-core_2.9.1-0.9.8.3.RC4.jar
will be unresolvable by dependent projects @ line 211, column 16
[WARNING] 'dependencies.dependency.systemPath' for org.mitre.jcarafe.ext:jcarafe.ext:jar should
not point at files within the project directory, ${project.basedir}/lib/jcarafe-ext_2.9.1-0.9.8.3.RC4.jar
will be unresolvable by dependent projects @ line 218, column 16
[WARNING] 
[WARNING] Some problems were encountered while building the effective model for org.apache.ctakes:ctakes-distribution:pom:3.1.2-SNAPSHOT
[WARNING] 'dependencies.dependency.(groupId:artifactId:type:classifier)' must be unique: org.apache.ctakes:ctakes-ne-contexts:jar
-> duplicate declaration of version (?) @ line 99, column 15
[WARNING] 
[WARNING] Some problems were encountered while building the effective model for org.apache.ctakes:ctakes-ytex:jar:3.1.2-SNAPSHOT
[WARNING] 'build.plugins.plugin.version' for org.codehaus.mojo:jaxb2-maven-plugin is missing.
@ line 231, column 12
[WARNING] 
[WARNING] It is highly recommended to fix these problems because they threaten the stability
of your build.
[WARNING] 
[WARNING] For this reason, future Maven versions might no longer support building such malformed
projects.
[WARNING] 
[ERROR] Could not find the selected project in the reactor: ctakes-temporal -> [Help 1]
[ERROR] 
[ERROR] To see the full stack trace of the errors, re-run Maven with the -e switch.
[ERROR] Re-run Maven using the -X switch to enable full debug logging.
[ERROR] 
[ERROR] For more information about the errors and possible solutions, please read the following
articles:
[ERROR] [Help 1] http://cwiki.apache.org/confluence/display/MAVEN/MavenExecutionException
channel stopped

Mime
View raw message