ctakes-notifications mailing list archives

Site index · List index
Message view « Date » · « Thread »
Top « Date » · « Thread »
From Apache Jenkins Server <jenk...@builds.apache.org>
Subject Build failed in Jenkins: ctakes-trunk-package #212
Date Wed, 18 Dec 2013 16:53:46 GMT
See <https://builds.apache.org/job/ctakes-trunk-package/212/changes>

Changes:

[tmill] CTAKES-82: Minor improvements to duration extractor -- new option parsing and additional
keywords.

[tmill] CTAKES-82: Updated uimafit pipelines to use new chunker model file.

[tmill] CTAKES-82: Added some new file endings to anafora reader to match some of the new
files in svn repo.

------------------------------------------
[...truncated 6764 lines...]
Uploading: https://repository.apache.org/content/repositories/snapshots/org/apache/ctakes/ctakes-dictionary-lookup/maven-metadata.xml
Uploaded: https://repository.apache.org/content/repositories/snapshots/org/apache/ctakes/ctakes-dictionary-lookup/maven-metadata.xml
(401 B at 6.5 KB/sec)
[INFO] Deployment in https://repository.apache.org/content/repositories/snapshots (id=apache.snapshots.https,uniqueVersion=true)
Deploying the main artifact jenkins-4586535460307563719ctakes-dictionary-lookup-res-3.1.2-SNAPSHOT.jar
Downloading: https://repository.apache.org/content/repositories/snapshots/org/apache/ctakes/ctakes-dictionary-lookup-res/3.1.2-SNAPSHOT/maven-metadata.xml
Downloaded: https://repository.apache.org/content/repositories/snapshots/org/apache/ctakes/ctakes-dictionary-lookup-res/3.1.2-SNAPSHOT/maven-metadata.xml
(795 B at 0.2 KB/sec)
Uploading: https://repository.apache.org/content/repositories/snapshots/org/apache/ctakes/ctakes-dictionary-lookup-res/3.1.2-SNAPSHOT/ctakes-dictionary-lookup-res-3.1.2-20131218.164831-9.jar
Uploaded: https://repository.apache.org/content/repositories/snapshots/org/apache/ctakes/ctakes-dictionary-lookup-res/3.1.2-SNAPSHOT/ctakes-dictionary-lookup-res-3.1.2-20131218.164831-9.jar
(7 KB at 12.0 KB/sec)
Uploading: https://repository.apache.org/content/repositories/snapshots/org/apache/ctakes/ctakes-dictionary-lookup-res/3.1.2-SNAPSHOT/ctakes-dictionary-lookup-res-3.1.2-20131218.164831-9.pom
Uploaded: https://repository.apache.org/content/repositories/snapshots/org/apache/ctakes/ctakes-dictionary-lookup-res/3.1.2-SNAPSHOT/ctakes-dictionary-lookup-res-3.1.2-20131218.164831-9.pom
(2 KB at 22.5 KB/sec)
Downloading: https://repository.apache.org/content/repositories/snapshots/org/apache/ctakes/ctakes-dictionary-lookup-res/maven-metadata.xml
Downloaded: https://repository.apache.org/content/repositories/snapshots/org/apache/ctakes/ctakes-dictionary-lookup-res/maven-metadata.xml
(405 B at 6.7 KB/sec)
Uploading: https://repository.apache.org/content/repositories/snapshots/org/apache/ctakes/ctakes-dictionary-lookup-res/3.1.2-SNAPSHOT/maven-metadata.xml
Uploaded: https://repository.apache.org/content/repositories/snapshots/org/apache/ctakes/ctakes-dictionary-lookup-res/3.1.2-SNAPSHOT/maven-metadata.xml
(795 B at 1.6 KB/sec)
Uploading: https://repository.apache.org/content/repositories/snapshots/org/apache/ctakes/ctakes-dictionary-lookup-res/maven-metadata.xml
Uploaded: https://repository.apache.org/content/repositories/snapshots/org/apache/ctakes/ctakes-dictionary-lookup-res/maven-metadata.xml
(405 B at 8.2 KB/sec)
[INFO] Deployment in https://repository.apache.org/content/repositories/snapshots (id=apache.snapshots.https,uniqueVersion=true)
Deploying the main artifact jenkins-6198518081758535612ctakes-drug-ner-3.1.2-SNAPSHOT.jar
Downloading: https://repository.apache.org/content/repositories/snapshots/org/apache/ctakes/ctakes-drug-ner/3.1.2-SNAPSHOT/maven-metadata.xml
Downloaded: https://repository.apache.org/content/repositories/snapshots/org/apache/ctakes/ctakes-drug-ner/3.1.2-SNAPSHOT/maven-metadata.xml
(782 B at 0.1 KB/sec)
Uploading: https://repository.apache.org/content/repositories/snapshots/org/apache/ctakes/ctakes-drug-ner/3.1.2-SNAPSHOT/ctakes-drug-ner-3.1.2-20131218.164852-9.jar
Uploaded: https://repository.apache.org/content/repositories/snapshots/org/apache/ctakes/ctakes-drug-ner/3.1.2-SNAPSHOT/ctakes-drug-ner-3.1.2-20131218.164852-9.jar
(263 KB at 1660.5 KB/sec)
Uploading: https://repository.apache.org/content/repositories/snapshots/org/apache/ctakes/ctakes-drug-ner/3.1.2-SNAPSHOT/ctakes-drug-ner-3.1.2-20131218.164852-9.pom
Uploaded: https://repository.apache.org/content/repositories/snapshots/org/apache/ctakes/ctakes-drug-ner/3.1.2-SNAPSHOT/ctakes-drug-ner-3.1.2-20131218.164852-9.pom
(4 KB at 51.5 KB/sec)
Downloading: https://repository.apache.org/content/repositories/snapshots/org/apache/ctakes/ctakes-drug-ner/maven-metadata.xml
Downloaded: https://repository.apache.org/content/repositories/snapshots/org/apache/ctakes/ctakes-drug-ner/maven-metadata.xml
(392 B at 0.1 KB/sec)
Uploading: https://repository.apache.org/content/repositories/snapshots/org/apache/ctakes/ctakes-drug-ner/3.1.2-SNAPSHOT/maven-metadata.xml
Uploaded: https://repository.apache.org/content/repositories/snapshots/org/apache/ctakes/ctakes-drug-ner/3.1.2-SNAPSHOT/maven-metadata.xml
(782 B at 2.5 KB/sec)
Uploading: https://repository.apache.org/content/repositories/snapshots/org/apache/ctakes/ctakes-drug-ner/maven-metadata.xml
Uploaded: https://repository.apache.org/content/repositories/snapshots/org/apache/ctakes/ctakes-drug-ner/maven-metadata.xml
(392 B at 3.0 KB/sec)
[INFO] Deployment in https://repository.apache.org/content/repositories/snapshots (id=apache.snapshots.https,uniqueVersion=true)
Deploying the main artifact jenkins-1661707633382335156ctakes-drug-ner-res-3.1.2-SNAPSHOT.jar
Downloading: https://repository.apache.org/content/repositories/snapshots/org/apache/ctakes/ctakes-drug-ner-res/3.1.2-SNAPSHOT/maven-metadata.xml
Downloaded: https://repository.apache.org/content/repositories/snapshots/org/apache/ctakes/ctakes-drug-ner-res/3.1.2-SNAPSHOT/maven-metadata.xml
(786 B at 0.2 KB/sec)
Uploading: https://repository.apache.org/content/repositories/snapshots/org/apache/ctakes/ctakes-drug-ner-res/3.1.2-SNAPSHOT/ctakes-drug-ner-res-3.1.2-20131218.164907-9.jar
Uploaded: https://repository.apache.org/content/repositories/snapshots/org/apache/ctakes/ctakes-drug-ner-res/3.1.2-SNAPSHOT/ctakes-drug-ner-res-3.1.2-20131218.164907-9.jar
(9 KB at 92.4 KB/sec)
Uploading: https://repository.apache.org/content/repositories/snapshots/org/apache/ctakes/ctakes-drug-ner-res/3.1.2-SNAPSHOT/ctakes-drug-ner-res-3.1.2-20131218.164907-9.pom
Uploaded: https://repository.apache.org/content/repositories/snapshots/org/apache/ctakes/ctakes-drug-ner-res/3.1.2-SNAPSHOT/ctakes-drug-ner-res-3.1.2-20131218.164907-9.pom
(723 B at 7.3 KB/sec)
Downloading: https://repository.apache.org/content/repositories/snapshots/org/apache/ctakes/ctakes-drug-ner-res/maven-metadata.xml
Downloaded: https://repository.apache.org/content/repositories/snapshots/org/apache/ctakes/ctakes-drug-ner-res/maven-metadata.xml
(396 B at 0.1 KB/sec)
Uploading: https://repository.apache.org/content/repositories/snapshots/org/apache/ctakes/ctakes-drug-ner-res/3.1.2-SNAPSHOT/maven-metadata.xml
Uploaded: https://repository.apache.org/content/repositories/snapshots/org/apache/ctakes/ctakes-drug-ner-res/3.1.2-SNAPSHOT/maven-metadata.xml
(786 B at 1.2 KB/sec)
Uploading: https://repository.apache.org/content/repositories/snapshots/org/apache/ctakes/ctakes-drug-ner-res/maven-metadata.xml
Uploaded: https://repository.apache.org/content/repositories/snapshots/org/apache/ctakes/ctakes-drug-ner-res/maven-metadata.xml
(396 B at 4.3 KB/sec)
[INFO] Deployment in https://repository.apache.org/content/repositories/snapshots (id=apache.snapshots.https,uniqueVersion=true)
Deploying the main artifact jenkins-7127715557816471077ctakes-examples-3.1.2-SNAPSHOT.jar
Downloading: https://repository.apache.org/content/repositories/snapshots/org/apache/ctakes/ctakes-examples/3.1.2-SNAPSHOT/maven-metadata.xml
Downloaded: https://repository.apache.org/content/repositories/snapshots/org/apache/ctakes/ctakes-examples/3.1.2-SNAPSHOT/maven-metadata.xml
(782 B at 0.1 KB/sec)
Uploading: https://repository.apache.org/content/repositories/snapshots/org/apache/ctakes/ctakes-examples/3.1.2-SNAPSHOT/ctakes-examples-3.1.2-20131218.164926-9.jar
Uploaded: https://repository.apache.org/content/repositories/snapshots/org/apache/ctakes/ctakes-examples/3.1.2-SNAPSHOT/ctakes-examples-3.1.2-20131218.164926-9.jar
(7 KB at 100.6 KB/sec)
Uploading: https://repository.apache.org/content/repositories/snapshots/org/apache/ctakes/ctakes-examples/3.1.2-SNAPSHOT/ctakes-examples-3.1.2-20131218.164926-9.pom
Uploaded: https://repository.apache.org/content/repositories/snapshots/org/apache/ctakes/ctakes-examples/3.1.2-SNAPSHOT/ctakes-examples-3.1.2-20131218.164926-9.pom
(2 KB at 20.4 KB/sec)
Downloading: https://repository.apache.org/content/repositories/snapshots/org/apache/ctakes/ctakes-examples/maven-metadata.xml
Downloaded: https://repository.apache.org/content/repositories/snapshots/org/apache/ctakes/ctakes-examples/maven-metadata.xml
(392 B at 1.0 KB/sec)
Uploading: https://repository.apache.org/content/repositories/snapshots/org/apache/ctakes/ctakes-examples/3.1.2-SNAPSHOT/maven-metadata.xml
Uploaded: https://repository.apache.org/content/repositories/snapshots/org/apache/ctakes/ctakes-examples/3.1.2-SNAPSHOT/maven-metadata.xml
(782 B at 1.2 KB/sec)
Uploading: https://repository.apache.org/content/repositories/snapshots/org/apache/ctakes/ctakes-examples/maven-metadata.xml
Uploaded: https://repository.apache.org/content/repositories/snapshots/org/apache/ctakes/ctakes-examples/maven-metadata.xml
(392 B at 0.1 KB/sec)
[INFO] Deployment in https://repository.apache.org/content/repositories/snapshots (id=apache.snapshots.https,uniqueVersion=true)
Deploying the main artifact jenkins-6596574391779585798ctakes-lvg-3.1.2-SNAPSHOT.jar
Downloading: https://repository.apache.org/content/repositories/snapshots/org/apache/ctakes/ctakes-lvg/3.1.2-SNAPSHOT/maven-metadata.xml
Downloaded: https://repository.apache.org/content/repositories/snapshots/org/apache/ctakes/ctakes-lvg/3.1.2-SNAPSHOT/maven-metadata.xml
(777 B at 0.1 KB/sec)
Uploading: https://repository.apache.org/content/repositories/snapshots/org/apache/ctakes/ctakes-lvg/3.1.2-SNAPSHOT/ctakes-lvg-3.1.2-20131218.164949-9.jar
Uploaded: https://repository.apache.org/content/repositories/snapshots/org/apache/ctakes/ctakes-lvg/3.1.2-SNAPSHOT/ctakes-lvg-3.1.2-20131218.164949-9.jar
(26 KB at 75.3 KB/sec)
Uploading: https://repository.apache.org/content/repositories/snapshots/org/apache/ctakes/ctakes-lvg/3.1.2-SNAPSHOT/ctakes-lvg-3.1.2-20131218.164949-9.pom
Uploaded: https://repository.apache.org/content/repositories/snapshots/org/apache/ctakes/ctakes-lvg/3.1.2-SNAPSHOT/ctakes-lvg-3.1.2-20131218.164949-9.pom
(3 KB at 40.5 KB/sec)
Downloading: https://repository.apache.org/content/repositories/snapshots/org/apache/ctakes/ctakes-lvg/maven-metadata.xml
Downloaded: https://repository.apache.org/content/repositories/snapshots/org/apache/ctakes/ctakes-lvg/maven-metadata.xml
(387 B at 0.1 KB/sec)
Uploading: https://repository.apache.org/content/repositories/snapshots/org/apache/ctakes/ctakes-lvg/3.1.2-SNAPSHOT/maven-metadata.xml
Uploaded: https://repository.apache.org/content/repositories/snapshots/org/apache/ctakes/ctakes-lvg/3.1.2-SNAPSHOT/maven-metadata.xml
(777 B at 1.0 KB/sec)
Uploading: https://repository.apache.org/content/repositories/snapshots/org/apache/ctakes/ctakes-lvg/maven-metadata.xml
Uploaded: https://repository.apache.org/content/repositories/snapshots/org/apache/ctakes/ctakes-lvg/maven-metadata.xml
(387 B at 0.1 KB/sec)
[INFO] Deployment in https://repository.apache.org/content/repositories/snapshots (id=apache.snapshots.https,uniqueVersion=true)
Deploying the main artifact jenkins-1363901969202302455ctakes-lvg-res-3.1.2-SNAPSHOT.jar
Downloading: https://repository.apache.org/content/repositories/snapshots/org/apache/ctakes/ctakes-lvg-res/3.1.2-SNAPSHOT/maven-metadata.xml
Downloaded: https://repository.apache.org/content/repositories/snapshots/org/apache/ctakes/ctakes-lvg-res/3.1.2-SNAPSHOT/maven-metadata.xml
(781 B at 0.1 KB/sec)
Uploading: https://repository.apache.org/content/repositories/snapshots/org/apache/ctakes/ctakes-lvg-res/3.1.2-SNAPSHOT/ctakes-lvg-res-3.1.2-20131218.165022-9.jar
Uploaded: https://repository.apache.org/content/repositories/snapshots/org/apache/ctakes/ctakes-lvg-res/3.1.2-SNAPSHOT/ctakes-lvg-res-3.1.2-20131218.165022-9.jar
(7 KB at 101.3 KB/sec)
Uploading: https://repository.apache.org/content/repositories/snapshots/org/apache/ctakes/ctakes-lvg-res/3.1.2-SNAPSHOT/ctakes-lvg-res-3.1.2-20131218.165022-9.pom
Uploaded: https://repository.apache.org/content/repositories/snapshots/org/apache/ctakes/ctakes-lvg-res/3.1.2-SNAPSHOT/ctakes-lvg-res-3.1.2-20131218.165022-9.pom
(2 KB at 19.9 KB/sec)
Downloading: https://repository.apache.org/content/repositories/snapshots/org/apache/ctakes/ctakes-lvg-res/maven-metadata.xml
Downloaded: https://repository.apache.org/content/repositories/snapshots/org/apache/ctakes/ctakes-lvg-res/maven-metadata.xml
(391 B at 0.0 KB/sec)
Uploading: https://repository.apache.org/content/repositories/snapshots/org/apache/ctakes/ctakes-lvg-res/3.1.2-SNAPSHOT/maven-metadata.xml
Uploaded: https://repository.apache.org/content/repositories/snapshots/org/apache/ctakes/ctakes-lvg-res/3.1.2-SNAPSHOT/maven-metadata.xml
(781 B at 6.4 KB/sec)
Uploading: https://repository.apache.org/content/repositories/snapshots/org/apache/ctakes/ctakes-lvg-res/maven-metadata.xml
Uploaded: https://repository.apache.org/content/repositories/snapshots/org/apache/ctakes/ctakes-lvg-res/maven-metadata.xml
(391 B at 0.9 KB/sec)
[INFO] Deployment in https://repository.apache.org/content/repositories/snapshots (id=apache.snapshots.https,uniqueVersion=true)
Deploying the main artifact jenkins-4025777433388058522ctakes-ne-contexts-3.1.2-SNAPSHOT.jar
Downloading: https://repository.apache.org/content/repositories/snapshots/org/apache/ctakes/ctakes-ne-contexts/3.1.2-SNAPSHOT/maven-metadata.xml
Downloaded: https://repository.apache.org/content/repositories/snapshots/org/apache/ctakes/ctakes-ne-contexts/3.1.2-SNAPSHOT/maven-metadata.xml
(785 B at 0.2 KB/sec)
Uploading: https://repository.apache.org/content/repositories/snapshots/org/apache/ctakes/ctakes-ne-contexts/3.1.2-SNAPSHOT/ctakes-ne-contexts-3.1.2-20131218.165038-9.jar
Uploaded: https://repository.apache.org/content/repositories/snapshots/org/apache/ctakes/ctakes-ne-contexts/3.1.2-SNAPSHOT/ctakes-ne-contexts-3.1.2-20131218.165038-9.jar
(24 KB at 191.4 KB/sec)
Uploading: https://repository.apache.org/content/repositories/snapshots/org/apache/ctakes/ctakes-ne-contexts/3.1.2-SNAPSHOT/ctakes-ne-contexts-3.1.2-20131218.165038-9.pom
Uploaded: https://repository.apache.org/content/repositories/snapshots/org/apache/ctakes/ctakes-ne-contexts/3.1.2-SNAPSHOT/ctakes-ne-contexts-3.1.2-20131218.165038-9.pom
(2 KB at 25.1 KB/sec)
Downloading: https://repository.apache.org/content/repositories/snapshots/org/apache/ctakes/ctakes-ne-contexts/maven-metadata.xml
Downloaded: https://repository.apache.org/content/repositories/snapshots/org/apache/ctakes/ctakes-ne-contexts/maven-metadata.xml
(395 B at 0.1 KB/sec)
Uploading: https://repository.apache.org/content/repositories/snapshots/org/apache/ctakes/ctakes-ne-contexts/3.1.2-SNAPSHOT/maven-metadata.xml
Uploaded: https://repository.apache.org/content/repositories/snapshots/org/apache/ctakes/ctakes-ne-contexts/3.1.2-SNAPSHOT/maven-metadata.xml
(785 B at 0.6 KB/sec)
Uploading: https://repository.apache.org/content/repositories/snapshots/org/apache/ctakes/ctakes-ne-contexts/maven-metadata.xml
Uploaded: https://repository.apache.org/content/repositories/snapshots/org/apache/ctakes/ctakes-ne-contexts/maven-metadata.xml
(395 B at 1.6 KB/sec)
[INFO] Deployment in https://repository.apache.org/content/repositories/snapshots (id=apache.snapshots.https,uniqueVersion=true)
Deploying the main artifact jenkins-2697899055685584446ctakes-ne-contexts-res-3.1.2-SNAPSHOT.jar
Downloading: https://repository.apache.org/content/repositories/snapshots/org/apache/ctakes/ctakes-ne-contexts-res/3.1.2-SNAPSHOT/maven-metadata.xml
Downloaded: https://repository.apache.org/content/repositories/snapshots/org/apache/ctakes/ctakes-ne-contexts-res/3.1.2-SNAPSHOT/maven-metadata.xml
(789 B at 0.6 KB/sec)
Uploading: https://repository.apache.org/content/repositories/snapshots/org/apache/ctakes/ctakes-ne-contexts-res/3.1.2-SNAPSHOT/ctakes-ne-contexts-res-3.1.2-20131218.165052-9.jar
Uploaded: https://repository.apache.org/content/repositories/snapshots/org/apache/ctakes/ctakes-ne-contexts-res/3.1.2-SNAPSHOT/ctakes-ne-contexts-res-3.1.2-20131218.165052-9.jar
(7 KB at 64.9 KB/sec)
Uploading: https://repository.apache.org/content/repositories/snapshots/org/apache/ctakes/ctakes-ne-contexts-res/3.1.2-SNAPSHOT/ctakes-ne-contexts-res-3.1.2-20131218.165052-9.pom
Uploaded: https://repository.apache.org/content/repositories/snapshots/org/apache/ctakes/ctakes-ne-contexts-res/3.1.2-SNAPSHOT/ctakes-ne-contexts-res-3.1.2-20131218.165052-9.pom
(2 KB at 18.2 KB/sec)
Downloading: https://repository.apache.org/content/repositories/snapshots/org/apache/ctakes/ctakes-ne-contexts-res/maven-metadata.xml
Downloaded: https://repository.apache.org/content/repositories/snapshots/org/apache/ctakes/ctakes-ne-contexts-res/maven-metadata.xml
(399 B at 0.2 KB/sec)
Uploading: https://repository.apache.org/content/repositories/snapshots/org/apache/ctakes/ctakes-ne-contexts-res/3.1.2-SNAPSHOT/maven-metadata.xml
Uploaded: https://repository.apache.org/content/repositories/snapshots/org/apache/ctakes/ctakes-ne-contexts-res/3.1.2-SNAPSHOT/maven-metadata.xml
(789 B at 2.8 KB/sec)
Uploading: https://repository.apache.org/content/repositories/snapshots/org/apache/ctakes/ctakes-ne-contexts-res/maven-metadata.xml
Uploaded: https://repository.apache.org/content/repositories/snapshots/org/apache/ctakes/ctakes-ne-contexts-res/maven-metadata.xml
(399 B at 0.1 KB/sec)
[INFO] Deployment in https://repository.apache.org/content/repositories/snapshots (id=apache.snapshots.https,uniqueVersion=true)
Deploying the main artifact jenkins-2077567302984920475ctakes-pad-term-spotter-3.1.2-SNAPSHOT.jar
Downloading: https://repository.apache.org/content/repositories/snapshots/org/apache/ctakes/ctakes-pad-term-spotter/3.1.2-SNAPSHOT/maven-metadata.xml
Downloaded: https://repository.apache.org/content/repositories/snapshots/org/apache/ctakes/ctakes-pad-term-spotter/3.1.2-SNAPSHOT/maven-metadata.xml
(790 B at 0.5 KB/sec)
Uploading: https://repository.apache.org/content/repositories/snapshots/org/apache/ctakes/ctakes-pad-term-spotter/3.1.2-SNAPSHOT/ctakes-pad-term-spotter-3.1.2-20131218.165111-9.jar
Uploaded: https://repository.apache.org/content/repositories/snapshots/org/apache/ctakes/ctakes-pad-term-spotter/3.1.2-SNAPSHOT/ctakes-pad-term-spotter-3.1.2-20131218.165111-9.jar
(621 KB at 5491.0 KB/sec)
Uploading: https://repository.apache.org/content/repositories/snapshots/org/apache/ctakes/ctakes-pad-term-spotter/3.1.2-SNAPSHOT/ctakes-pad-term-spotter-3.1.2-20131218.165111-9.pom
Uploaded: https://repository.apache.org/content/repositories/snapshots/org/apache/ctakes/ctakes-pad-term-spotter/3.1.2-SNAPSHOT/ctakes-pad-term-spotter-3.1.2-20131218.165111-9.pom
(3 KB at 43.7 KB/sec)
Downloading: https://repository.apache.org/content/repositories/snapshots/org/apache/ctakes/ctakes-pad-term-spotter/maven-metadata.xml
Downloaded: https://repository.apache.org/content/repositories/snapshots/org/apache/ctakes/ctakes-pad-term-spotter/maven-metadata.xml
(400 B at 0.6 KB/sec)
Uploading: https://repository.apache.org/content/repositories/snapshots/org/apache/ctakes/ctakes-pad-term-spotter/3.1.2-SNAPSHOT/maven-metadata.xml
Uploaded: https://repository.apache.org/content/repositories/snapshots/org/apache/ctakes/ctakes-pad-term-spotter/3.1.2-SNAPSHOT/maven-metadata.xml
(790 B at 7.1 KB/sec)
Uploading: https://repository.apache.org/content/repositories/snapshots/org/apache/ctakes/ctakes-pad-term-spotter/maven-metadata.xml
Uploaded: https://repository.apache.org/content/repositories/snapshots/org/apache/ctakes/ctakes-pad-term-spotter/maven-metadata.xml
(400 B at 1.6 KB/sec)
[INFO] Deployment in https://repository.apache.org/content/repositories/snapshots (id=apache.snapshots.https,uniqueVersion=true)
Deploying the main artifact jenkins-7178549089288265866ctakes-pad-term-spotter-res-3.1.2-SNAPSHOT.jar
Downloading: https://repository.apache.org/content/repositories/snapshots/org/apache/ctakes/ctakes-pad-term-spotter-res/3.1.2-SNAPSHOT/maven-metadata.xml
Downloaded: https://repository.apache.org/content/repositories/snapshots/org/apache/ctakes/ctakes-pad-term-spotter-res/3.1.2-SNAPSHOT/maven-metadata.xml
(794 B at 0.1 KB/sec)
Uploading: https://repository.apache.org/content/repositories/snapshots/org/apache/ctakes/ctakes-pad-term-spotter-res/3.1.2-SNAPSHOT/ctakes-pad-term-spotter-res-3.1.2-20131218.165130-9.jar
Uploaded: https://repository.apache.org/content/repositories/snapshots/org/apache/ctakes/ctakes-pad-term-spotter-res/3.1.2-SNAPSHOT/ctakes-pad-term-spotter-res-3.1.2-20131218.165130-9.jar
(8 KB at 111.4 KB/sec)
Uploading: https://repository.apache.org/content/repositories/snapshots/org/apache/ctakes/ctakes-pad-term-spotter-res/3.1.2-SNAPSHOT/ctakes-pad-term-spotter-res-3.1.2-20131218.165130-9.pom
Uploaded: https://repository.apache.org/content/repositories/snapshots/org/apache/ctakes/ctakes-pad-term-spotter-res/3.1.2-SNAPSHOT/ctakes-pad-term-spotter-res-3.1.2-20131218.165130-9.pom
(2 KB at 16.3 KB/sec)
Downloading: https://repository.apache.org/content/repositories/snapshots/org/apache/ctakes/ctakes-pad-term-spotter-res/maven-metadata.xml
Downloaded: https://repository.apache.org/content/repositories/snapshots/org/apache/ctakes/ctakes-pad-term-spotter-res/maven-metadata.xml
(404 B at 0.0 KB/sec)
Uploading: https://repository.apache.org/content/repositories/snapshots/org/apache/ctakes/ctakes-pad-term-spotter-res/3.1.2-SNAPSHOT/maven-metadata.xml
Uploaded: https://repository.apache.org/content/repositories/snapshots/org/apache/ctakes/ctakes-pad-term-spotter-res/3.1.2-SNAPSHOT/maven-metadata.xml
(794 B at 4.7 KB/sec)
Uploading: https://repository.apache.org/content/repositories/snapshots/org/apache/ctakes/ctakes-pad-term-spotter-res/maven-metadata.xml
Uploaded: https://repository.apache.org/content/repositories/snapshots/org/apache/ctakes/ctakes-pad-term-spotter-res/maven-metadata.xml
(404 B at 0.6 KB/sec)
[INFO] Deployment in https://repository.apache.org/content/repositories/snapshots (id=apache.snapshots.https,uniqueVersion=true)
Deploying the main artifact jenkins-8712920253763712892ctakes-pos-tagger-3.1.2-SNAPSHOT.jar
Downloading: https://repository.apache.org/content/repositories/snapshots/org/apache/ctakes/ctakes-pos-tagger/3.1.2-SNAPSHOT/maven-metadata.xml
Downloaded: https://repository.apache.org/content/repositories/snapshots/org/apache/ctakes/ctakes-pos-tagger/3.1.2-SNAPSHOT/maven-metadata.xml
(784 B at 0.1 KB/sec)
Uploading: https://repository.apache.org/content/repositories/snapshots/org/apache/ctakes/ctakes-pos-tagger/3.1.2-SNAPSHOT/ctakes-pos-tagger-3.1.2-20131218.165223-9.jar
Uploaded: https://repository.apache.org/content/repositories/snapshots/org/apache/ctakes/ctakes-pos-tagger/3.1.2-SNAPSHOT/ctakes-pos-tagger-3.1.2-20131218.165223-9.jar
(20 KB at 23.6 KB/sec)
Uploading: https://repository.apache.org/content/repositories/snapshots/org/apache/ctakes/ctakes-pos-tagger/3.1.2-SNAPSHOT/ctakes-pos-tagger-3.1.2-20131218.165223-9.pom
Uploaded: https://repository.apache.org/content/repositories/snapshots/org/apache/ctakes/ctakes-pos-tagger/3.1.2-SNAPSHOT/ctakes-pos-tagger-3.1.2-20131218.165223-9.pom
(3 KB at 36.4 KB/sec)
Downloading: https://repository.apache.org/content/repositories/snapshots/org/apache/ctakes/ctakes-pos-tagger/maven-metadata.xml
Downloaded: https://repository.apache.org/content/repositories/snapshots/org/apache/ctakes/ctakes-pos-tagger/maven-metadata.xml
(394 B at 0.1 KB/sec)
Uploading: https://repository.apache.org/content/repositories/snapshots/org/apache/ctakes/ctakes-pos-tagger/3.1.2-SNAPSHOT/maven-metadata.xml
Uploaded: https://repository.apache.org/content/repositories/snapshots/org/apache/ctakes/ctakes-pos-tagger/3.1.2-SNAPSHOT/maven-metadata.xml
(784 B at 3.4 KB/sec)
Uploading: https://repository.apache.org/content/repositories/snapshots/org/apache/ctakes/ctakes-pos-tagger/maven-metadata.xml
Uploaded: https://repository.apache.org/content/repositories/snapshots/org/apache/ctakes/ctakes-pos-tagger/maven-metadata.xml
(394 B at 4.1 KB/sec)
[INFO] Deployment in https://repository.apache.org/content/repositories/snapshots (id=apache.snapshots.https,uniqueVersion=true)
Deploying the main artifact jenkins-7004262587548445459ctakes-pos-tagger-res-3.1.2-SNAPSHOT.jar
Downloading: https://repository.apache.org/content/repositories/snapshots/org/apache/ctakes/ctakes-pos-tagger-res/3.1.2-SNAPSHOT/maven-metadata.xml
Downloaded: https://repository.apache.org/content/repositories/snapshots/org/apache/ctakes/ctakes-pos-tagger-res/3.1.2-SNAPSHOT/maven-metadata.xml
(788 B at 0.2 KB/sec)
Uploading: https://repository.apache.org/content/repositories/snapshots/org/apache/ctakes/ctakes-pos-tagger-res/3.1.2-SNAPSHOT/ctakes-pos-tagger-res-3.1.2-20131218.165242-9.jar
Uploaded: https://repository.apache.org/content/repositories/snapshots/org/apache/ctakes/ctakes-pos-tagger-res/3.1.2-SNAPSHOT/ctakes-pos-tagger-res-3.1.2-20131218.165242-9.jar
(7 KB at 16.9 KB/sec)
Uploading: https://repository.apache.org/content/repositories/snapshots/org/apache/ctakes/ctakes-pos-tagger-res/3.1.2-SNAPSHOT/ctakes-pos-tagger-res-3.1.2-20131218.165242-9.pom
Uploaded: https://repository.apache.org/content/repositories/snapshots/org/apache/ctakes/ctakes-pos-tagger-res/3.1.2-SNAPSHOT/ctakes-pos-tagger-res-3.1.2-20131218.165242-9.pom
(2 KB at 24.0 KB/sec)
Downloading: https://repository.apache.org/content/repositories/snapshots/org/apache/ctakes/ctakes-pos-tagger-res/maven-metadata.xml
Downloaded: https://repository.apache.org/content/repositories/snapshots/org/apache/ctakes/ctakes-pos-tagger-res/maven-metadata.xml
(398 B at 0.1 KB/sec)
Uploading: https://repository.apache.org/content/repositories/snapshots/org/apache/ctakes/ctakes-pos-tagger-res/3.1.2-SNAPSHOT/maven-metadata.xml
Uploaded: https://repository.apache.org/content/repositories/snapshots/org/apache/ctakes/ctakes-pos-tagger-res/3.1.2-SNAPSHOT/maven-metadata.xml
(788 B at 1.0 KB/sec)
Uploading: https://repository.apache.org/content/repositories/snapshots/org/apache/ctakes/ctakes-pos-tagger-res/maven-metadata.xml
Uploaded: https://repository.apache.org/content/repositories/snapshots/org/apache/ctakes/ctakes-pos-tagger-res/maven-metadata.xml
(398 B at 3.5 KB/sec)
[INFO] Deployment in https://repository.apache.org/content/repositories/snapshots (id=apache.snapshots.https,uniqueVersion=true)
Deploying the main artifact jenkins-215484977499968181ctakes-preprocessor-3.1.2-SNAPSHOT.jar
Downloading: https://repository.apache.org/content/repositories/snapshots/org/apache/ctakes/ctakes-preprocessor/3.1.2-SNAPSHOT/maven-metadata.xml
Downloaded: https://repository.apache.org/content/repositories/snapshots/org/apache/ctakes/ctakes-preprocessor/3.1.2-SNAPSHOT/maven-metadata.xml
(786 B at 0.1 KB/sec)
Uploading: https://repository.apache.org/content/repositories/snapshots/org/apache/ctakes/ctakes-preprocessor/3.1.2-SNAPSHOT/ctakes-preprocessor-3.1.2-20131218.165306-9.jar
Uploaded: https://repository.apache.org/content/repositories/snapshots/org/apache/ctakes/ctakes-preprocessor/3.1.2-SNAPSHOT/ctakes-preprocessor-3.1.2-20131218.165306-9.jar
(29 KB at 433.4 KB/sec)
Uploading: https://repository.apache.org/content/repositories/snapshots/org/apache/ctakes/ctakes-preprocessor/3.1.2-SNAPSHOT/ctakes-preprocessor-3.1.2-20131218.165306-9.pom
Uploaded: https://repository.apache.org/content/repositories/snapshots/org/apache/ctakes/ctakes-preprocessor/3.1.2-SNAPSHOT/ctakes-preprocessor-3.1.2-20131218.165306-9.pom
(2 KB at 29.7 KB/sec)
Downloading: https://repository.apache.org/content/repositories/snapshots/org/apache/ctakes/ctakes-preprocessor/maven-metadata.xml
Downloaded: https://repository.apache.org/content/repositories/snapshots/org/apache/ctakes/ctakes-preprocessor/maven-metadata.xml
(396 B at 0.1 KB/sec)
Uploading: https://repository.apache.org/content/repositories/snapshots/org/apache/ctakes/ctakes-preprocessor/3.1.2-SNAPSHOT/maven-metadata.xml
Uploaded: https://repository.apache.org/content/repositories/snapshots/org/apache/ctakes/ctakes-preprocessor/3.1.2-SNAPSHOT/maven-metadata.xml
(786 B at 0.8 KB/sec)
Uploading: https://repository.apache.org/content/repositories/snapshots/org/apache/ctakes/ctakes-preprocessor/maven-metadata.xml
Uploaded: https://repository.apache.org/content/repositories/snapshots/org/apache/ctakes/ctakes-preprocessor/maven-metadata.xml
(396 B at 3.6 KB/sec)
[INFO] Deployment in https://repository.apache.org/content/repositories/snapshots (id=apache.snapshots.https,uniqueVersion=true)
Deploying the main artifact jenkins-3157779495676211920ctakes-regression-test-3.1.2-SNAPSHOT.jar
Downloading: https://repository.apache.org/content/repositories/snapshots/org/apache/ctakes/ctakes-regression-test/3.1.2-SNAPSHOT/maven-metadata.xml
Downloaded: https://repository.apache.org/content/repositories/snapshots/org/apache/ctakes/ctakes-regression-test/3.1.2-SNAPSHOT/maven-metadata.xml
(789 B at 0.2 KB/sec)
Uploading: https://repository.apache.org/content/repositories/snapshots/org/apache/ctakes/ctakes-regression-test/3.1.2-SNAPSHOT/ctakes-regression-test-3.1.2-20131218.165327-9.jar
Uploaded: https://repository.apache.org/content/repositories/snapshots/org/apache/ctakes/ctakes-regression-test/3.1.2-SNAPSHOT/ctakes-regression-test-3.1.2-20131218.165327-9.jar
(10 KB at 22.8 KB/sec)
Uploading: https://repository.apache.org/content/repositories/snapshots/org/apache/ctakes/ctakes-regression-test/3.1.2-SNAPSHOT/ctakes-regression-test-3.1.2-20131218.165327-9.pom
Uploaded: https://repository.apache.org/content/repositories/snapshots/org/apache/ctakes/ctakes-regression-test/3.1.2-SNAPSHOT/ctakes-regression-test-3.1.2-20131218.165327-9.pom
(4 KB at 53.2 KB/sec)
Downloading: https://repository.apache.org/content/repositories/snapshots/org/apache/ctakes/ctakes-regression-test/maven-metadata.xml
Downloaded: https://repository.apache.org/content/repositories/snapshots/org/apache/ctakes/ctakes-regression-test/maven-metadata.xml
(399 B at 0.1 KB/sec)
Uploading: https://repository.apache.org/content/repositories/snapshots/org/apache/ctakes/ctakes-regression-test/3.1.2-SNAPSHOT/maven-metadata.xml
Uploading: https://repository.apache.org/content/repositories/snapshots/org/apache/ctakes/ctakes-regression-test/maven-metadata.xml
Uploaded: https://repository.apache.org/content/repositories/snapshots/org/apache/ctakes/ctakes-regression-test/maven-metadata.xml
(399 B at 0.3 KB/sec)
ERROR: Failed to deploy metadata: Could not transfer metadata org.apache.ctakes:ctakes-regression-test:3.1.2-SNAPSHOT/maven-metadata.xml
from/to apache.snapshots.https (https://repository.apache.org/content/repositories/snapshots):
The target server failed to respond
org.apache.maven.artifact.deployer.ArtifactDeploymentException: Failed to deploy metadata:
Could not transfer metadata org.apache.ctakes:ctakes-regression-test:3.1.2-SNAPSHOT/maven-metadata.xml
from/to apache.snapshots.https (https://repository.apache.org/content/repositories/snapshots):
The target server failed to respond
	at org.apache.maven.artifact.deployer.DefaultArtifactDeployer.deploy(DefaultArtifactDeployer.java:143)
	at hudson.maven.reporters.MavenArtifactRecord.deploy(MavenArtifactRecord.java:191)
	at hudson.maven.RedeployPublisher.perform(RedeployPublisher.java:176)
	at hudson.tasks.BuildStepMonitor$1.perform(BuildStepMonitor.java:20)
	at hudson.model.AbstractBuild$AbstractBuildExecution.perform(AbstractBuild.java:785)
	at hudson.model.AbstractBuild$AbstractBuildExecution.performAllBuildSteps(AbstractBuild.java:757)
	at hudson.maven.MavenModuleSetBuild$MavenModuleSetBuildExecution.post2(MavenModuleSetBuild.java:1020)
	at hudson.model.AbstractBuild$AbstractBuildExecution.post(AbstractBuild.java:706)
	at hudson.model.Run.execute(Run.java:1702)
	at hudson.maven.MavenModuleSetBuild.run(MavenModuleSetBuild.java:509)
	at hudson.model.ResourceController.execute(ResourceController.java:88)
	at hudson.model.Executor.run(Executor.java:231)
Caused by: org.eclipse.aether.deployment.DeploymentException: Failed to deploy metadata: Could
not transfer metadata org.apache.ctakes:ctakes-regression-test:3.1.2-SNAPSHOT/maven-metadata.xml
from/to apache.snapshots.https (https://repository.apache.org/content/repositories/snapshots):
The target server failed to respond
	at org.eclipse.aether.internal.impl.DefaultDeployer.deploy(DefaultDeployer.java:372)
	at org.eclipse.aether.internal.impl.DefaultDeployer.deploy(DefaultDeployer.java:269)
	at org.eclipse.aether.internal.impl.DefaultRepositorySystem.deploy(DefaultRepositorySystem.java:413)
	at org.apache.maven.artifact.deployer.DefaultArtifactDeployer.deploy(DefaultArtifactDeployer.java:139)
	... 11 more
Caused by: org.eclipse.aether.transfer.MetadataTransferException: Could not transfer metadata
org.apache.ctakes:ctakes-regression-test:3.1.2-SNAPSHOT/maven-metadata.xml from/to apache.snapshots.https
(https://repository.apache.org/content/repositories/snapshots): The target server failed to
respond
	at org.eclipse.aether.connector.wagon.WagonRepositoryConnector$5.wrap(WagonRepositoryConnector.java:995)
	at org.eclipse.aether.connector.wagon.WagonRepositoryConnector$5.wrap(WagonRepositoryConnector.java:983)
	at org.eclipse.aether.connector.wagon.WagonRepositoryConnector$PutTask.run(WagonRepositoryConnector.java:895)
	at org.eclipse.aether.connector.wagon.WagonRepositoryConnector.put(WagonRepositoryConnector.java:530)
	at org.eclipse.aether.internal.impl.DefaultDeployer.deploy(DefaultDeployer.java:366)
	... 14 more
Caused by: org.apache.maven.wagon.TransferFailedException: The target server failed to respond
	at org.apache.maven.wagon.shared.http4.AbstractHttpClientWagon.put(AbstractHttpClientWagon.java:580)
	at org.apache.maven.wagon.shared.http4.AbstractHttpClientWagon.put(AbstractHttpClientWagon.java:524)
	at org.apache.maven.wagon.shared.http4.AbstractHttpClientWagon.put(AbstractHttpClientWagon.java:505)
	at org.apache.maven.wagon.shared.http4.AbstractHttpClientWagon.put(AbstractHttpClientWagon.java:485)
	at org.eclipse.aether.connector.wagon.WagonRepositoryConnector$PutTask.run(WagonRepositoryConnector.java:871)
	... 16 more
Caused by: org.apache.http.NoHttpResponseException: The target server failed to respond
	at org.apache.http.impl.conn.DefaultHttpResponseParser.parseHead(DefaultHttpResponseParser.java:95)
	at org.apache.http.impl.conn.DefaultHttpResponseParser.parseHead(DefaultHttpResponseParser.java:62)
	at org.apache.http.impl.io.AbstractMessageParser.parse(AbstractMessageParser.java:254)
	at org.apache.http.impl.AbstractHttpClientConnection.receiveResponseHeader(AbstractHttpClientConnection.java:289)
	at org.apache.http.impl.conn.DefaultClientConnection.receiveResponseHeader(DefaultClientConnection.java:252)
	at org.apache.http.impl.conn.ManagedClientConnectionImpl.receiveResponseHeader(ManagedClientConnectionImpl.java:191)
	at org.apache.http.protocol.HttpRequestExecutor.doReceiveResponse(HttpRequestExecutor.java:300)
	at org.apache.http.protocol.HttpRequestExecutor.execute(HttpRequestExecutor.java:127)
	at org.apache.http.impl.client.DefaultRequestDirector.tryExecute(DefaultRequestDirector.java:715)
	at org.apache.http.impl.client.DefaultRequestDirector.execute(DefaultRequestDirector.java:520)
	at org.apache.http.impl.client.AbstractHttpClient.execute(AbstractHttpClient.java:906)
	at org.apache.http.impl.client.AbstractHttpClient.execute(AbstractHttpClient.java:805)
	at org.apache.maven.wagon.shared.http4.AbstractHttpClientWagon.execute(AbstractHttpClientWagon.java:746)
	at org.apache.maven.wagon.shared.http4.AbstractHttpClientWagon.put(AbstractHttpClientWagon.java:574)
	... 20 more
[INFO] Deployment failed after 13 min
Build step 'Deploy artifacts to Maven repository' changed build result to FAILURE

Mime
View raw message