ctakes-notifications mailing list archives

Site index · List index
Message view « Date » · « Thread »
Top « Date » · « Thread »
From Apache Jenkins Server <jenk...@builds.apache.org>
Subject Build failed in Jenkins: ctakes-trunk-package #206
Date Wed, 04 Dec 2013 19:50:31 GMT
See <https://builds.apache.org/job/ctakes-trunk-package/206/changes>

Changes:

[chenpei] CTAKES-200 - Update Test Case for new sectionizer

[chenpei] CTAKES-200 - Add HL7/CCDA Sections

[shalgrim] 

[shalgrim] 

[clin] For evaluation script, add offsets for error log output.

------------------------------------------
[...truncated 6300 lines...]
[INFO] Apache cTAKES dictionary lookup ................... SUCCESS [35.406s]
[INFO] Apache cTAKES context dependent tokenizer ......... SUCCESS [9.261s]
[INFO] Apache cTAKES Resources lvg ....................... SUCCESS [6.467s]
[INFO] Apache cTAKES LVG lexical tools ................... SUCCESS [8.606s]
[INFO] Apache cTAKES Resources ne-contexts ............... SUCCESS [6.410s]
[INFO] Apache cTAKES named entity contexts ............... SUCCESS [9.428s]
[INFO] Apache cTAKES Resources constituency-parser ....... SUCCESS [10.452s]
[INFO] Apache cTAKES Constituency Parser ................. SUCCESS [8.205s]
[INFO] Apache cTAKES Resources coreference ............... SUCCESS [4.848s]
[INFO] Apache cTAKES Resources relation-extractor ........ SUCCESS [8.878s]
[INFO] Apache cTAKES Resources dependency-parser ......... SUCCESS [8.162s]
[INFO] Apache cTAKES Dependency Parser ................... SUCCESS [8.584s]
[INFO] Apache cTAKES Relation Extractor .................. SUCCESS [12.562s]
[INFO] Apache cTAKES CoReference Resolver ................ SUCCESS [11.987s]
[INFO] Apache cTAKES Resources drug-ner .................. SUCCESS [13.936s]
[INFO] Apache cTAKES Drug NER ............................ SUCCESS [9.434s]
[INFO] Apache cTAKES Resources side-effect ............... SUCCESS [5.729s]
[INFO] Apache cTAKES Side Effects ........................ SUCCESS [11.558s]
[INFO] Apache cTAKES Resources smoking-status ............ SUCCESS [5.321s]
[INFO] Apache cTAKES Smoking Status ...................... SUCCESS [11.831s]
[INFO] Apache cTAKES Resources pad-term-spotter-res ...... SUCCESS [7.263s]
[INFO] Apache cTAKES Pad Term Spotter .................... SUCCESS [10.028s]
[INFO] Apache cTAKES Resources assertion ................. SUCCESS [11.788s]
[INFO] Apache cTAKES Resources assertion-zoner ........... SUCCESS [6.042s]
[INFO] Apache cTAKES Assertion's zoner ................... SUCCESS [15.598s]
[INFO] Apache cTAKES Assertion ........................... SUCCESS [14.694s]
[INFO] Apache cTAKES Resources temporal .................. SUCCESS [5.265s]
[INFO] Apache cTAKES Temporal Information Extraction ..... SUCCESS [21.349s]
[INFO] Apache cTAKES ctakes-clinical-pipeline ............ SUCCESS [9.219s]
[INFO] Apache cTAKES Regression-test ..................... SUCCESS [7.502s]
[INFO] Apache cTAKES template filler ..................... SUCCESS [8.368s]
[INFO] ctakes-examples ................................... SUCCESS [3.145s]
[INFO] ------------------------------------------------------------------------
[INFO] BUILD SUCCESS
[INFO] ------------------------------------------------------------------------
[INFO] Total time: 57:19.376s
[INFO] Finished at: Wed Dec 04 19:47:38 UTC 2013
[INFO] Final Memory: 42M/154M
[INFO] ------------------------------------------------------------------------
Waiting for Jenkins to finish collecting data
[JENKINS] Archiving <https://builds.apache.org/job/ctakes-trunk-package/ws/ctakes-core/pom.xml>
to org.apache.ctakes/ctakes-core/3.1.2-SNAPSHOT/ctakes-core-3.1.2-SNAPSHOT.pom
[JENKINS] Archiving <https://builds.apache.org/job/ctakes-trunk-package/ws/ctakes-core/target/ctakes-core-3.1.2-SNAPSHOT.jar>
to org.apache.ctakes/ctakes-core/3.1.2-SNAPSHOT/ctakes-core-3.1.2-SNAPSHOT.jar
[JENKINS] Archiving <https://builds.apache.org/job/ctakes-trunk-package/ws/ctakes-coreference/pom.xml>
to org.apache.ctakes/ctakes-coreference/3.1.2-SNAPSHOT/ctakes-coreference-3.1.2-SNAPSHOT.pom
[JENKINS] Archiving <https://builds.apache.org/job/ctakes-trunk-package/ws/ctakes-coreference/target/ctakes-coreference-3.1.2-SNAPSHOT.jar>
to org.apache.ctakes/ctakes-coreference/3.1.2-SNAPSHOT/ctakes-coreference-3.1.2-SNAPSHOT.jar
[JENKINS] Archiving <https://builds.apache.org/job/ctakes-trunk-package/ws/ctakes-dependency-parser/pom.xml>
to org.apache.ctakes/ctakes-dependency-parser/3.1.2-SNAPSHOT/ctakes-dependency-parser-3.1.2-SNAPSHOT.pom
[JENKINS] Archiving <https://builds.apache.org/job/ctakes-trunk-package/ws/ctakes-dependency-parser/target/ctakes-dependency-parser-3.1.2-SNAPSHOT.jar>
to org.apache.ctakes/ctakes-dependency-parser/3.1.2-SNAPSHOT/ctakes-dependency-parser-3.1.2-SNAPSHOT.jar
[JENKINS] Archiving <https://builds.apache.org/job/ctakes-trunk-package/ws/ctakes-regression-test/pom.xml>
to org.apache.ctakes/ctakes-regression-test/3.1.2-SNAPSHOT/ctakes-regression-test-3.1.2-SNAPSHOT.pom
[JENKINS] Archiving <https://builds.apache.org/job/ctakes-trunk-package/ws/ctakes-regression-test/target/ctakes-regression-test-3.1.2-SNAPSHOT.jar>
to org.apache.ctakes/ctakes-regression-test/3.1.2-SNAPSHOT/ctakes-regression-test-3.1.2-SNAPSHOT.jar
[JENKINS] Archiving <https://builds.apache.org/job/ctakes-trunk-package/ws/ctakes-dictionary-lookup-res/pom.xml>
to org.apache.ctakes/ctakes-dictionary-lookup-res/3.1.2-SNAPSHOT/ctakes-dictionary-lookup-res-3.1.2-SNAPSHOT.pom
[JENKINS] Archiving <https://builds.apache.org/job/ctakes-trunk-package/ws/ctakes-dictionary-lookup-res/target/ctakes-dictionary-lookup-res-3.1.2-SNAPSHOT.jar>
to org.apache.ctakes/ctakes-dictionary-lookup-res/3.1.2-SNAPSHOT/ctakes-dictionary-lookup-res-3.1.2-SNAPSHOT.jar
[JENKINS] Archiving <https://builds.apache.org/job/ctakes-trunk-package/ws/ctakes-ne-contexts/pom.xml>
to org.apache.ctakes/ctakes-ne-contexts/3.1.2-SNAPSHOT/ctakes-ne-contexts-3.1.2-SNAPSHOT.pom
[JENKINS] Archiving <https://builds.apache.org/job/ctakes-trunk-package/ws/ctakes-ne-contexts/target/ctakes-ne-contexts-3.1.2-SNAPSHOT.jar>
to org.apache.ctakes/ctakes-ne-contexts/3.1.2-SNAPSHOT/ctakes-ne-contexts-3.1.2-SNAPSHOT.jar
[JENKINS] Archiving <https://builds.apache.org/job/ctakes-trunk-package/ws/ctakes-drug-ner/pom.xml>
to org.apache.ctakes/ctakes-drug-ner/3.1.2-SNAPSHOT/ctakes-drug-ner-3.1.2-SNAPSHOT.pom
[JENKINS] Archiving <https://builds.apache.org/job/ctakes-trunk-package/ws/ctakes-drug-ner/target/ctakes-drug-ner-3.1.2-SNAPSHOT.jar>
to org.apache.ctakes/ctakes-drug-ner/3.1.2-SNAPSHOT/ctakes-drug-ner-3.1.2-SNAPSHOT.jar
[JENKINS] Archiving <https://builds.apache.org/job/ctakes-trunk-package/ws/ctakes-preprocessor/pom.xml>
to org.apache.ctakes/ctakes-preprocessor/3.1.2-SNAPSHOT/ctakes-preprocessor-3.1.2-SNAPSHOT.pom
[JENKINS] Archiving <https://builds.apache.org/job/ctakes-trunk-package/ws/ctakes-preprocessor/target/ctakes-preprocessor-3.1.2-SNAPSHOT.jar>
to org.apache.ctakes/ctakes-preprocessor/3.1.2-SNAPSHOT/ctakes-preprocessor-3.1.2-SNAPSHOT.jar
[JENKINS] Archiving <https://builds.apache.org/job/ctakes-trunk-package/ws/ctakes-smoking-status/pom.xml>
to org.apache.ctakes/ctakes-smoking-status/3.1.2-SNAPSHOT/ctakes-smoking-status-3.1.2-SNAPSHOT.pom
[JENKINS] Archiving <https://builds.apache.org/job/ctakes-trunk-package/ws/ctakes-smoking-status/target/ctakes-smoking-status-3.1.2-SNAPSHOT.jar>
to org.apache.ctakes/ctakes-smoking-status/3.1.2-SNAPSHOT/ctakes-smoking-status-3.1.2-SNAPSHOT.jar
[JENKINS] Archiving <https://builds.apache.org/job/ctakes-trunk-package/ws/ctakes-clinical-pipeline/pom.xml>
to org.apache.ctakes/ctakes-clinical-pipeline/3.1.2-SNAPSHOT/ctakes-clinical-pipeline-3.1.2-SNAPSHOT.pom
[JENKINS] Archiving <https://builds.apache.org/job/ctakes-trunk-package/ws/ctakes-clinical-pipeline/target/ctakes-clinical-pipeline-3.1.2-SNAPSHOT.jar>
to org.apache.ctakes/ctakes-clinical-pipeline/3.1.2-SNAPSHOT/ctakes-clinical-pipeline-3.1.2-SNAPSHOT.jar
[JENKINS] Archiving <https://builds.apache.org/job/ctakes-trunk-package/ws/ctakes-chunker/pom.xml>
to org.apache.ctakes/ctakes-chunker/3.1.2-SNAPSHOT/ctakes-chunker-3.1.2-SNAPSHOT.pom
[JENKINS] Archiving <https://builds.apache.org/job/ctakes-trunk-package/ws/ctakes-chunker/target/ctakes-chunker-3.1.2-SNAPSHOT.jar>
to org.apache.ctakes/ctakes-chunker/3.1.2-SNAPSHOT/ctakes-chunker-3.1.2-SNAPSHOT.jar
[JENKINS] Archiving <https://builds.apache.org/job/ctakes-trunk-package/ws/ctakes-temporal/pom.xml>
to org.apache.ctakes/ctakes-temporal/3.1.2-SNAPSHOT/ctakes-temporal-3.1.2-SNAPSHOT.pom
[JENKINS] Archiving <https://builds.apache.org/job/ctakes-trunk-package/ws/ctakes-temporal/target/ctakes-temporal-3.1.2-SNAPSHOT.jar>
to org.apache.ctakes/ctakes-temporal/3.1.2-SNAPSHOT/ctakes-temporal-3.1.2-SNAPSHOT.jar
[JENKINS] Archiving <https://builds.apache.org/job/ctakes-trunk-package/ws/ctakes-smoking-status-res/pom.xml>
to org.apache.ctakes/ctakes-smoking-status-res/3.1.2-SNAPSHOT/ctakes-smoking-status-res-3.1.2-SNAPSHOT.pom
[JENKINS] Archiving <https://builds.apache.org/job/ctakes-trunk-package/ws/ctakes-smoking-status-res/target/ctakes-smoking-status-res-3.1.2-SNAPSHOT.jar>
to org.apache.ctakes/ctakes-smoking-status-res/3.1.2-SNAPSHOT/ctakes-smoking-status-res-3.1.2-SNAPSHOT.jar
[JENKINS] Archiving <https://builds.apache.org/job/ctakes-trunk-package/ws/ctakes-coreference-res/pom.xml>
to org.apache.ctakes/ctakes-coreference-res/3.1.2-SNAPSHOT/ctakes-coreference-res-3.1.2-SNAPSHOT.pom
[JENKINS] Archiving <https://builds.apache.org/job/ctakes-trunk-package/ws/ctakes-coreference-res/target/ctakes-coreference-res-3.1.2-SNAPSHOT.jar>
to org.apache.ctakes/ctakes-coreference-res/3.1.2-SNAPSHOT/ctakes-coreference-res-3.1.2-SNAPSHOT.jar
[JENKINS] Archiving <https://builds.apache.org/job/ctakes-trunk-package/ws/ctakes-core-res/pom.xml>
to org.apache.ctakes/ctakes-core-res/3.1.2-SNAPSHOT/ctakes-core-res-3.1.2-SNAPSHOT.pom
[JENKINS] Archiving <https://builds.apache.org/job/ctakes-trunk-package/ws/ctakes-core-res/target/ctakes-core-res-3.1.2-SNAPSHOT.jar>
to org.apache.ctakes/ctakes-core-res/3.1.2-SNAPSHOT/ctakes-core-res-3.1.2-SNAPSHOT.jar
[JENKINS] Archiving <https://builds.apache.org/job/ctakes-trunk-package/ws/ctakes-dictionary-lookup/pom.xml>
to org.apache.ctakes/ctakes-dictionary-lookup/3.1.2-SNAPSHOT/ctakes-dictionary-lookup-3.1.2-SNAPSHOT.pom
[JENKINS] Archiving <https://builds.apache.org/job/ctakes-trunk-package/ws/ctakes-dictionary-lookup/target/ctakes-dictionary-lookup-3.1.2-SNAPSHOT.jar>
to org.apache.ctakes/ctakes-dictionary-lookup/3.1.2-SNAPSHOT/ctakes-dictionary-lookup-3.1.2-SNAPSHOT.jar
[JENKINS] Archiving <https://builds.apache.org/job/ctakes-trunk-package/ws/ctakes-assertion-zoner-res/pom.xml>
to org.apache.ctakes/ctakes-assertion-zoner-res/3.1.2-SNAPSHOT/ctakes-assertion-zoner-res-3.1.2-SNAPSHOT.pom
[JENKINS] Archiving <https://builds.apache.org/job/ctakes-trunk-package/ws/ctakes-assertion-zoner-res/target/ctakes-assertion-zoner-res-3.1.2-SNAPSHOT.jar>
to org.apache.ctakes/ctakes-assertion-zoner-res/3.1.2-SNAPSHOT/ctakes-assertion-zoner-res-3.1.2-SNAPSHOT.jar
[JENKINS] Archiving <https://builds.apache.org/job/ctakes-trunk-package/ws/ctakes-examples/pom.xml>
to org.apache.ctakes/ctakes-examples/3.1.2-SNAPSHOT/ctakes-examples-3.1.2-SNAPSHOT.pom
[JENKINS] Archiving <https://builds.apache.org/job/ctakes-trunk-package/ws/ctakes-examples/target/ctakes-examples-3.1.2-SNAPSHOT.jar>
to org.apache.ctakes/ctakes-examples/3.1.2-SNAPSHOT/ctakes-examples-3.1.2-SNAPSHOT.jar
[JENKINS] Archiving <https://builds.apache.org/job/ctakes-trunk-package/ws/ctakes-pad-term-spotter-res/pom.xml>
to org.apache.ctakes/ctakes-pad-term-spotter-res/3.1.2-SNAPSHOT/ctakes-pad-term-spotter-res-3.1.2-SNAPSHOT.pom
[JENKINS] Archiving <https://builds.apache.org/job/ctakes-trunk-package/ws/ctakes-pad-term-spotter-res/target/ctakes-pad-term-spotter-res-3.1.2-SNAPSHOT.jar>
to org.apache.ctakes/ctakes-pad-term-spotter-res/3.1.2-SNAPSHOT/ctakes-pad-term-spotter-res-3.1.2-SNAPSHOT.jar
[JENKINS] Archiving <https://builds.apache.org/job/ctakes-trunk-package/ws/ctakes-utils/pom.xml>
to org.apache.ctakes/ctakes-utils/3.1.2-SNAPSHOT/ctakes-utils-3.1.2-SNAPSHOT.pom
[JENKINS] Archiving <https://builds.apache.org/job/ctakes-trunk-package/ws/ctakes-utils/target/ctakes-utils-3.1.2-SNAPSHOT.jar>
to org.apache.ctakes/ctakes-utils/3.1.2-SNAPSHOT/ctakes-utils-3.1.2-SNAPSHOT.jar
[JENKINS] Archiving <https://builds.apache.org/job/ctakes-trunk-package/ws/ctakes-side-effect-res/pom.xml>
to org.apache.ctakes/ctakes-side-effect-res/3.1.2-SNAPSHOT/ctakes-side-effect-res-3.1.2-SNAPSHOT.pom
[JENKINS] Archiving <https://builds.apache.org/job/ctakes-trunk-package/ws/ctakes-side-effect-res/target/ctakes-side-effect-res-3.1.2-SNAPSHOT.jar>
to org.apache.ctakes/ctakes-side-effect-res/3.1.2-SNAPSHOT/ctakes-side-effect-res-3.1.2-SNAPSHOT.jar
[JENKINS] Archiving <https://builds.apache.org/job/ctakes-trunk-package/ws/ctakes-constituency-parser-res/pom.xml>
to org.apache.ctakes/ctakes-constituency-parser-res/3.1.2-SNAPSHOT/ctakes-constituency-parser-res-3.1.2-SNAPSHOT.pom
[JENKINS] Archiving <https://builds.apache.org/job/ctakes-trunk-package/ws/ctakes-constituency-parser-res/target/ctakes-constituency-parser-res-3.1.2-SNAPSHOT.jar>
to org.apache.ctakes/ctakes-constituency-parser-res/3.1.2-SNAPSHOT/ctakes-constituency-parser-res-3.1.2-SNAPSHOT.jar
[JENKINS] Archiving <https://builds.apache.org/job/ctakes-trunk-package/ws/ctakes-lvg/pom.xml>
to org.apache.ctakes/ctakes-lvg/3.1.2-SNAPSHOT/ctakes-lvg-3.1.2-SNAPSHOT.pom
[JENKINS] Archiving <https://builds.apache.org/job/ctakes-trunk-package/ws/ctakes-lvg/target/ctakes-lvg-3.1.2-SNAPSHOT.jar>
to org.apache.ctakes/ctakes-lvg/3.1.2-SNAPSHOT/ctakes-lvg-3.1.2-SNAPSHOT.jar
[JENKINS] Archiving <https://builds.apache.org/job/ctakes-trunk-package/ws/ctakes-lvg-res/pom.xml>
to org.apache.ctakes/ctakes-lvg-res/3.1.2-SNAPSHOT/ctakes-lvg-res-3.1.2-SNAPSHOT.pom
[JENKINS] Archiving <https://builds.apache.org/job/ctakes-trunk-package/ws/ctakes-lvg-res/target/ctakes-lvg-res-3.1.2-SNAPSHOT.jar>
to org.apache.ctakes/ctakes-lvg-res/3.1.2-SNAPSHOT/ctakes-lvg-res-3.1.2-SNAPSHOT.jar
[JENKINS] Archiving <https://builds.apache.org/job/ctakes-trunk-package/ws/ctakes-assertion-res/pom.xml>
to org.apache.ctakes/ctakes-assertion-res/3.1.2-SNAPSHOT/ctakes-assertion-res-3.1.2-SNAPSHOT.pom
[JENKINS] Archiving <https://builds.apache.org/job/ctakes-trunk-package/ws/ctakes-assertion-res/target/ctakes-assertion-res-3.1.2-SNAPSHOT.jar>
to org.apache.ctakes/ctakes-assertion-res/3.1.2-SNAPSHOT/ctakes-assertion-res-3.1.2-SNAPSHOT.jar
[JENKINS] Archiving <https://builds.apache.org/job/ctakes-trunk-package/ws/ctakes-dependency-parser-res/pom.xml>
to org.apache.ctakes/ctakes-dependency-parser-res/3.1.2-SNAPSHOT/ctakes-dependency-parser-res-3.1.2-SNAPSHOT.pom
[JENKINS] Archiving <https://builds.apache.org/job/ctakes-trunk-package/ws/ctakes-dependency-parser-res/target/ctakes-dependency-parser-res-3.1.2-SNAPSHOT.jar>
to org.apache.ctakes/ctakes-dependency-parser-res/3.1.2-SNAPSHOT/ctakes-dependency-parser-res-3.1.2-SNAPSHOT.jar
[JENKINS] Archiving <https://builds.apache.org/job/ctakes-trunk-package/ws/ctakes-assertion/pom.xml>
to org.apache.ctakes/ctakes-assertion/3.1.2-SNAPSHOT/ctakes-assertion-3.1.2-SNAPSHOT.pom
[JENKINS] Archiving <https://builds.apache.org/job/ctakes-trunk-package/ws/ctakes-assertion/target/ctakes-assertion-3.1.2-SNAPSHOT.jar>
to org.apache.ctakes/ctakes-assertion/3.1.2-SNAPSHOT/ctakes-assertion-3.1.2-SNAPSHOT.jar
[JENKINS] Archiving <https://builds.apache.org/job/ctakes-trunk-package/ws/ctakes-temporal-res/pom.xml>
to org.apache.ctakes/ctakes-temporal-res/3.1.2-SNAPSHOT/ctakes-temporal-res-3.1.2-SNAPSHOT.pom
[JENKINS] Archiving <https://builds.apache.org/job/ctakes-trunk-package/ws/ctakes-temporal-res/target/ctakes-temporal-res-3.1.2-SNAPSHOT.jar>
to org.apache.ctakes/ctakes-temporal-res/3.1.2-SNAPSHOT/ctakes-temporal-res-3.1.2-SNAPSHOT.jar
[JENKINS] Archiving <https://builds.apache.org/job/ctakes-trunk-package/ws/ctakes-relation-extractor-res/pom.xml>
to org.apache.ctakes/ctakes-relation-extractor-res/3.1.2-SNAPSHOT/ctakes-relation-extractor-res-3.1.2-SNAPSHOT.pom
[JENKINS] Archiving <https://builds.apache.org/job/ctakes-trunk-package/ws/ctakes-relation-extractor-res/target/ctakes-relation-extractor-res-3.1.2-SNAPSHOT.jar>
to org.apache.ctakes/ctakes-relation-extractor-res/3.1.2-SNAPSHOT/ctakes-relation-extractor-res-3.1.2-SNAPSHOT.jar
[JENKINS] Archiving <https://builds.apache.org/job/ctakes-trunk-package/ws/ctakes-pos-tagger/pom.xml>
to org.apache.ctakes/ctakes-pos-tagger/3.1.2-SNAPSHOT/ctakes-pos-tagger-3.1.2-SNAPSHOT.pom
[JENKINS] Archiving <https://builds.apache.org/job/ctakes-trunk-package/ws/ctakes-pos-tagger/target/ctakes-pos-tagger-3.1.2-SNAPSHOT.jar>
to org.apache.ctakes/ctakes-pos-tagger/3.1.2-SNAPSHOT/ctakes-pos-tagger-3.1.2-SNAPSHOT.jar
[JENKINS] Archiving <https://builds.apache.org/job/ctakes-trunk-package/ws/ctakes-relation-extractor/pom.xml>
to org.apache.ctakes/ctakes-relation-extractor/3.1.2-SNAPSHOT/ctakes-relation-extractor-3.1.2-SNAPSHOT.pom
[JENKINS] Archiving <https://builds.apache.org/job/ctakes-trunk-package/ws/ctakes-relation-extractor/target/ctakes-relation-extractor-3.1.2-SNAPSHOT.jar>
to org.apache.ctakes/ctakes-relation-extractor/3.1.2-SNAPSHOT/ctakes-relation-extractor-3.1.2-SNAPSHOT.jar
[JENKINS] Archiving <https://builds.apache.org/job/ctakes-trunk-package/ws/ctakes-ne-contexts-res/pom.xml>
to org.apache.ctakes/ctakes-ne-contexts-res/3.1.2-SNAPSHOT/ctakes-ne-contexts-res-3.1.2-SNAPSHOT.pom
[JENKINS] Archiving <https://builds.apache.org/job/ctakes-trunk-package/ws/ctakes-ne-contexts-res/target/ctakes-ne-contexts-res-3.1.2-SNAPSHOT.jar>
to org.apache.ctakes/ctakes-ne-contexts-res/3.1.2-SNAPSHOT/ctakes-ne-contexts-res-3.1.2-SNAPSHOT.jar
[JENKINS] Archiving <https://builds.apache.org/job/ctakes-trunk-package/ws/ctakes-constituency-parser/pom.xml>
to org.apache.ctakes/ctakes-constituency-parser/3.1.2-SNAPSHOT/ctakes-constituency-parser-3.1.2-SNAPSHOT.pom
[JENKINS] Archiving <https://builds.apache.org/job/ctakes-trunk-package/ws/ctakes-constituency-parser/target/ctakes-constituency-parser-3.1.2-SNAPSHOT.jar>
to org.apache.ctakes/ctakes-constituency-parser/3.1.2-SNAPSHOT/ctakes-constituency-parser-3.1.2-SNAPSHOT.jar
[JENKINS] Archiving <https://builds.apache.org/job/ctakes-trunk-package/ws/ctakes-assertion-zoner/pom.xml>
to org.apache.ctakes/ctakes-assertion-zoner/3.1.2-SNAPSHOT/ctakes-assertion-zoner-3.1.2-SNAPSHOT.pom
[JENKINS] Archiving <https://builds.apache.org/job/ctakes-trunk-package/ws/ctakes-assertion-zoner/target/ctakes-assertion-zoner-3.1.2-SNAPSHOT.jar>
to org.apache.ctakes/ctakes-assertion-zoner/3.1.2-SNAPSHOT/ctakes-assertion-zoner-3.1.2-SNAPSHOT.jar
[JENKINS] Archiving <https://builds.apache.org/job/ctakes-trunk-package/ws/ctakes-drug-ner-res/pom.xml>
to org.apache.ctakes/ctakes-drug-ner-res/3.1.2-SNAPSHOT/ctakes-drug-ner-res-3.1.2-SNAPSHOT.pom
[JENKINS] Archiving <https://builds.apache.org/job/ctakes-trunk-package/ws/ctakes-drug-ner-res/target/ctakes-drug-ner-res-3.1.2-SNAPSHOT.jar>
to org.apache.ctakes/ctakes-drug-ner-res/3.1.2-SNAPSHOT/ctakes-drug-ner-res-3.1.2-SNAPSHOT.jar
[JENKINS] Archiving <https://builds.apache.org/job/ctakes-trunk-package/ws/ctakes-pos-tagger-res/pom.xml>
to org.apache.ctakes/ctakes-pos-tagger-res/3.1.2-SNAPSHOT/ctakes-pos-tagger-res-3.1.2-SNAPSHOT.pom
[JENKINS] Archiving <https://builds.apache.org/job/ctakes-trunk-package/ws/ctakes-pos-tagger-res/target/ctakes-pos-tagger-res-3.1.2-SNAPSHOT.jar>
to org.apache.ctakes/ctakes-pos-tagger-res/3.1.2-SNAPSHOT/ctakes-pos-tagger-res-3.1.2-SNAPSHOT.jar
[JENKINS] Archiving <https://builds.apache.org/job/ctakes-trunk-package/ws/ctakes-chunker-res/pom.xml>
to org.apache.ctakes/ctakes-chunker-res/3.1.2-SNAPSHOT/ctakes-chunker-res-3.1.2-SNAPSHOT.pom
[JENKINS] Archiving <https://builds.apache.org/job/ctakes-trunk-package/ws/ctakes-chunker-res/target/ctakes-chunker-res-3.1.2-SNAPSHOT.jar>
to org.apache.ctakes/ctakes-chunker-res/3.1.2-SNAPSHOT/ctakes-chunker-res-3.1.2-SNAPSHOT.jar
[JENKINS] Archiving <https://builds.apache.org/job/ctakes-trunk-package/ws/ctakes-template-filler/pom.xml>
to org.apache.ctakes/ctakes-template-filler/3.1.2-SNAPSHOT/ctakes-template-filler-3.1.2-SNAPSHOT.pom
[JENKINS] Archiving <https://builds.apache.org/job/ctakes-trunk-package/ws/ctakes-template-filler/target/ctakes-template-filler-3.1.2-SNAPSHOT.jar>
to org.apache.ctakes/ctakes-template-filler/3.1.2-SNAPSHOT/ctakes-template-filler-3.1.2-SNAPSHOT.jar
[JENKINS] Archiving <https://builds.apache.org/job/ctakes-trunk-package/ws/ctakes-pad-term-spotter/pom.xml>
to org.apache.ctakes/ctakes-pad-term-spotter/3.1.2-SNAPSHOT/ctakes-pad-term-spotter-3.1.2-SNAPSHOT.pom
[JENKINS] Archiving <https://builds.apache.org/job/ctakes-trunk-package/ws/ctakes-pad-term-spotter/target/ctakes-pad-term-spotter-3.1.2-SNAPSHOT.jar>
to org.apache.ctakes/ctakes-pad-term-spotter/3.1.2-SNAPSHOT/ctakes-pad-term-spotter-3.1.2-SNAPSHOT.jar
[JENKINS] Archiving <https://builds.apache.org/job/ctakes-trunk-package/ws/ctakes-type-system/pom.xml>
to org.apache.ctakes/ctakes-type-system/3.1.2-SNAPSHOT/ctakes-type-system-3.1.2-SNAPSHOT.pom
[JENKINS] Archiving <https://builds.apache.org/job/ctakes-trunk-package/ws/ctakes-type-system/target/ctakes-type-system-3.1.2-SNAPSHOT.jar>
to org.apache.ctakes/ctakes-type-system/3.1.2-SNAPSHOT/ctakes-type-system-3.1.2-SNAPSHOT.jar
[JENKINS] Archiving <https://builds.apache.org/job/ctakes-trunk-package/ws/ctakes-side-effect/pom.xml>
to org.apache.ctakes/ctakes-side-effect/3.1.2-SNAPSHOT/ctakes-side-effect-3.1.2-SNAPSHOT.pom
[JENKINS] Archiving <https://builds.apache.org/job/ctakes-trunk-package/ws/ctakes-side-effect/target/ctakes-side-effect-3.1.2-SNAPSHOT.jar>
to org.apache.ctakes/ctakes-side-effect/3.1.2-SNAPSHOT/ctakes-side-effect-3.1.2-SNAPSHOT.jar
[JENKINS] Archiving <https://builds.apache.org/job/ctakes-trunk-package/ws/ctakes-context-tokenizer/pom.xml>
to org.apache.ctakes/ctakes-context-tokenizer/3.1.2-SNAPSHOT/ctakes-context-tokenizer-3.1.2-SNAPSHOT.pom
[JENKINS] Archiving <https://builds.apache.org/job/ctakes-trunk-package/ws/ctakes-context-tokenizer/target/ctakes-context-tokenizer-3.1.2-SNAPSHOT.jar>
to org.apache.ctakes/ctakes-context-tokenizer/3.1.2-SNAPSHOT/ctakes-context-tokenizer-3.1.2-SNAPSHOT.jar
channel stopped
No artifacts are recorded for moduleorg.apache.ctakes:ctakes. Is this a Maven project?
No artifacts are recorded for moduleorg.apache.ctakes:ctakes-distribution. Is this a Maven
project?
Maven RedeployPublisher use remote ubuntu6 maven settings from : /home/jenkins/.m2/settings.xml
[INFO] Deployment in https://repository.apache.org/content/repositories/snapshots (id=apache.snapshots.https,uniqueVersion=true)
Deploying the main artifact jenkins-6395727169570752389ctakes-assertion-3.1.2-SNAPSHOT.jar
Downloading: https://repository.apache.org/content/repositories/snapshots/org/apache/ctakes/ctakes-assertion/3.1.2-SNAPSHOT/maven-metadata.xml
Downloaded: https://repository.apache.org/content/repositories/snapshots/org/apache/ctakes/ctakes-assertion/3.1.2-SNAPSHOT/maven-metadata.xml
(783 B at 0.7 KB/sec)
Uploading: https://repository.apache.org/content/repositories/snapshots/org/apache/ctakes/ctakes-assertion/3.1.2-SNAPSHOT/ctakes-assertion-3.1.2-20131204.194821-7.jar
Uploaded: https://repository.apache.org/content/repositories/snapshots/org/apache/ctakes/ctakes-assertion/3.1.2-SNAPSHOT/ctakes-assertion-3.1.2-20131204.194821-7.jar
(287 KB at 768.9 KB/sec)
Uploading: https://repository.apache.org/content/repositories/snapshots/org/apache/ctakes/ctakes-assertion/3.1.2-SNAPSHOT/ctakes-assertion-3.1.2-20131204.194821-7.pom
Uploaded: https://repository.apache.org/content/repositories/snapshots/org/apache/ctakes/ctakes-assertion/3.1.2-SNAPSHOT/ctakes-assertion-3.1.2-20131204.194821-7.pom
(7 KB at 116.3 KB/sec)
Downloading: https://repository.apache.org/content/repositories/snapshots/org/apache/ctakes/ctakes-assertion/maven-metadata.xml
Downloaded: https://repository.apache.org/content/repositories/snapshots/org/apache/ctakes/ctakes-assertion/maven-metadata.xml
(393 B at 0.1 KB/sec)
Uploading: https://repository.apache.org/content/repositories/snapshots/org/apache/ctakes/ctakes-assertion/3.1.2-SNAPSHOT/maven-metadata.xml
Uploaded: https://repository.apache.org/content/repositories/snapshots/org/apache/ctakes/ctakes-assertion/3.1.2-SNAPSHOT/maven-metadata.xml
(783 B at 1.3 KB/sec)
Uploading: https://repository.apache.org/content/repositories/snapshots/org/apache/ctakes/ctakes-assertion/maven-metadata.xml
Uploaded: https://repository.apache.org/content/repositories/snapshots/org/apache/ctakes/ctakes-assertion/maven-metadata.xml
(393 B at 1.4 KB/sec)
[INFO] Deployment in https://repository.apache.org/content/repositories/snapshots (id=apache.snapshots.https,uniqueVersion=true)
Deploying the main artifact jenkins-8657953248592127869ctakes-assertion-res-3.1.2-SNAPSHOT.jar
Downloading: https://repository.apache.org/content/repositories/snapshots/org/apache/ctakes/ctakes-assertion-res/3.1.2-SNAPSHOT/maven-metadata.xml
Downloaded: https://repository.apache.org/content/repositories/snapshots/org/apache/ctakes/ctakes-assertion-res/3.1.2-SNAPSHOT/maven-metadata.xml
(787 B at 0.2 KB/sec)
Uploading: https://repository.apache.org/content/repositories/snapshots/org/apache/ctakes/ctakes-assertion-res/3.1.2-SNAPSHOT/ctakes-assertion-res-3.1.2-20131204.194906-7.jar
Uploaded: https://repository.apache.org/content/repositories/snapshots/org/apache/ctakes/ctakes-assertion-res/3.1.2-SNAPSHOT/ctakes-assertion-res-3.1.2-20131204.194906-7.jar
(8 KB at 108.6 KB/sec)
Uploading: https://repository.apache.org/content/repositories/snapshots/org/apache/ctakes/ctakes-assertion-res/3.1.2-SNAPSHOT/ctakes-assertion-res-3.1.2-20131204.194906-7.pom
Uploaded: https://repository.apache.org/content/repositories/snapshots/org/apache/ctakes/ctakes-assertion-res/3.1.2-SNAPSHOT/ctakes-assertion-res-3.1.2-20131204.194906-7.pom
(2 KB at 1.5 KB/sec)
Downloading: https://repository.apache.org/content/repositories/snapshots/org/apache/ctakes/ctakes-assertion-res/maven-metadata.xml
Downloaded: https://repository.apache.org/content/repositories/snapshots/org/apache/ctakes/ctakes-assertion-res/maven-metadata.xml
(397 B at 0.1 KB/sec)
Uploading: https://repository.apache.org/content/repositories/snapshots/org/apache/ctakes/ctakes-assertion-res/3.1.2-SNAPSHOT/maven-metadata.xml
Uploaded: https://repository.apache.org/content/repositories/snapshots/org/apache/ctakes/ctakes-assertion-res/3.1.2-SNAPSHOT/maven-metadata.xml
(787 B at 1.5 KB/sec)
Uploading: https://repository.apache.org/content/repositories/snapshots/org/apache/ctakes/ctakes-assertion-res/maven-metadata.xml
Uploaded: https://repository.apache.org/content/repositories/snapshots/org/apache/ctakes/ctakes-assertion-res/maven-metadata.xml
(397 B at 4.2 KB/sec)
[INFO] Deployment in https://repository.apache.org/content/repositories/snapshots (id=apache.snapshots.https,uniqueVersion=true)
Deploying the main artifact jenkins-3603283412414613369ctakes-assertion-zoner-3.1.2-SNAPSHOT.jar
Downloading: https://repository.apache.org/content/repositories/snapshots/org/apache/ctakes/ctakes-assertion-zoner/3.1.2-SNAPSHOT/maven-metadata.xml
Downloaded: https://repository.apache.org/content/repositories/snapshots/org/apache/ctakes/ctakes-assertion-zoner/3.1.2-SNAPSHOT/maven-metadata.xml
(789 B at 0.1 KB/sec)
Uploading: https://repository.apache.org/content/repositories/snapshots/org/apache/ctakes/ctakes-assertion-zoner/3.1.2-SNAPSHOT/ctakes-assertion-zoner-3.1.2-20131204.194935-7.jar
Uploaded: https://repository.apache.org/content/repositories/snapshots/org/apache/ctakes/ctakes-assertion-zoner/3.1.2-SNAPSHOT/ctakes-assertion-zoner-3.1.2-20131204.194935-7.jar
(30 KB at 495.9 KB/sec)
Uploading: https://repository.apache.org/content/repositories/snapshots/org/apache/ctakes/ctakes-assertion-zoner/3.1.2-SNAPSHOT/ctakes-assertion-zoner-3.1.2-20131204.194935-7.pom
Uploaded: https://repository.apache.org/content/repositories/snapshots/org/apache/ctakes/ctakes-assertion-zoner/3.1.2-SNAPSHOT/ctakes-assertion-zoner-3.1.2-20131204.194935-7.pom
(3 KB at 47.2 KB/sec)
Downloading: https://repository.apache.org/content/repositories/snapshots/org/apache/ctakes/ctakes-assertion-zoner/maven-metadata.xml
Downloaded: https://repository.apache.org/content/repositories/snapshots/org/apache/ctakes/ctakes-assertion-zoner/maven-metadata.xml
(399 B at 0.4 KB/sec)
Uploading: https://repository.apache.org/content/repositories/snapshots/org/apache/ctakes/ctakes-assertion-zoner/3.1.2-SNAPSHOT/maven-metadata.xml
Uploaded: https://repository.apache.org/content/repositories/snapshots/org/apache/ctakes/ctakes-assertion-zoner/3.1.2-SNAPSHOT/maven-metadata.xml
(789 B at 2.0 KB/sec)
Uploading: https://repository.apache.org/content/repositories/snapshots/org/apache/ctakes/ctakes-assertion-zoner/maven-metadata.xml
Uploaded: https://repository.apache.org/content/repositories/snapshots/org/apache/ctakes/ctakes-assertion-zoner/maven-metadata.xml
(399 B at 3.1 KB/sec)
[INFO] Deployment in https://repository.apache.org/content/repositories/snapshots (id=apache.snapshots.https,uniqueVersion=true)
Deploying the main artifact jenkins-1979966844765021182ctakes-assertion-zoner-res-3.1.2-SNAPSHOT.jar
Downloading: https://repository.apache.org/content/repositories/snapshots/org/apache/ctakes/ctakes-assertion-zoner-res/3.1.2-SNAPSHOT/maven-metadata.xml
Downloaded: https://repository.apache.org/content/repositories/snapshots/org/apache/ctakes/ctakes-assertion-zoner-res/3.1.2-SNAPSHOT/maven-metadata.xml
(793 B at 0.4 KB/sec)
Uploading: https://repository.apache.org/content/repositories/snapshots/org/apache/ctakes/ctakes-assertion-zoner-res/3.1.2-SNAPSHOT/ctakes-assertion-zoner-res-3.1.2-20131204.194947-6.jar
Uploaded: https://repository.apache.org/content/repositories/snapshots/org/apache/ctakes/ctakes-assertion-zoner-res/3.1.2-SNAPSHOT/ctakes-assertion-zoner-res-3.1.2-20131204.194947-6.jar
(8 KB at 134.6 KB/sec)
Uploading: https://repository.apache.org/content/repositories/snapshots/org/apache/ctakes/ctakes-assertion-zoner-res/3.1.2-SNAPSHOT/ctakes-assertion-zoner-res-3.1.2-20131204.194947-6.pom
Uploaded: https://repository.apache.org/content/repositories/snapshots/org/apache/ctakes/ctakes-assertion-zoner-res/3.1.2-SNAPSHOT/ctakes-assertion-zoner-res-3.1.2-20131204.194947-6.pom
(2 KB at 25.5 KB/sec)
Downloading: https://repository.apache.org/content/repositories/snapshots/org/apache/ctakes/ctakes-assertion-zoner-res/maven-metadata.xml
Downloaded: https://repository.apache.org/content/repositories/snapshots/org/apache/ctakes/ctakes-assertion-zoner-res/maven-metadata.xml
(403 B at 1.0 KB/sec)
Uploading: https://repository.apache.org/content/repositories/snapshots/org/apache/ctakes/ctakes-assertion-zoner-res/3.1.2-SNAPSHOT/maven-metadata.xml
Uploaded: https://repository.apache.org/content/repositories/snapshots/org/apache/ctakes/ctakes-assertion-zoner-res/3.1.2-SNAPSHOT/maven-metadata.xml
(793 B at 0.2 KB/sec)
Uploading: https://repository.apache.org/content/repositories/snapshots/org/apache/ctakes/ctakes-assertion-zoner-res/maven-metadata.xml
Uploaded: https://repository.apache.org/content/repositories/snapshots/org/apache/ctakes/ctakes-assertion-zoner-res/maven-metadata.xml
(403 B at 4.9 KB/sec)
[INFO] Deployment in https://repository.apache.org/content/repositories/snapshots (id=apache.snapshots.https,uniqueVersion=true)
Deploying the main artifact jenkins-856430134582563058ctakes-chunker-3.1.2-SNAPSHOT.jar
Downloading: https://repository.apache.org/content/repositories/snapshots/org/apache/ctakes/ctakes-chunker/3.1.2-SNAPSHOT/maven-metadata.xml
Downloaded: https://repository.apache.org/content/repositories/snapshots/org/apache/ctakes/ctakes-chunker/3.1.2-SNAPSHOT/maven-metadata.xml
(781 B at 0.2 KB/sec)
Uploading: https://repository.apache.org/content/repositories/snapshots/org/apache/ctakes/ctakes-chunker/3.1.2-SNAPSHOT/ctakes-chunker-3.1.2-20131204.195006-6.jar
Uploaded: https://repository.apache.org/content/repositories/snapshots/org/apache/ctakes/ctakes-chunker/3.1.2-SNAPSHOT/ctakes-chunker-3.1.2-20131204.195006-6.jar
(17 KB at 261.4 KB/sec)
Uploading: https://repository.apache.org/content/repositories/snapshots/org/apache/ctakes/ctakes-chunker/3.1.2-SNAPSHOT/ctakes-chunker-3.1.2-20131204.195006-6.pom
Uploaded: https://repository.apache.org/content/repositories/snapshots/org/apache/ctakes/ctakes-chunker/3.1.2-SNAPSHOT/ctakes-chunker-3.1.2-20131204.195006-6.pom
(3 KB at 49.0 KB/sec)
Downloading: https://repository.apache.org/content/repositories/snapshots/org/apache/ctakes/ctakes-chunker/maven-metadata.xml
Downloaded: https://repository.apache.org/content/repositories/snapshots/org/apache/ctakes/ctakes-chunker/maven-metadata.xml
(391 B at 3.1 KB/sec)
Uploading: https://repository.apache.org/content/repositories/snapshots/org/apache/ctakes/ctakes-chunker/3.1.2-SNAPSHOT/maven-metadata.xml
Uploading: https://repository.apache.org/content/repositories/snapshots/org/apache/ctakes/ctakes-chunker/maven-metadata.xml
Uploaded: https://repository.apache.org/content/repositories/snapshots/org/apache/ctakes/ctakes-chunker/maven-metadata.xml
(391 B at 0.4 KB/sec)
ERROR: Failed to deploy metadata: Could not transfer metadata org.apache.ctakes:ctakes-chunker:3.1.2-SNAPSHOT/maven-metadata.xml
from/to apache.snapshots.https (https://repository.apache.org/content/repositories/snapshots):
The target server failed to respond
org.apache.maven.artifact.deployer.ArtifactDeploymentException: Failed to deploy metadata:
Could not transfer metadata org.apache.ctakes:ctakes-chunker:3.1.2-SNAPSHOT/maven-metadata.xml
from/to apache.snapshots.https (https://repository.apache.org/content/repositories/snapshots):
The target server failed to respond
	at org.apache.maven.artifact.deployer.DefaultArtifactDeployer.deploy(DefaultArtifactDeployer.java:143)
	at hudson.maven.reporters.MavenArtifactRecord.deploy(MavenArtifactRecord.java:191)
	at hudson.maven.RedeployPublisher.perform(RedeployPublisher.java:176)
	at hudson.tasks.BuildStepMonitor$1.perform(BuildStepMonitor.java:20)
	at hudson.model.AbstractBuild$AbstractBuildExecution.perform(AbstractBuild.java:785)
	at hudson.model.AbstractBuild$AbstractBuildExecution.performAllBuildSteps(AbstractBuild.java:757)
	at hudson.maven.MavenModuleSetBuild$MavenModuleSetBuildExecution.post2(MavenModuleSetBuild.java:1020)
	at hudson.model.AbstractBuild$AbstractBuildExecution.post(AbstractBuild.java:706)
	at hudson.model.Run.execute(Run.java:1702)
	at hudson.maven.MavenModuleSetBuild.run(MavenModuleSetBuild.java:509)
	at hudson.model.ResourceController.execute(ResourceController.java:88)
	at hudson.model.Executor.run(Executor.java:231)
Caused by: org.eclipse.aether.deployment.DeploymentException: Failed to deploy metadata: Could
not transfer metadata org.apache.ctakes:ctakes-chunker:3.1.2-SNAPSHOT/maven-metadata.xml from/to
apache.snapshots.https (https://repository.apache.org/content/repositories/snapshots): The
target server failed to respond
	at org.eclipse.aether.internal.impl.DefaultDeployer.deploy(DefaultDeployer.java:372)
	at org.eclipse.aether.internal.impl.DefaultDeployer.deploy(DefaultDeployer.java:269)
	at org.eclipse.aether.internal.impl.DefaultRepositorySystem.deploy(DefaultRepositorySystem.java:413)
	at org.apache.maven.artifact.deployer.DefaultArtifactDeployer.deploy(DefaultArtifactDeployer.java:139)
	... 11 more
Caused by: org.eclipse.aether.transfer.MetadataTransferException: Could not transfer metadata
org.apache.ctakes:ctakes-chunker:3.1.2-SNAPSHOT/maven-metadata.xml from/to apache.snapshots.https
(https://repository.apache.org/content/repositories/snapshots): The target server failed to
respond
	at org.eclipse.aether.connector.wagon.WagonRepositoryConnector$5.wrap(WagonRepositoryConnector.java:995)
	at org.eclipse.aether.connector.wagon.WagonRepositoryConnector$5.wrap(WagonRepositoryConnector.java:983)
	at org.eclipse.aether.connector.wagon.WagonRepositoryConnector$PutTask.run(WagonRepositoryConnector.java:895)
	at org.eclipse.aether.connector.wagon.WagonRepositoryConnector.put(WagonRepositoryConnector.java:530)
	at org.eclipse.aether.internal.impl.DefaultDeployer.deploy(DefaultDeployer.java:366)
	... 14 more
Caused by: org.apache.maven.wagon.TransferFailedException: The target server failed to respond
	at org.apache.maven.wagon.shared.http4.AbstractHttpClientWagon.put(AbstractHttpClientWagon.java:580)
	at org.apache.maven.wagon.shared.http4.AbstractHttpClientWagon.put(AbstractHttpClientWagon.java:524)
	at org.apache.maven.wagon.shared.http4.AbstractHttpClientWagon.put(AbstractHttpClientWagon.java:505)
	at org.apache.maven.wagon.shared.http4.AbstractHttpClientWagon.put(AbstractHttpClientWagon.java:485)
	at org.eclipse.aether.connector.wagon.WagonRepositoryConnector$PutTask.run(WagonRepositoryConnector.java:871)
	... 16 more
Caused by: org.apache.http.NoHttpResponseException: The target server failed to respond
	at org.apache.http.impl.conn.DefaultHttpResponseParser.parseHead(DefaultHttpResponseParser.java:95)
	at org.apache.http.impl.conn.DefaultHttpResponseParser.parseHead(DefaultHttpResponseParser.java:62)
	at org.apache.http.impl.io.AbstractMessageParser.parse(AbstractMessageParser.java:254)
	at org.apache.http.impl.AbstractHttpClientConnection.receiveResponseHeader(AbstractHttpClientConnection.java:289)
	at org.apache.http.impl.conn.DefaultClientConnection.receiveResponseHeader(DefaultClientConnection.java:252)
	at org.apache.http.impl.conn.ManagedClientConnectionImpl.receiveResponseHeader(ManagedClientConnectionImpl.java:191)
	at org.apache.http.protocol.HttpRequestExecutor.doReceiveResponse(HttpRequestExecutor.java:300)
	at org.apache.http.protocol.HttpRequestExecutor.execute(HttpRequestExecutor.java:127)
	at org.apache.http.impl.client.DefaultRequestDirector.tryExecute(DefaultRequestDirector.java:715)
	at org.apache.http.impl.client.DefaultRequestDirector.execute(DefaultRequestDirector.java:520)
	at org.apache.http.impl.client.AbstractHttpClient.execute(AbstractHttpClient.java:906)
	at org.apache.http.impl.client.AbstractHttpClient.execute(AbstractHttpClient.java:805)
	at org.apache.maven.wagon.shared.http4.AbstractHttpClientWagon.execute(AbstractHttpClientWagon.java:746)
	at org.apache.maven.wagon.shared.http4.AbstractHttpClientWagon.put(AbstractHttpClientWagon.java:574)
	... 20 more
[INFO] Deployment failed after 2 min 0 sec
Build step 'Deploy artifacts to Maven repository' changed build result to FAILURE

Mime
View raw message