ctakes-notifications mailing list archives

Site index · List index
Message view « Date » · « Thread »
Top « Date » · « Thread »
From Apache Jenkins Server <jenk...@builds.apache.org>
Subject Build failed in Jenkins: ctakes-trunk-package #201
Date Sat, 23 Nov 2013 15:39:23 GMT
See <https://builds.apache.org/job/ctakes-trunk-package/201/changes>

Changes:

[chenpei] CTAKES-269 - log4j.xml filenotfound.  copy sample log config from core to the distribution...

------------------------------------------
[...truncated 3524 lines...]
[INFO] Building jar: <https://builds.apache.org/job/ctakes-trunk-package/ws/ctakes-examples/target/ctakes-examples-3.1.2-SNAPSHOT.jar>
[INFO] 
[INFO] --- maven-site-plugin:3.1:attach-descriptor (attach-descriptor) @ ctakes-examples ---
[INFO] 
[INFO] --- maven-install-plugin:2.3.1:install (default-install) @ ctakes-examples ---
[INFO] Installing <https://builds.apache.org/job/ctakes-trunk-package/ws/ctakes-examples/target/ctakes-examples-3.1.2-SNAPSHOT.jar>
to /home/jenkins/jenkins-slave/maven-repositories/1/org/apache/ctakes/ctakes-examples/3.1.2-SNAPSHOT/ctakes-examples-3.1.2-SNAPSHOT.jar
[INFO] Installing <https://builds.apache.org/job/ctakes-trunk-package/ws/ctakes-examples/pom.xml>
to /home/jenkins/jenkins-slave/maven-repositories/1/org/apache/ctakes/ctakes-examples/3.1.2-SNAPSHOT/ctakes-examples-3.1.2-SNAPSHOT.pom
[INFO] ------------------------------------------------------------------------
[INFO] Reactor Summary:
[INFO] 
[INFO] Apache cTAKES common type system .................. SUCCESS [38.683s]
[INFO] Apache cTAKES utils ............................... SUCCESS [7.740s]
[INFO] Apache cTAKES Resources core ...................... SUCCESS [9.265s]
[INFO] Apache cTAKES core ................................ SUCCESS [10.116s]
[INFO] Apache cTAKES Resources pos-tagger ................ SUCCESS [9.909s]
[INFO] Apache cTAKES part-of-speech tagger ............... SUCCESS [9.011s]
[INFO] Apache cTAKES Resources ctakes-chunker-res ........ SUCCESS [5.263s]
[INFO] Apache cTAKES chunker ............................. SUCCESS [7.524s]
[INFO] Apache cTAKES document preprocessor ............... SUCCESS [8.997s]
[INFO] Apache cTAKES Resources dictionary-lookup ......... SUCCESS [4.568s]
[INFO] Apache cTAKES dictionary lookup ................... SUCCESS [19.487s]
[INFO] Apache cTAKES context dependent tokenizer ......... SUCCESS [11.143s]
[INFO] Apache cTAKES Resources lvg ....................... SUCCESS [14.522s]
[INFO] Apache cTAKES LVG lexical tools ................... SUCCESS [6.347s]
[INFO] Apache cTAKES Resources ne-contexts ............... SUCCESS [6.440s]
[INFO] Apache cTAKES named entity contexts ............... SUCCESS [9.232s]
[INFO] Apache cTAKES Resources constituency-parser ....... SUCCESS [5.273s]
[INFO] Apache cTAKES Constituency Parser ................. SUCCESS [8.675s]
[INFO] Apache cTAKES Resources coreference ............... SUCCESS [15.447s]
[INFO] Apache cTAKES Resources relation-extractor ........ SUCCESS [6.389s]
[INFO] Apache cTAKES Resources dependency-parser ......... SUCCESS [6.738s]
[INFO] Apache cTAKES Dependency Parser ................... SUCCESS [10.017s]
[INFO] Apache cTAKES Relation Extractor .................. SUCCESS [11.911s]
[INFO] Apache cTAKES CoReference Resolver ................ SUCCESS [8.677s]
[INFO] Apache cTAKES Resources drug-ner .................. SUCCESS [8.331s]
[INFO] Apache cTAKES Drug NER ............................ SUCCESS [8.827s]
[INFO] Apache cTAKES Resources side-effect ............... SUCCESS [5.056s]
[INFO] Apache cTAKES Side Effects ........................ SUCCESS [8.604s]
[INFO] Apache cTAKES Resources smoking-status ............ SUCCESS [8.258s]
[INFO] Apache cTAKES Smoking Status ...................... SUCCESS [9.721s]
[INFO] Apache cTAKES Resources pad-term-spotter-res ...... SUCCESS [6.116s]
[INFO] Apache cTAKES Pad Term Spotter .................... SUCCESS [13.384s]
[INFO] Apache cTAKES Resources assertion ................. SUCCESS [7.229s]
[INFO] Apache cTAKES Resources assertion-zoner ........... SUCCESS [6.056s]
[INFO] Apache cTAKES Assertion's zoner ................... SUCCESS [7.724s]
[INFO] Apache cTAKES Assertion ........................... SUCCESS [13.226s]
[INFO] Apache cTAKES Resources temporal .................. SUCCESS [7.712s]
[INFO] Apache cTAKES Temporal Information Extraction ..... SUCCESS [22.039s]
[INFO] Apache cTAKES ctakes-clinical-pipeline ............ SUCCESS [8.977s]
[INFO] Apache cTAKES Regression-test ..................... SUCCESS [10.231s]
[INFO] Apache cTAKES template filler ..................... SUCCESS [6.928s]
[INFO] ctakes-examples ................................... SUCCESS [2.359s]
[INFO] ------------------------------------------------------------------------
[INFO] BUILD SUCCESS
[INFO] ------------------------------------------------------------------------
[INFO] Total time: 2:46:51.793s
[INFO] Finished at: Sat Nov 23 15:37:45 UTC 2013
[INFO] Final Memory: 42M/131M
[INFO] ------------------------------------------------------------------------
Waiting for Jenkins to finish collecting data
[JENKINS] Archiving <https://builds.apache.org/job/ctakes-trunk-package/ws/ctakes-core/pom.xml>
to org.apache.ctakes/ctakes-core/3.1.2-SNAPSHOT/ctakes-core-3.1.2-SNAPSHOT.pom
[JENKINS] Archiving <https://builds.apache.org/job/ctakes-trunk-package/ws/ctakes-core/target/ctakes-core-3.1.2-SNAPSHOT.jar>
to org.apache.ctakes/ctakes-core/3.1.2-SNAPSHOT/ctakes-core-3.1.2-SNAPSHOT.jar
[JENKINS] Archiving <https://builds.apache.org/job/ctakes-trunk-package/ws/ctakes-coreference/pom.xml>
to org.apache.ctakes/ctakes-coreference/3.1.2-SNAPSHOT/ctakes-coreference-3.1.2-SNAPSHOT.pom
[JENKINS] Archiving <https://builds.apache.org/job/ctakes-trunk-package/ws/ctakes-coreference/target/ctakes-coreference-3.1.2-SNAPSHOT.jar>
to org.apache.ctakes/ctakes-coreference/3.1.2-SNAPSHOT/ctakes-coreference-3.1.2-SNAPSHOT.jar
[JENKINS] Archiving <https://builds.apache.org/job/ctakes-trunk-package/ws/ctakes-dependency-parser/pom.xml>
to org.apache.ctakes/ctakes-dependency-parser/3.1.2-SNAPSHOT/ctakes-dependency-parser-3.1.2-SNAPSHOT.pom
[JENKINS] Archiving <https://builds.apache.org/job/ctakes-trunk-package/ws/ctakes-dependency-parser/target/ctakes-dependency-parser-3.1.2-SNAPSHOT.jar>
to org.apache.ctakes/ctakes-dependency-parser/3.1.2-SNAPSHOT/ctakes-dependency-parser-3.1.2-SNAPSHOT.jar
[JENKINS] Archiving <https://builds.apache.org/job/ctakes-trunk-package/ws/ctakes-regression-test/pom.xml>
to org.apache.ctakes/ctakes-regression-test/3.1.2-SNAPSHOT/ctakes-regression-test-3.1.2-SNAPSHOT.pom
[JENKINS] Archiving <https://builds.apache.org/job/ctakes-trunk-package/ws/ctakes-regression-test/target/ctakes-regression-test-3.1.2-SNAPSHOT.jar>
to org.apache.ctakes/ctakes-regression-test/3.1.2-SNAPSHOT/ctakes-regression-test-3.1.2-SNAPSHOT.jar
[JENKINS] Archiving <https://builds.apache.org/job/ctakes-trunk-package/ws/ctakes-dictionary-lookup-res/pom.xml>
to org.apache.ctakes/ctakes-dictionary-lookup-res/3.1.2-SNAPSHOT/ctakes-dictionary-lookup-res-3.1.2-SNAPSHOT.pom
[JENKINS] Archiving <https://builds.apache.org/job/ctakes-trunk-package/ws/ctakes-dictionary-lookup-res/target/ctakes-dictionary-lookup-res-3.1.2-SNAPSHOT.jar>
to org.apache.ctakes/ctakes-dictionary-lookup-res/3.1.2-SNAPSHOT/ctakes-dictionary-lookup-res-3.1.2-SNAPSHOT.jar
[JENKINS] Archiving <https://builds.apache.org/job/ctakes-trunk-package/ws/ctakes-ne-contexts/pom.xml>
to org.apache.ctakes/ctakes-ne-contexts/3.1.2-SNAPSHOT/ctakes-ne-contexts-3.1.2-SNAPSHOT.pom
[JENKINS] Archiving <https://builds.apache.org/job/ctakes-trunk-package/ws/ctakes-ne-contexts/target/ctakes-ne-contexts-3.1.2-SNAPSHOT.jar>
to org.apache.ctakes/ctakes-ne-contexts/3.1.2-SNAPSHOT/ctakes-ne-contexts-3.1.2-SNAPSHOT.jar
[JENKINS] Archiving <https://builds.apache.org/job/ctakes-trunk-package/ws/ctakes-drug-ner/pom.xml>
to org.apache.ctakes/ctakes-drug-ner/3.1.2-SNAPSHOT/ctakes-drug-ner-3.1.2-SNAPSHOT.pom
[JENKINS] Archiving <https://builds.apache.org/job/ctakes-trunk-package/ws/ctakes-drug-ner/target/ctakes-drug-ner-3.1.2-SNAPSHOT.jar>
to org.apache.ctakes/ctakes-drug-ner/3.1.2-SNAPSHOT/ctakes-drug-ner-3.1.2-SNAPSHOT.jar
[JENKINS] Archiving <https://builds.apache.org/job/ctakes-trunk-package/ws/ctakes-preprocessor/pom.xml>
to org.apache.ctakes/ctakes-preprocessor/3.1.2-SNAPSHOT/ctakes-preprocessor-3.1.2-SNAPSHOT.pom
[JENKINS] Archiving <https://builds.apache.org/job/ctakes-trunk-package/ws/ctakes-preprocessor/target/ctakes-preprocessor-3.1.2-SNAPSHOT.jar>
to org.apache.ctakes/ctakes-preprocessor/3.1.2-SNAPSHOT/ctakes-preprocessor-3.1.2-SNAPSHOT.jar
[JENKINS] Archiving <https://builds.apache.org/job/ctakes-trunk-package/ws/ctakes-smoking-status/pom.xml>
to org.apache.ctakes/ctakes-smoking-status/3.1.2-SNAPSHOT/ctakes-smoking-status-3.1.2-SNAPSHOT.pom
[JENKINS] Archiving <https://builds.apache.org/job/ctakes-trunk-package/ws/ctakes-smoking-status/target/ctakes-smoking-status-3.1.2-SNAPSHOT.jar>
to org.apache.ctakes/ctakes-smoking-status/3.1.2-SNAPSHOT/ctakes-smoking-status-3.1.2-SNAPSHOT.jar
[JENKINS] Archiving <https://builds.apache.org/job/ctakes-trunk-package/ws/ctakes-clinical-pipeline/pom.xml>
to org.apache.ctakes/ctakes-clinical-pipeline/3.1.2-SNAPSHOT/ctakes-clinical-pipeline-3.1.2-SNAPSHOT.pom
[JENKINS] Archiving <https://builds.apache.org/job/ctakes-trunk-package/ws/ctakes-clinical-pipeline/target/ctakes-clinical-pipeline-3.1.2-SNAPSHOT.jar>
to org.apache.ctakes/ctakes-clinical-pipeline/3.1.2-SNAPSHOT/ctakes-clinical-pipeline-3.1.2-SNAPSHOT.jar
[JENKINS] Archiving <https://builds.apache.org/job/ctakes-trunk-package/ws/ctakes-chunker/pom.xml>
to org.apache.ctakes/ctakes-chunker/3.1.2-SNAPSHOT/ctakes-chunker-3.1.2-SNAPSHOT.pom
[JENKINS] Archiving <https://builds.apache.org/job/ctakes-trunk-package/ws/ctakes-chunker/target/ctakes-chunker-3.1.2-SNAPSHOT.jar>
to org.apache.ctakes/ctakes-chunker/3.1.2-SNAPSHOT/ctakes-chunker-3.1.2-SNAPSHOT.jar
[JENKINS] Archiving <https://builds.apache.org/job/ctakes-trunk-package/ws/ctakes-temporal/pom.xml>
to org.apache.ctakes/ctakes-temporal/3.1.2-SNAPSHOT/ctakes-temporal-3.1.2-SNAPSHOT.pom
[JENKINS] Archiving <https://builds.apache.org/job/ctakes-trunk-package/ws/ctakes-temporal/target/ctakes-temporal-3.1.2-SNAPSHOT.jar>
to org.apache.ctakes/ctakes-temporal/3.1.2-SNAPSHOT/ctakes-temporal-3.1.2-SNAPSHOT.jar
[JENKINS] Archiving <https://builds.apache.org/job/ctakes-trunk-package/ws/ctakes-smoking-status-res/pom.xml>
to org.apache.ctakes/ctakes-smoking-status-res/3.1.2-SNAPSHOT/ctakes-smoking-status-res-3.1.2-SNAPSHOT.pom
[JENKINS] Archiving <https://builds.apache.org/job/ctakes-trunk-package/ws/ctakes-smoking-status-res/target/ctakes-smoking-status-res-3.1.2-SNAPSHOT.jar>
to org.apache.ctakes/ctakes-smoking-status-res/3.1.2-SNAPSHOT/ctakes-smoking-status-res-3.1.2-SNAPSHOT.jar
[JENKINS] Archiving <https://builds.apache.org/job/ctakes-trunk-package/ws/ctakes-coreference-res/pom.xml>
to org.apache.ctakes/ctakes-coreference-res/3.1.2-SNAPSHOT/ctakes-coreference-res-3.1.2-SNAPSHOT.pom
[JENKINS] Archiving <https://builds.apache.org/job/ctakes-trunk-package/ws/ctakes-coreference-res/target/ctakes-coreference-res-3.1.2-SNAPSHOT.jar>
to org.apache.ctakes/ctakes-coreference-res/3.1.2-SNAPSHOT/ctakes-coreference-res-3.1.2-SNAPSHOT.jar
[JENKINS] Archiving <https://builds.apache.org/job/ctakes-trunk-package/ws/ctakes-core-res/pom.xml>
to org.apache.ctakes/ctakes-core-res/3.1.2-SNAPSHOT/ctakes-core-res-3.1.2-SNAPSHOT.pom
[JENKINS] Archiving <https://builds.apache.org/job/ctakes-trunk-package/ws/ctakes-core-res/target/ctakes-core-res-3.1.2-SNAPSHOT.jar>
to org.apache.ctakes/ctakes-core-res/3.1.2-SNAPSHOT/ctakes-core-res-3.1.2-SNAPSHOT.jar
[JENKINS] Archiving <https://builds.apache.org/job/ctakes-trunk-package/ws/ctakes-dictionary-lookup/pom.xml>
to org.apache.ctakes/ctakes-dictionary-lookup/3.1.2-SNAPSHOT/ctakes-dictionary-lookup-3.1.2-SNAPSHOT.pom
[JENKINS] Archiving <https://builds.apache.org/job/ctakes-trunk-package/ws/ctakes-dictionary-lookup/target/ctakes-dictionary-lookup-3.1.2-SNAPSHOT.jar>
to org.apache.ctakes/ctakes-dictionary-lookup/3.1.2-SNAPSHOT/ctakes-dictionary-lookup-3.1.2-SNAPSHOT.jar
[JENKINS] Archiving <https://builds.apache.org/job/ctakes-trunk-package/ws/ctakes-assertion-zoner-res/pom.xml>
to org.apache.ctakes/ctakes-assertion-zoner-res/3.1.2-SNAPSHOT/ctakes-assertion-zoner-res-3.1.2-SNAPSHOT.pom
[JENKINS] Archiving <https://builds.apache.org/job/ctakes-trunk-package/ws/ctakes-assertion-zoner-res/target/ctakes-assertion-zoner-res-3.1.2-SNAPSHOT.jar>
to org.apache.ctakes/ctakes-assertion-zoner-res/3.1.2-SNAPSHOT/ctakes-assertion-zoner-res-3.1.2-SNAPSHOT.jar
[JENKINS] Archiving <https://builds.apache.org/job/ctakes-trunk-package/ws/ctakes-examples/pom.xml>
to org.apache.ctakes/ctakes-examples/3.1.2-SNAPSHOT/ctakes-examples-3.1.2-SNAPSHOT.pom
[JENKINS] Archiving <https://builds.apache.org/job/ctakes-trunk-package/ws/ctakes-examples/target/ctakes-examples-3.1.2-SNAPSHOT.jar>
to org.apache.ctakes/ctakes-examples/3.1.2-SNAPSHOT/ctakes-examples-3.1.2-SNAPSHOT.jar
[JENKINS] Archiving <https://builds.apache.org/job/ctakes-trunk-package/ws/ctakes-pad-term-spotter-res/pom.xml>
to org.apache.ctakes/ctakes-pad-term-spotter-res/3.1.2-SNAPSHOT/ctakes-pad-term-spotter-res-3.1.2-SNAPSHOT.pom
[JENKINS] Archiving <https://builds.apache.org/job/ctakes-trunk-package/ws/ctakes-pad-term-spotter-res/target/ctakes-pad-term-spotter-res-3.1.2-SNAPSHOT.jar>
to org.apache.ctakes/ctakes-pad-term-spotter-res/3.1.2-SNAPSHOT/ctakes-pad-term-spotter-res-3.1.2-SNAPSHOT.jar
[JENKINS] Archiving <https://builds.apache.org/job/ctakes-trunk-package/ws/ctakes-utils/pom.xml>
to org.apache.ctakes/ctakes-utils/3.1.2-SNAPSHOT/ctakes-utils-3.1.2-SNAPSHOT.pom
[JENKINS] Archiving <https://builds.apache.org/job/ctakes-trunk-package/ws/ctakes-utils/target/ctakes-utils-3.1.2-SNAPSHOT.jar>
to org.apache.ctakes/ctakes-utils/3.1.2-SNAPSHOT/ctakes-utils-3.1.2-SNAPSHOT.jar
[JENKINS] Archiving <https://builds.apache.org/job/ctakes-trunk-package/ws/ctakes-side-effect-res/pom.xml>
to org.apache.ctakes/ctakes-side-effect-res/3.1.2-SNAPSHOT/ctakes-side-effect-res-3.1.2-SNAPSHOT.pom
[JENKINS] Archiving <https://builds.apache.org/job/ctakes-trunk-package/ws/ctakes-side-effect-res/target/ctakes-side-effect-res-3.1.2-SNAPSHOT.jar>
to org.apache.ctakes/ctakes-side-effect-res/3.1.2-SNAPSHOT/ctakes-side-effect-res-3.1.2-SNAPSHOT.jar
[JENKINS] Archiving <https://builds.apache.org/job/ctakes-trunk-package/ws/ctakes-constituency-parser-res/pom.xml>
to org.apache.ctakes/ctakes-constituency-parser-res/3.1.2-SNAPSHOT/ctakes-constituency-parser-res-3.1.2-SNAPSHOT.pom
[JENKINS] Archiving <https://builds.apache.org/job/ctakes-trunk-package/ws/ctakes-constituency-parser-res/target/ctakes-constituency-parser-res-3.1.2-SNAPSHOT.jar>
to org.apache.ctakes/ctakes-constituency-parser-res/3.1.2-SNAPSHOT/ctakes-constituency-parser-res-3.1.2-SNAPSHOT.jar
[JENKINS] Archiving <https://builds.apache.org/job/ctakes-trunk-package/ws/ctakes-lvg/pom.xml>
to org.apache.ctakes/ctakes-lvg/3.1.2-SNAPSHOT/ctakes-lvg-3.1.2-SNAPSHOT.pom
[JENKINS] Archiving <https://builds.apache.org/job/ctakes-trunk-package/ws/ctakes-lvg/target/ctakes-lvg-3.1.2-SNAPSHOT.jar>
to org.apache.ctakes/ctakes-lvg/3.1.2-SNAPSHOT/ctakes-lvg-3.1.2-SNAPSHOT.jar
[JENKINS] Archiving <https://builds.apache.org/job/ctakes-trunk-package/ws/ctakes-lvg-res/pom.xml>
to org.apache.ctakes/ctakes-lvg-res/3.1.2-SNAPSHOT/ctakes-lvg-res-3.1.2-SNAPSHOT.pom
[JENKINS] Archiving <https://builds.apache.org/job/ctakes-trunk-package/ws/ctakes-lvg-res/target/ctakes-lvg-res-3.1.2-SNAPSHOT.jar>
to org.apache.ctakes/ctakes-lvg-res/3.1.2-SNAPSHOT/ctakes-lvg-res-3.1.2-SNAPSHOT.jar
[JENKINS] Archiving <https://builds.apache.org/job/ctakes-trunk-package/ws/ctakes-assertion-res/pom.xml>
to org.apache.ctakes/ctakes-assertion-res/3.1.2-SNAPSHOT/ctakes-assertion-res-3.1.2-SNAPSHOT.pom
[JENKINS] Archiving <https://builds.apache.org/job/ctakes-trunk-package/ws/ctakes-assertion-res/target/ctakes-assertion-res-3.1.2-SNAPSHOT.jar>
to org.apache.ctakes/ctakes-assertion-res/3.1.2-SNAPSHOT/ctakes-assertion-res-3.1.2-SNAPSHOT.jar
[JENKINS] Archiving <https://builds.apache.org/job/ctakes-trunk-package/ws/ctakes-dependency-parser-res/pom.xml>
to org.apache.ctakes/ctakes-dependency-parser-res/3.1.2-SNAPSHOT/ctakes-dependency-parser-res-3.1.2-SNAPSHOT.pom
[JENKINS] Archiving <https://builds.apache.org/job/ctakes-trunk-package/ws/ctakes-dependency-parser-res/target/ctakes-dependency-parser-res-3.1.2-SNAPSHOT.jar>
to org.apache.ctakes/ctakes-dependency-parser-res/3.1.2-SNAPSHOT/ctakes-dependency-parser-res-3.1.2-SNAPSHOT.jar
[JENKINS] Archiving <https://builds.apache.org/job/ctakes-trunk-package/ws/ctakes-assertion/pom.xml>
to org.apache.ctakes/ctakes-assertion/3.1.2-SNAPSHOT/ctakes-assertion-3.1.2-SNAPSHOT.pom
[JENKINS] Archiving <https://builds.apache.org/job/ctakes-trunk-package/ws/ctakes-assertion/target/ctakes-assertion-3.1.2-SNAPSHOT.jar>
to org.apache.ctakes/ctakes-assertion/3.1.2-SNAPSHOT/ctakes-assertion-3.1.2-SNAPSHOT.jar
[JENKINS] Archiving <https://builds.apache.org/job/ctakes-trunk-package/ws/ctakes-temporal-res/pom.xml>
to org.apache.ctakes/ctakes-temporal-res/3.1.2-SNAPSHOT/ctakes-temporal-res-3.1.2-SNAPSHOT.pom
[JENKINS] Archiving <https://builds.apache.org/job/ctakes-trunk-package/ws/ctakes-temporal-res/target/ctakes-temporal-res-3.1.2-SNAPSHOT.jar>
to org.apache.ctakes/ctakes-temporal-res/3.1.2-SNAPSHOT/ctakes-temporal-res-3.1.2-SNAPSHOT.jar
[JENKINS] Archiving <https://builds.apache.org/job/ctakes-trunk-package/ws/ctakes-relation-extractor-res/pom.xml>
to org.apache.ctakes/ctakes-relation-extractor-res/3.1.2-SNAPSHOT/ctakes-relation-extractor-res-3.1.2-SNAPSHOT.pom
[JENKINS] Archiving <https://builds.apache.org/job/ctakes-trunk-package/ws/ctakes-relation-extractor-res/target/ctakes-relation-extractor-res-3.1.2-SNAPSHOT.jar>
to org.apache.ctakes/ctakes-relation-extractor-res/3.1.2-SNAPSHOT/ctakes-relation-extractor-res-3.1.2-SNAPSHOT.jar
[JENKINS] Archiving <https://builds.apache.org/job/ctakes-trunk-package/ws/ctakes-pos-tagger/pom.xml>
to org.apache.ctakes/ctakes-pos-tagger/3.1.2-SNAPSHOT/ctakes-pos-tagger-3.1.2-SNAPSHOT.pom
[JENKINS] Archiving <https://builds.apache.org/job/ctakes-trunk-package/ws/ctakes-pos-tagger/target/ctakes-pos-tagger-3.1.2-SNAPSHOT.jar>
to org.apache.ctakes/ctakes-pos-tagger/3.1.2-SNAPSHOT/ctakes-pos-tagger-3.1.2-SNAPSHOT.jar
[JENKINS] Archiving <https://builds.apache.org/job/ctakes-trunk-package/ws/ctakes-relation-extractor/pom.xml>
to org.apache.ctakes/ctakes-relation-extractor/3.1.2-SNAPSHOT/ctakes-relation-extractor-3.1.2-SNAPSHOT.pom
[JENKINS] Archiving <https://builds.apache.org/job/ctakes-trunk-package/ws/ctakes-relation-extractor/target/ctakes-relation-extractor-3.1.2-SNAPSHOT.jar>
to org.apache.ctakes/ctakes-relation-extractor/3.1.2-SNAPSHOT/ctakes-relation-extractor-3.1.2-SNAPSHOT.jar
[JENKINS] Archiving <https://builds.apache.org/job/ctakes-trunk-package/ws/ctakes-ne-contexts-res/pom.xml>
to org.apache.ctakes/ctakes-ne-contexts-res/3.1.2-SNAPSHOT/ctakes-ne-contexts-res-3.1.2-SNAPSHOT.pom
[JENKINS] Archiving <https://builds.apache.org/job/ctakes-trunk-package/ws/ctakes-ne-contexts-res/target/ctakes-ne-contexts-res-3.1.2-SNAPSHOT.jar>
to org.apache.ctakes/ctakes-ne-contexts-res/3.1.2-SNAPSHOT/ctakes-ne-contexts-res-3.1.2-SNAPSHOT.jar
[JENKINS] Archiving <https://builds.apache.org/job/ctakes-trunk-package/ws/ctakes-constituency-parser/pom.xml>
to org.apache.ctakes/ctakes-constituency-parser/3.1.2-SNAPSHOT/ctakes-constituency-parser-3.1.2-SNAPSHOT.pom
[JENKINS] Archiving <https://builds.apache.org/job/ctakes-trunk-package/ws/ctakes-constituency-parser/target/ctakes-constituency-parser-3.1.2-SNAPSHOT.jar>
to org.apache.ctakes/ctakes-constituency-parser/3.1.2-SNAPSHOT/ctakes-constituency-parser-3.1.2-SNAPSHOT.jar
[JENKINS] Archiving <https://builds.apache.org/job/ctakes-trunk-package/ws/ctakes-assertion-zoner/pom.xml>
to org.apache.ctakes/ctakes-assertion-zoner/3.1.2-SNAPSHOT/ctakes-assertion-zoner-3.1.2-SNAPSHOT.pom
[JENKINS] Archiving <https://builds.apache.org/job/ctakes-trunk-package/ws/ctakes-assertion-zoner/target/ctakes-assertion-zoner-3.1.2-SNAPSHOT.jar>
to org.apache.ctakes/ctakes-assertion-zoner/3.1.2-SNAPSHOT/ctakes-assertion-zoner-3.1.2-SNAPSHOT.jar
[JENKINS] Archiving <https://builds.apache.org/job/ctakes-trunk-package/ws/ctakes-drug-ner-res/pom.xml>
to org.apache.ctakes/ctakes-drug-ner-res/3.1.2-SNAPSHOT/ctakes-drug-ner-res-3.1.2-SNAPSHOT.pom
[JENKINS] Archiving <https://builds.apache.org/job/ctakes-trunk-package/ws/ctakes-drug-ner-res/target/ctakes-drug-ner-res-3.1.2-SNAPSHOT.jar>
to org.apache.ctakes/ctakes-drug-ner-res/3.1.2-SNAPSHOT/ctakes-drug-ner-res-3.1.2-SNAPSHOT.jar
[JENKINS] Archiving <https://builds.apache.org/job/ctakes-trunk-package/ws/ctakes-pos-tagger-res/pom.xml>
to org.apache.ctakes/ctakes-pos-tagger-res/3.1.2-SNAPSHOT/ctakes-pos-tagger-res-3.1.2-SNAPSHOT.pom
[JENKINS] Archiving <https://builds.apache.org/job/ctakes-trunk-package/ws/ctakes-pos-tagger-res/target/ctakes-pos-tagger-res-3.1.2-SNAPSHOT.jar>
to org.apache.ctakes/ctakes-pos-tagger-res/3.1.2-SNAPSHOT/ctakes-pos-tagger-res-3.1.2-SNAPSHOT.jar
[JENKINS] Archiving <https://builds.apache.org/job/ctakes-trunk-package/ws/ctakes-chunker-res/pom.xml>
to org.apache.ctakes/ctakes-chunker-res/3.1.2-SNAPSHOT/ctakes-chunker-res-3.1.2-SNAPSHOT.pom
[JENKINS] Archiving <https://builds.apache.org/job/ctakes-trunk-package/ws/ctakes-chunker-res/target/ctakes-chunker-res-3.1.2-SNAPSHOT.jar>
to org.apache.ctakes/ctakes-chunker-res/3.1.2-SNAPSHOT/ctakes-chunker-res-3.1.2-SNAPSHOT.jar
[JENKINS] Archiving <https://builds.apache.org/job/ctakes-trunk-package/ws/ctakes-template-filler/pom.xml>
to org.apache.ctakes/ctakes-template-filler/3.1.2-SNAPSHOT/ctakes-template-filler-3.1.2-SNAPSHOT.pom
[JENKINS] Archiving <https://builds.apache.org/job/ctakes-trunk-package/ws/ctakes-template-filler/target/ctakes-template-filler-3.1.2-SNAPSHOT.jar>
to org.apache.ctakes/ctakes-template-filler/3.1.2-SNAPSHOT/ctakes-template-filler-3.1.2-SNAPSHOT.jar
[JENKINS] Archiving <https://builds.apache.org/job/ctakes-trunk-package/ws/ctakes-pad-term-spotter/pom.xml>
to org.apache.ctakes/ctakes-pad-term-spotter/3.1.2-SNAPSHOT/ctakes-pad-term-spotter-3.1.2-SNAPSHOT.pom
[JENKINS] Archiving <https://builds.apache.org/job/ctakes-trunk-package/ws/ctakes-pad-term-spotter/target/ctakes-pad-term-spotter-3.1.2-SNAPSHOT.jar>
to org.apache.ctakes/ctakes-pad-term-spotter/3.1.2-SNAPSHOT/ctakes-pad-term-spotter-3.1.2-SNAPSHOT.jar
[JENKINS] Archiving <https://builds.apache.org/job/ctakes-trunk-package/ws/ctakes-type-system/pom.xml>
to org.apache.ctakes/ctakes-type-system/3.1.2-SNAPSHOT/ctakes-type-system-3.1.2-SNAPSHOT.pom
[JENKINS] Archiving <https://builds.apache.org/job/ctakes-trunk-package/ws/ctakes-type-system/target/ctakes-type-system-3.1.2-SNAPSHOT.jar>
to org.apache.ctakes/ctakes-type-system/3.1.2-SNAPSHOT/ctakes-type-system-3.1.2-SNAPSHOT.jar
[JENKINS] Archiving <https://builds.apache.org/job/ctakes-trunk-package/ws/ctakes-side-effect/pom.xml>
to org.apache.ctakes/ctakes-side-effect/3.1.2-SNAPSHOT/ctakes-side-effect-3.1.2-SNAPSHOT.pom
[JENKINS] Archiving <https://builds.apache.org/job/ctakes-trunk-package/ws/ctakes-side-effect/target/ctakes-side-effect-3.1.2-SNAPSHOT.jar>
to org.apache.ctakes/ctakes-side-effect/3.1.2-SNAPSHOT/ctakes-side-effect-3.1.2-SNAPSHOT.jar
[JENKINS] Archiving <https://builds.apache.org/job/ctakes-trunk-package/ws/ctakes-context-tokenizer/pom.xml>
to org.apache.ctakes/ctakes-context-tokenizer/3.1.2-SNAPSHOT/ctakes-context-tokenizer-3.1.2-SNAPSHOT.pom
[JENKINS] Archiving <https://builds.apache.org/job/ctakes-trunk-package/ws/ctakes-context-tokenizer/target/ctakes-context-tokenizer-3.1.2-SNAPSHOT.jar>
to org.apache.ctakes/ctakes-context-tokenizer/3.1.2-SNAPSHOT/ctakes-context-tokenizer-3.1.2-SNAPSHOT.jar
channel stopped
No artifacts are recorded for moduleorg.apache.ctakes:ctakes. Is this a Maven project?
No artifacts are recorded for moduleorg.apache.ctakes:ctakes-distribution. Is this a Maven
project?
Maven RedeployPublisher use remote ubuntu1 maven settings from : /home/jenkins/.m2/settings.xml
[INFO] Deployment in https://repository.apache.org/content/repositories/snapshots (id=apache.snapshots.https,uniqueVersion=true)
Deploying the main artifact jenkins-7675670045668869591ctakes-assertion-3.1.2-SNAPSHOT.jar
Downloading: https://repository.apache.org/content/repositories/snapshots/org/apache/ctakes/ctakes-assertion/3.1.2-SNAPSHOT/maven-metadata.xml
Downloaded: https://repository.apache.org/content/repositories/snapshots/org/apache/ctakes/ctakes-assertion/3.1.2-SNAPSHOT/maven-metadata.xml
(783 B at 1.8 KB/sec)
Uploading: https://repository.apache.org/content/repositories/snapshots/org/apache/ctakes/ctakes-assertion/3.1.2-SNAPSHOT/ctakes-assertion-3.1.2-20131123.153857-2.jar
Uploaded: https://repository.apache.org/content/repositories/snapshots/org/apache/ctakes/ctakes-assertion/3.1.2-SNAPSHOT/ctakes-assertion-3.1.2-20131123.153857-2.jar
(283 KB at 3717.0 KB/sec)
Uploading: https://repository.apache.org/content/repositories/snapshots/org/apache/ctakes/ctakes-assertion/3.1.2-SNAPSHOT/ctakes-assertion-3.1.2-20131123.153857-2.pom
Uploaded: https://repository.apache.org/content/repositories/snapshots/org/apache/ctakes/ctakes-assertion/3.1.2-SNAPSHOT/ctakes-assertion-3.1.2-20131123.153857-2.pom
(7 KB at 136.9 KB/sec)
Downloading: https://repository.apache.org/content/repositories/snapshots/org/apache/ctakes/ctakes-assertion/maven-metadata.xml
Downloaded: https://repository.apache.org/content/repositories/snapshots/org/apache/ctakes/ctakes-assertion/maven-metadata.xml
(414 B at 0.6 KB/sec)
Uploading: https://repository.apache.org/content/repositories/snapshots/org/apache/ctakes/ctakes-assertion/3.1.2-SNAPSHOT/maven-metadata.xml
Uploaded: https://repository.apache.org/content/repositories/snapshots/org/apache/ctakes/ctakes-assertion/3.1.2-SNAPSHOT/maven-metadata.xml
(783 B at 9.7 KB/sec)
Uploading: https://repository.apache.org/content/repositories/snapshots/org/apache/ctakes/ctakes-assertion/maven-metadata.xml
Uploaded: https://repository.apache.org/content/repositories/snapshots/org/apache/ctakes/ctakes-assertion/maven-metadata.xml
(393 B at 4.7 KB/sec)
[INFO] Deployment in https://repository.apache.org/content/repositories/snapshots (id=apache.snapshots.https,uniqueVersion=true)
Deploying the main artifact jenkins-5030066770559800676ctakes-assertion-res-3.1.2-SNAPSHOT.jar
Downloading: https://repository.apache.org/content/repositories/snapshots/org/apache/ctakes/ctakes-assertion-res/3.1.2-SNAPSHOT/maven-metadata.xml
Downloaded: https://repository.apache.org/content/repositories/snapshots/org/apache/ctakes/ctakes-assertion-res/3.1.2-SNAPSHOT/maven-metadata.xml
(787 B at 3.8 KB/sec)
Uploading: https://repository.apache.org/content/repositories/snapshots/org/apache/ctakes/ctakes-assertion-res/3.1.2-SNAPSHOT/ctakes-assertion-res-3.1.2-20131123.153859-2.jar
Uploaded: https://repository.apache.org/content/repositories/snapshots/org/apache/ctakes/ctakes-assertion-res/3.1.2-SNAPSHOT/ctakes-assertion-res-3.1.2-20131123.153859-2.jar
(8 KB at 113.8 KB/sec)
Uploading: https://repository.apache.org/content/repositories/snapshots/org/apache/ctakes/ctakes-assertion-res/3.1.2-SNAPSHOT/ctakes-assertion-res-3.1.2-20131123.153859-2.pom
Uploaded: https://repository.apache.org/content/repositories/snapshots/org/apache/ctakes/ctakes-assertion-res/3.1.2-SNAPSHOT/ctakes-assertion-res-3.1.2-20131123.153859-2.pom
(2 KB at 31.4 KB/sec)
Downloading: https://repository.apache.org/content/repositories/snapshots/org/apache/ctakes/ctakes-assertion-res/maven-metadata.xml
Downloaded: https://repository.apache.org/content/repositories/snapshots/org/apache/ctakes/ctakes-assertion-res/maven-metadata.xml
(418 B at 2.7 KB/sec)
Uploading: https://repository.apache.org/content/repositories/snapshots/org/apache/ctakes/ctakes-assertion-res/3.1.2-SNAPSHOT/maven-metadata.xml
Uploaded: https://repository.apache.org/content/repositories/snapshots/org/apache/ctakes/ctakes-assertion-res/3.1.2-SNAPSHOT/maven-metadata.xml
(787 B at 9.7 KB/sec)
Uploading: https://repository.apache.org/content/repositories/snapshots/org/apache/ctakes/ctakes-assertion-res/maven-metadata.xml
Uploaded: https://repository.apache.org/content/repositories/snapshots/org/apache/ctakes/ctakes-assertion-res/maven-metadata.xml
(397 B at 5.3 KB/sec)
[INFO] Deployment in https://repository.apache.org/content/repositories/snapshots (id=apache.snapshots.https,uniqueVersion=true)
Deploying the main artifact jenkins-5781962985620439965ctakes-assertion-zoner-3.1.2-SNAPSHOT.jar
Downloading: https://repository.apache.org/content/repositories/snapshots/org/apache/ctakes/ctakes-assertion-zoner/3.1.2-SNAPSHOT/maven-metadata.xml
Downloaded: https://repository.apache.org/content/repositories/snapshots/org/apache/ctakes/ctakes-assertion-zoner/3.1.2-SNAPSHOT/maven-metadata.xml
(789 B at 3.1 KB/sec)
Uploading: https://repository.apache.org/content/repositories/snapshots/org/apache/ctakes/ctakes-assertion-zoner/3.1.2-SNAPSHOT/ctakes-assertion-zoner-3.1.2-20131123.153900-2.jar
Uploaded: https://repository.apache.org/content/repositories/snapshots/org/apache/ctakes/ctakes-assertion-zoner/3.1.2-SNAPSHOT/ctakes-assertion-zoner-3.1.2-20131123.153900-2.jar
(30 KB at 447.7 KB/sec)
Uploading: https://repository.apache.org/content/repositories/snapshots/org/apache/ctakes/ctakes-assertion-zoner/3.1.2-SNAPSHOT/ctakes-assertion-zoner-3.1.2-20131123.153900-2.pom
Uploaded: https://repository.apache.org/content/repositories/snapshots/org/apache/ctakes/ctakes-assertion-zoner/3.1.2-SNAPSHOT/ctakes-assertion-zoner-3.1.2-20131123.153900-2.pom
(3 KB at 45.3 KB/sec)
Downloading: https://repository.apache.org/content/repositories/snapshots/org/apache/ctakes/ctakes-assertion-zoner/maven-metadata.xml
Downloaded: https://repository.apache.org/content/repositories/snapshots/org/apache/ctakes/ctakes-assertion-zoner/maven-metadata.xml
(420 B at 2.1 KB/sec)
Uploading: https://repository.apache.org/content/repositories/snapshots/org/apache/ctakes/ctakes-assertion-zoner/3.1.2-SNAPSHOT/maven-metadata.xml
Uploaded: https://repository.apache.org/content/repositories/snapshots/org/apache/ctakes/ctakes-assertion-zoner/3.1.2-SNAPSHOT/maven-metadata.xml
(789 B at 9.9 KB/sec)
Uploading: https://repository.apache.org/content/repositories/snapshots/org/apache/ctakes/ctakes-assertion-zoner/maven-metadata.xml
Uploaded: https://repository.apache.org/content/repositories/snapshots/org/apache/ctakes/ctakes-assertion-zoner/maven-metadata.xml
(399 B at 3.8 KB/sec)
[INFO] Deployment in https://repository.apache.org/content/repositories/snapshots (id=apache.snapshots.https,uniqueVersion=true)
Deploying the main artifact jenkins-1909551942989179248ctakes-assertion-zoner-res-3.1.2-SNAPSHOT.jar
Downloading: https://repository.apache.org/content/repositories/snapshots/org/apache/ctakes/ctakes-assertion-zoner-res/3.1.2-SNAPSHOT/maven-metadata.xml
Downloaded: https://repository.apache.org/content/repositories/snapshots/org/apache/ctakes/ctakes-assertion-zoner-res/3.1.2-SNAPSHOT/maven-metadata.xml
(793 B at 4.5 KB/sec)
Uploading: https://repository.apache.org/content/repositories/snapshots/org/apache/ctakes/ctakes-assertion-zoner-res/3.1.2-SNAPSHOT/ctakes-assertion-zoner-res-3.1.2-20131123.153916-2.jar
Uploading: https://repository.apache.org/content/repositories/snapshots/org/apache/ctakes/ctakes-assertion-zoner-res/3.1.2-SNAPSHOT/ctakes-assertion-zoner-res-3.1.2-20131123.153916-2.pom
Uploaded: https://repository.apache.org/content/repositories/snapshots/org/apache/ctakes/ctakes-assertion-zoner-res/3.1.2-SNAPSHOT/ctakes-assertion-zoner-res-3.1.2-20131123.153916-2.pom
(2 KB at 3.3 KB/sec)
ERROR: Failed to deploy artifacts: Could not transfer artifact org.apache.ctakes:ctakes-assertion-zoner-res:jar:3.1.2-20131123.153916-2
from/to apache.snapshots.https (https://repository.apache.org/content/repositories/snapshots):
The target server failed to respond
org.apache.maven.artifact.deployer.ArtifactDeploymentException: Failed to deploy artifacts:
Could not transfer artifact org.apache.ctakes:ctakes-assertion-zoner-res:jar:3.1.2-20131123.153916-2
from/to apache.snapshots.https (https://repository.apache.org/content/repositories/snapshots):
The target server failed to respond
	at org.apache.maven.artifact.deployer.DefaultArtifactDeployer.deploy(DefaultArtifactDeployer.java:143)
	at hudson.maven.reporters.MavenArtifactRecord.deploy(MavenArtifactRecord.java:191)
	at hudson.maven.RedeployPublisher.perform(RedeployPublisher.java:176)
	at hudson.tasks.BuildStepMonitor$1.perform(BuildStepMonitor.java:20)
	at hudson.model.AbstractBuild$AbstractBuildExecution.perform(AbstractBuild.java:785)
	at hudson.model.AbstractBuild$AbstractBuildExecution.performAllBuildSteps(AbstractBuild.java:757)
	at hudson.maven.MavenModuleSetBuild$MavenModuleSetBuildExecution.post2(MavenModuleSetBuild.java:1020)
	at hudson.model.AbstractBuild$AbstractBuildExecution.post(AbstractBuild.java:706)
	at hudson.model.Run.execute(Run.java:1704)
	at hudson.maven.MavenModuleSetBuild.run(MavenModuleSetBuild.java:509)
	at hudson.model.ResourceController.execute(ResourceController.java:88)
	at hudson.model.Executor.run(Executor.java:230)
Caused by: org.eclipse.aether.deployment.DeploymentException: Failed to deploy artifacts:
Could not transfer artifact org.apache.ctakes:ctakes-assertion-zoner-res:jar:3.1.2-20131123.153916-2
from/to apache.snapshots.https (https://repository.apache.org/content/repositories/snapshots):
The target server failed to respond
	at org.eclipse.aether.internal.impl.DefaultDeployer.deploy(DefaultDeployer.java:341)
	at org.eclipse.aether.internal.impl.DefaultDeployer.deploy(DefaultDeployer.java:269)
	at org.eclipse.aether.internal.impl.DefaultRepositorySystem.deploy(DefaultRepositorySystem.java:413)
	at org.apache.maven.artifact.deployer.DefaultArtifactDeployer.deploy(DefaultArtifactDeployer.java:139)
	... 11 more
Caused by: org.eclipse.aether.transfer.ArtifactTransferException: Could not transfer artifact
org.apache.ctakes:ctakes-assertion-zoner-res:jar:3.1.2-20131123.153916-2 from/to apache.snapshots.https
(https://repository.apache.org/content/repositories/snapshots): The target server failed to
respond
	at org.eclipse.aether.connector.wagon.WagonRepositoryConnector$6.wrap(WagonRepositoryConnector.java:1016)
	at org.eclipse.aether.connector.wagon.WagonRepositoryConnector$6.wrap(WagonRepositoryConnector.java:1004)
	at org.eclipse.aether.connector.wagon.WagonRepositoryConnector$PutTask.run(WagonRepositoryConnector.java:895)
	at org.eclipse.aether.connector.wagon.WagonRepositoryConnector.put(WagonRepositoryConnector.java:522)
	at org.eclipse.aether.internal.impl.DefaultDeployer.deploy(DefaultDeployer.java:335)
	... 14 more
Caused by: org.apache.maven.wagon.TransferFailedException: The target server failed to respond
	at org.apache.maven.wagon.shared.http4.AbstractHttpClientWagon.put(AbstractHttpClientWagon.java:580)
	at org.apache.maven.wagon.shared.http4.AbstractHttpClientWagon.put(AbstractHttpClientWagon.java:524)
	at org.apache.maven.wagon.shared.http4.AbstractHttpClientWagon.put(AbstractHttpClientWagon.java:505)
	at org.apache.maven.wagon.shared.http4.AbstractHttpClientWagon.put(AbstractHttpClientWagon.java:485)
	at org.eclipse.aether.connector.wagon.WagonRepositoryConnector$PutTask.run(WagonRepositoryConnector.java:871)
	... 16 more
Caused by: org.apache.http.NoHttpResponseException: The target server failed to respond
	at org.apache.http.impl.conn.DefaultHttpResponseParser.parseHead(DefaultHttpResponseParser.java:95)
	at org.apache.http.impl.conn.DefaultHttpResponseParser.parseHead(DefaultHttpResponseParser.java:62)
	at org.apache.http.impl.io.AbstractMessageParser.parse(AbstractMessageParser.java:254)
	at org.apache.http.impl.AbstractHttpClientConnection.receiveResponseHeader(AbstractHttpClientConnection.java:289)
	at org.apache.http.impl.conn.DefaultClientConnection.receiveResponseHeader(DefaultClientConnection.java:252)
	at org.apache.http.impl.conn.ManagedClientConnectionImpl.receiveResponseHeader(ManagedClientConnectionImpl.java:191)
	at org.apache.http.protocol.HttpRequestExecutor.doReceiveResponse(HttpRequestExecutor.java:300)
	at org.apache.http.protocol.HttpRequestExecutor.execute(HttpRequestExecutor.java:127)
	at org.apache.http.impl.client.DefaultRequestDirector.tryExecute(DefaultRequestDirector.java:715)
	at org.apache.http.impl.client.DefaultRequestDirector.execute(DefaultRequestDirector.java:520)
	at org.apache.http.impl.client.AbstractHttpClient.execute(AbstractHttpClient.java:906)
	at org.apache.http.impl.client.AbstractHttpClient.execute(AbstractHttpClient.java:805)
	at org.apache.maven.wagon.shared.http4.AbstractHttpClientWagon.execute(AbstractHttpClientWagon.java:746)
	at org.apache.maven.wagon.shared.http4.AbstractHttpClientWagon.put(AbstractHttpClientWagon.java:574)
	... 20 more
[INFO] Deployment failed after 25 sec
Build step 'Deploy artifacts to Maven repository' changed build result to FAILURE

Mime
View raw message