ctakes-notifications mailing list archives

Site index · List index
Message view « Date » · « Thread »
Top « Date » · « Thread »
From Apache Jenkins Server <jenk...@builds.apache.org>
Subject Build failed in Jenkins: ctakes-trunk-compiletest #408
Date Wed, 28 Aug 2013 17:36:48 GMT
See <https://builds.apache.org/job/ctakes-trunk-compiletest/408/changes>

Changes:

[swu] stuff to get negation (annotation) tests running. a few changes in AssertionConst default
locations

------------------------------------------
[...truncated 6773 lines...]
Aug 28, 2013 5:32:16 PM org.apache.maven.cli.event.ExecutionEventLogger mojoStarted
INFO: 
Aug 28, 2013 5:32:16 PM org.apache.maven.cli.event.ExecutionEventLogger mojoStarted
INFO: --- maven-surefire-plugin:2.12:test (default-test) @ ctakes-assertion-zoner ---
[INFO] Surefire report directory: <https://builds.apache.org/job/ctakes-trunk-compiletest/ws/ctakes-assertion-zoner/target/surefire-reports>

-------------------------------------------------------
 T E S T S
-------------------------------------------------------

Results :

Tests run: 0, Failures: 0, Errors: 0, Skipped: 0

[JENKINS] Recording test results
Aug 28, 2013 5:32:34 PM org.apache.maven.cli.event.ExecutionEventLogger projectStarted
INFO:                                                                         
Aug 28, 2013 5:32:34 PM org.apache.maven.cli.event.ExecutionEventLogger projectStarted
INFO: ------------------------------------------------------------------------
Aug 28, 2013 5:32:34 PM org.apache.maven.cli.event.ExecutionEventLogger projectStarted
INFO: Building Apache cTAKES Assertion 3.1.0-SNAPSHOT
Aug 28, 2013 5:32:34 PM org.apache.maven.cli.event.ExecutionEventLogger projectStarted
INFO: ------------------------------------------------------------------------
Aug 28, 2013 5:32:34 PM org.apache.maven.cli.event.ExecutionEventLogger mojoStarted
INFO: 
Aug 28, 2013 5:32:34 PM org.apache.maven.cli.event.ExecutionEventLogger mojoStarted
INFO: --- maven-clean-plugin:2.4.1:clean (default-clean) @ ctakes-assertion ---
[INFO] Deleting <https://builds.apache.org/job/ctakes-trunk-compiletest/ws/ctakes-assertion/target>
Aug 28, 2013 5:32:35 PM org.apache.maven.cli.event.ExecutionEventLogger mojoStarted
INFO: 
Aug 28, 2013 5:32:35 PM org.apache.maven.cli.event.ExecutionEventLogger mojoStarted
INFO: --- maven-remote-resources-plugin:1.4:process (default) @ ctakes-assertion ---
Aug 28, 2013 5:32:35 PM org.apache.maven.cli.event.ExecutionEventLogger mojoStarted
INFO: 
Aug 28, 2013 5:32:35 PM org.apache.maven.cli.event.ExecutionEventLogger mojoStarted
INFO: --- maven-resources-plugin:2.5:resources (default-resources) @ ctakes-assertion ---
[debug] execute contextualize
[INFO] Using 'UTF-8' encoding to copy filtered resources.
[INFO] Copying 1 resource
[INFO] Copying 3 resources
Aug 28, 2013 5:32:35 PM org.apache.maven.cli.event.ExecutionEventLogger mojoStarted
INFO: 
Aug 28, 2013 5:32:35 PM org.apache.maven.cli.event.ExecutionEventLogger mojoStarted
INFO: --- jcasgen-maven-plugin:0.9.3:generate (default) @ ctakes-assertion ---
[INFO] JCasGen: Output going to '<https://builds.apache.org/job/ctakes-trunk-compiletest/ws/ctakes-assertion/target/generated-sources/jcasgen'>
[INFO] JCasGen: Reading the XML TAE descriptor, and creating types, for xml input file '<https://builds.apache.org/job/ctakes-trunk-compiletest/ws/ctakes-assertion/src/main/resources/org/apache/ctakes/assertion/types/TypeSystem.xml'.>
[INFO] JCasGen: Creating: 'org.apache.ctakes.assertion.medfacts.types.Assertion'.
[INFO] JCasGen: Creating: 'org.apache.ctakes.assertion.medfacts.types.Assertion_Type'.
[INFO] JCasGen: Creating: 'org.apache.ctakes.assertion.medfacts.types.Concept'.
[INFO] JCasGen: Creating: 'org.apache.ctakes.assertion.medfacts.types.Concept_Type'.
Aug 28, 2013 5:32:36 PM org.apache.maven.cli.event.ExecutionEventLogger mojoStarted
INFO: 
Aug 28, 2013 5:32:36 PM org.apache.maven.cli.event.ExecutionEventLogger mojoStarted
INFO: --- maven-compiler-plugin:2.4:compile (default-compile) @ ctakes-assertion ---
[INFO] Compiling 84 source files to <https://builds.apache.org/job/ctakes-trunk-compiletest/ws/ctakes-assertion/target/classes>
[INFO] -------------------------------------------------------------
[ERROR] COMPILATION ERROR : 
[INFO] -------------------------------------------------------------
[ERROR] <https://builds.apache.org/job/ctakes-trunk-compiletest/ws/ctakes-assertion/src/main/java/org/apache/ctakes/assertion/medfacts/cleartk/TrainAssertionModel.java>:[41,29]
[deprecation] org.cleartk.classifier.CleartkAnnotatorDescriptionFactory in org.cleartk.classifier
has been deprecated
[ERROR] <https://builds.apache.org/job/ctakes-trunk-compiletest/ws/ctakes-assertion/src/main/java/org/apache/ctakes/assertion/medfacts/cleartk/TrainAssertionModel.java>:[45,37]
[deprecation] org.cleartk.classifier.opennlp.DefaultMaxentDataWriterFactory in org.cleartk.classifier.opennlp
has been deprecated
[ERROR] <https://builds.apache.org/job/ctakes-trunk-compiletest/ws/ctakes-assertion/src/main/java/org/apache/ctakes/assertion/medfacts/cleartk/TrainAssertionModel.java>:[46,37]
[deprecation] org.cleartk.classifier.opennlp.MaxentDataWriter in org.cleartk.classifier.opennlp
has been deprecated
[ERROR] <https://builds.apache.org/job/ctakes-trunk-compiletest/ws/ctakes-assertion/src/main/java/org/apache/ctakes/assertion/medfacts/cleartk/SubjectCleartkAnalysisEngine.java>:[36,47]
[deprecation] org.cleartk.classifier.feature.extractor.ContextExtractor in org.cleartk.classifier.feature.extractor
has been deprecated
[ERROR] <https://builds.apache.org/job/ctakes-trunk-compiletest/ws/ctakes-assertion/src/main/java/org/apache/ctakes/assertion/medfacts/cleartk/CreateAssertionDescriptor.java>:[21,37]
[deprecation] org.cleartk.classifier.opennlp.DefaultMaxentDataWriterFactory in org.cleartk.classifier.opennlp
has been deprecated
[ERROR] <https://builds.apache.org/job/ctakes-trunk-compiletest/ws/ctakes-assertion/src/main/java/org/apache/ctakes/assertion/medfacts/cleartk/AssertionSampleFeatureGenerator.java>:[8,54]
[deprecation] org.cleartk.classifier.feature.extractor.simple.SpannedTextExtractor in org.cleartk.classifier.feature.extractor.simple
has been deprecated
[ERROR] <https://builds.apache.org/job/ctakes-trunk-compiletest/ws/ctakes-assertion/src/main/java/org/apache/ctakes/assertion/medfacts/cleartk/AssertionSampleFeatureGenerator.java>:[9,49]
[deprecation] org.cleartk.classifier.feature.proliferate.CapitalTypeProliferator in org.cleartk.classifier.feature.proliferate
has been deprecated
[ERROR] <https://builds.apache.org/job/ctakes-trunk-compiletest/ws/ctakes-assertion/src/main/java/org/apache/ctakes/assertion/medfacts/cleartk/AssertionSampleFeatureGenerator.java>:[10,49]
[deprecation] org.cleartk.classifier.feature.proliferate.CharacterNGramProliferator in org.cleartk.classifier.feature.proliferate
has been deprecated
[ERROR] <https://builds.apache.org/job/ctakes-trunk-compiletest/ws/ctakes-assertion/src/main/java/org/apache/ctakes/assertion/medfacts/cleartk/AssertionSampleFeatureGenerator.java>:[11,49]
[deprecation] org.cleartk.classifier.feature.proliferate.LowerCaseProliferator in org.cleartk.classifier.feature.proliferate
has been deprecated
[ERROR] <https://builds.apache.org/job/ctakes-trunk-compiletest/ws/ctakes-assertion/src/main/java/org/apache/ctakes/assertion/medfacts/cleartk/AssertionSampleFeatureGenerator.java>:[12,49]
[deprecation] org.cleartk.classifier.feature.proliferate.NumericTypeProliferator in org.cleartk.classifier.feature.proliferate
has been deprecated
[ERROR] <https://builds.apache.org/job/ctakes-trunk-compiletest/ws/ctakes-assertion/src/main/java/org/apache/ctakes/assertion/medfacts/cleartk/AssertionSampleFeatureGenerator.java>:[13,49]
[deprecation] org.cleartk.classifier.feature.proliferate.ProliferatingExtractor in org.cleartk.classifier.feature.proliferate
has been deprecated
[ERROR] <https://builds.apache.org/job/ctakes-trunk-compiletest/ws/ctakes-assertion/src/main/java/org/apache/ctakes/assertion/eval/AssertionEvaluation.java>:[370,55]
[unchecked] unchecked call to addAll(org.apache.ctakes.assertion.eval.AnnotationStatisticsCompact<OUTCOME_TYPE>)
as a member of the raw type org.apache.ctakes.assertion.eval.AnnotationStatisticsCompact
[ERROR] <https://builds.apache.org/job/ctakes-trunk-compiletest/ws/ctakes-assertion/src/main/java/org/apache/ctakes/assertion/eval/AssertionEvaluation.java>:[559,53]
readMiPACQ(java.io.File,java.io.File,java.io.File,java.io.File) in org.apache.ctakes.assertion.pipelines.GoldEntityAndAttributeReaderPipelineForSeedCorpus
cannot be applied to (java.io.File,java.io.File)
[ERROR] <https://builds.apache.org/job/ctakes-trunk-compiletest/ws/ctakes-assertion/src/main/java/org/apache/ctakes/assertion/eval/AssertionEvaluation.java>:[935,24]
[unchecked] unchecked call to <ANNOTATION_TYPE,SPAN_TYPE>add(java.util.Collection<?
extends ANNOTATION_TYPE>,java.util.Collection<? extends ANNOTATION_TYPE>,com.google.common.base.Function<ANNOTATION_TYPE,SPAN_TYPE>,com.google.common.base.Function<ANNOTATION_TYPE,OUTCOME_TYPE>)
as a member of the raw type org.apache.ctakes.assertion.eval.AnnotationStatisticsCompact
[ERROR] <https://builds.apache.org/job/ctakes-trunk-compiletest/ws/ctakes-assertion/src/main/java/org/apache/ctakes/assertion/eval/AssertionEvaluation.java>:[945,27]
[unchecked] unchecked call to <ANNOTATION_TYPE,SPAN_TYPE>add(java.util.Collection<?
extends ANNOTATION_TYPE>,java.util.Collection<? extends ANNOTATION_TYPE>,com.google.common.base.Function<ANNOTATION_TYPE,SPAN_TYPE>,com.google.common.base.Function<ANNOTATION_TYPE,OUTCOME_TYPE>)
as a member of the raw type org.apache.ctakes.assertion.eval.AnnotationStatisticsCompact
[ERROR] <https://builds.apache.org/job/ctakes-trunk-compiletest/ws/ctakes-assertion/src/main/java/org/apache/ctakes/assertion/eval/AssertionEvaluation.java>:[955,27]
[unchecked] unchecked call to <ANNOTATION_TYPE,SPAN_TYPE>add(java.util.Collection<?
extends ANNOTATION_TYPE>,java.util.Collection<? extends ANNOTATION_TYPE>,com.google.common.base.Function<ANNOTATION_TYPE,SPAN_TYPE>,com.google.common.base.Function<ANNOTATION_TYPE,OUTCOME_TYPE>)
as a member of the raw type org.apache.ctakes.assertion.eval.AnnotationStatisticsCompact
[ERROR] <https://builds.apache.org/job/ctakes-trunk-compiletest/ws/ctakes-assertion/src/main/java/org/apache/ctakes/assertion/eval/AssertionEvaluation.java>:[965,23]
[unchecked] unchecked call to <ANNOTATION_TYPE,SPAN_TYPE>add(java.util.Collection<?
extends ANNOTATION_TYPE>,java.util.Collection<? extends ANNOTATION_TYPE>,com.google.common.base.Function<ANNOTATION_TYPE,SPAN_TYPE>,com.google.common.base.Function<ANNOTATION_TYPE,OUTCOME_TYPE>)
as a member of the raw type org.apache.ctakes.assertion.eval.AnnotationStatisticsCompact
[ERROR] <https://builds.apache.org/job/ctakes-trunk-compiletest/ws/ctakes-assertion/src/main/java/org/apache/ctakes/assertion/eval/AssertionEvaluation.java>:[975,23]
[unchecked] unchecked call to <ANNOTATION_TYPE,SPAN_TYPE>add(java.util.Collection<?
extends ANNOTATION_TYPE>,java.util.Collection<? extends ANNOTATION_TYPE>,com.google.common.base.Function<ANNOTATION_TYPE,SPAN_TYPE>,com.google.common.base.Function<ANNOTATION_TYPE,OUTCOME_TYPE>)
as a member of the raw type org.apache.ctakes.assertion.eval.AnnotationStatisticsCompact
[ERROR] <https://builds.apache.org/job/ctakes-trunk-compiletest/ws/ctakes-assertion/src/main/java/org/apache/ctakes/assertion/eval/AssertionEvaluation.java>:[986,23]
[unchecked] unchecked call to <ANNOTATION_TYPE,SPAN_TYPE>add(java.util.Collection<?
extends ANNOTATION_TYPE>,java.util.Collection<? extends ANNOTATION_TYPE>,com.google.common.base.Function<ANNOTATION_TYPE,SPAN_TYPE>,com.google.common.base.Function<ANNOTATION_TYPE,OUTCOME_TYPE>)
as a member of the raw type org.apache.ctakes.assertion.eval.AnnotationStatisticsCompact
[ERROR] <https://builds.apache.org/job/ctakes-trunk-compiletest/ws/ctakes-assertion/src/main/java/org/apache/ctakes/assertion/eval/AssertionEvaluation.java>:[1054,24]
[unchecked] unchecked call to write(org.cleartk.classifier.Instance<OUTCOME_TYPE>) as
a member of the raw type org.cleartk.classifier.DataWriter
[ERROR] <https://builds.apache.org/job/ctakes-trunk-compiletest/ws/ctakes-assertion/src/main/java/org/apache/ctakes/assertion/medfacts/cleartk/extractors/TreeFragmentFeatureExtractor.java>:[59,41]
[deprecation] locateFile(java.lang.String) in org.apache.ctakes.core.resource.FileLocator
has been deprecated
[ERROR] <https://builds.apache.org/job/ctakes-trunk-compiletest/ws/ctakes-assertion/src/main/java/org/apache/ctakes/assertion/medfacts/cleartk/extractors/TreeFragmentFeatureExtractor.java>:[68,31]
[deprecation] locateFile(java.lang.String) in org.apache.ctakes.core.resource.FileLocator
has been deprecated
[ERROR] <https://builds.apache.org/job/ctakes-trunk-compiletest/ws/ctakes-assertion/src/main/java/org/apache/ctakes/assertion/medfacts/cleartk/TrainAssertionModel.java>:[291,72]
[deprecation] org.cleartk.classifier.opennlp.DefaultMaxentDataWriterFactory in org.cleartk.classifier.opennlp
has been deprecated
[ERROR] <https://builds.apache.org/job/ctakes-trunk-compiletest/ws/ctakes-assertion/src/main/java/org/apache/ctakes/assertion/medfacts/cleartk/extractors/ContextWordWindowExtractor.java>:[38,30]
[deprecation] locateFile(java.lang.String) in org.apache.ctakes.core.resource.FileLocator
has been deprecated
[ERROR] <https://builds.apache.org/job/ctakes-trunk-compiletest/ws/ctakes-assertion/src/main/java/org/apache/ctakes/assertion/cr/XmiCollectionReaderCtakes.java>:[81,18]
[unchecked] unchecked call to add(E) as a member of the raw type java.util.ArrayList
[ERROR] <https://builds.apache.org/job/ctakes-trunk-compiletest/ws/ctakes-assertion/src/main/java/org/apache/ctakes/assertion/medfacts/cleartk/AlternateCuePhraseAnnotator.java>:[42,25]
[deprecation] locateFile(java.lang.String) in org.apache.ctakes.core.resource.FileLocator
has been deprecated
[ERROR] <https://builds.apache.org/job/ctakes-trunk-compiletest/ws/ctakes-assertion/src/main/java/org/apache/ctakes/assertion/pipelines/RunJudgeAttributeInstances.java>:[90,35]
[unchecked] unchecked conversion
found   : java.util.List
required: java.util.List<java.io.File>
[ERROR] <https://builds.apache.org/job/ctakes-trunk-compiletest/ws/ctakes-assertion/src/main/java/org/apache/ctakes/assertion/medfacts/cleartk/CreateAssertionDescriptor.java>:[33,90]
[deprecation] org.cleartk.classifier.opennlp.DefaultMaxentDataWriterFactory in org.cleartk.classifier.opennlp
has been deprecated
[ERROR] <https://builds.apache.org/job/ctakes-trunk-compiletest/ws/ctakes-assertion/src/main/java/org/apache/ctakes/assertion/medfacts/CasIndexer.java>:[74,21]
[unchecked] unchecked cast
found   : org.apache.uima.jcas.tcas.Annotation
required: T
[ERROR] <https://builds.apache.org/job/ctakes-trunk-compiletest/ws/ctakes-assertion/src/main/java/org/apache/ctakes/assertion/pipelines/GenerateTreeRepresentation.java>:[86,41]
[deprecation] locateFile(java.lang.String) in org.apache.ctakes.core.resource.FileLocator
has been deprecated
[INFO] 30 errors 
[INFO] -------------------------------------------------------------
Aug 28, 2013 5:32:37 PM org.apache.maven.cli.event.ExecutionEventLogger logReactorSummary
INFO: ------------------------------------------------------------------------
Aug 28, 2013 5:32:37 PM org.apache.maven.cli.event.ExecutionEventLogger logReactorSummary
INFO: Reactor Summary:
Aug 28, 2013 5:32:37 PM org.apache.maven.cli.event.ExecutionEventLogger logReactorSummary
INFO: 
Aug 28, 2013 5:32:37 PM org.apache.maven.cli.event.ExecutionEventLogger logReactorSummary
INFO: Apache cTAKES ..................................... SUCCESS [13.561s]
Aug 28, 2013 5:32:37 PM org.apache.maven.cli.event.ExecutionEventLogger logReactorSummary
INFO: Apache cTAKES common type system .................. SUCCESS [14.409s]
Aug 28, 2013 5:32:37 PM org.apache.maven.cli.event.ExecutionEventLogger logReactorSummary
INFO: Apache cTAKES utils ............................... SUCCESS [7.577s]
Aug 28, 2013 5:32:37 PM org.apache.maven.cli.event.ExecutionEventLogger logReactorSummary
INFO: Apache cTAKES Resources core ...................... SUCCESS [3.675s]
Aug 28, 2013 5:32:37 PM org.apache.maven.cli.event.ExecutionEventLogger logReactorSummary
INFO: Apache cTAKES core ................................ SUCCESS [14.067s]
Aug 28, 2013 5:32:37 PM org.apache.maven.cli.event.ExecutionEventLogger logReactorSummary
INFO: Apache cTAKES Resources pos-tagger ................ SUCCESS [3.847s]
Aug 28, 2013 5:32:37 PM org.apache.maven.cli.event.ExecutionEventLogger logReactorSummary
INFO: Apache cTAKES part-of-speech tagger ............... SUCCESS [10.150s]
Aug 28, 2013 5:32:37 PM org.apache.maven.cli.event.ExecutionEventLogger logReactorSummary
INFO: Apache cTAKES Resources ctakes-chunker-res ........ SUCCESS [3.474s]
Aug 28, 2013 5:32:37 PM org.apache.maven.cli.event.ExecutionEventLogger logReactorSummary
INFO: Apache cTAKES chunker ............................. SUCCESS [11.849s]
Aug 28, 2013 5:32:37 PM org.apache.maven.cli.event.ExecutionEventLogger logReactorSummary
INFO: Apache cTAKES document preprocessor ............... SUCCESS [7.409s]
Aug 28, 2013 5:32:37 PM org.apache.maven.cli.event.ExecutionEventLogger logReactorSummary
INFO: Apache cTAKES Resources dictionary-lookup ......... SUCCESS [3.471s]
Aug 28, 2013 5:32:37 PM org.apache.maven.cli.event.ExecutionEventLogger logReactorSummary
INFO: Apache cTAKES dictionary lookup ................... SUCCESS [15.254s]
Aug 28, 2013 5:32:37 PM org.apache.maven.cli.event.ExecutionEventLogger logReactorSummary
INFO: Apache cTAKES context dependent tokenizer ......... SUCCESS [7.443s]
Aug 28, 2013 5:32:37 PM org.apache.maven.cli.event.ExecutionEventLogger logReactorSummary
INFO: Apache cTAKES Resources lvg ....................... SUCCESS [3.429s]
Aug 28, 2013 5:32:37 PM org.apache.maven.cli.event.ExecutionEventLogger logReactorSummary
INFO: Apache cTAKES LVG lexical tools ................... SUCCESS [8.455s]
Aug 28, 2013 5:32:37 PM org.apache.maven.cli.event.ExecutionEventLogger logReactorSummary
INFO: Apache cTAKES Resources ne-contexts ............... SUCCESS [4.361s]
Aug 28, 2013 5:32:37 PM org.apache.maven.cli.event.ExecutionEventLogger logReactorSummary
INFO: Apache cTAKES named entity contexts ............... SUCCESS [9.291s]
Aug 28, 2013 5:32:37 PM org.apache.maven.cli.event.ExecutionEventLogger logReactorSummary
INFO: Apache cTAKES Resources constituency-parser ....... SUCCESS [7.177s]
Aug 28, 2013 5:32:37 PM org.apache.maven.cli.event.ExecutionEventLogger logReactorSummary
INFO: Apache cTAKES Constituency Parser ................. SUCCESS [11.926s]
Aug 28, 2013 5:32:37 PM org.apache.maven.cli.event.ExecutionEventLogger logReactorSummary
INFO: Apache cTAKES Resources coreference ............... SUCCESS [8.147s]
Aug 28, 2013 5:32:37 PM org.apache.maven.cli.event.ExecutionEventLogger logReactorSummary
INFO: Apache cTAKES Resources relation-extractor ........ SUCCESS [4.032s]
Aug 28, 2013 5:32:37 PM org.apache.maven.cli.event.ExecutionEventLogger logReactorSummary
INFO: Apache cTAKES Resources dependency-parser ......... SUCCESS [5.483s]
Aug 28, 2013 5:32:37 PM org.apache.maven.cli.event.ExecutionEventLogger logReactorSummary
INFO: Apache cTAKES Dependency Parser ................... SUCCESS [35.616s]
Aug 28, 2013 5:32:37 PM org.apache.maven.cli.event.ExecutionEventLogger logReactorSummary
INFO: Apache cTAKES Relation Extractor .................. SUCCESS [13.398s]
Aug 28, 2013 5:32:37 PM org.apache.maven.cli.event.ExecutionEventLogger logReactorSummary
INFO: Apache cTAKES CoReference Resolver ................ SUCCESS [11.866s]
Aug 28, 2013 5:32:37 PM org.apache.maven.cli.event.ExecutionEventLogger logReactorSummary
INFO: Apache cTAKES Resources drug-ner .................. SUCCESS [12.820s]
Aug 28, 2013 5:32:37 PM org.apache.maven.cli.event.ExecutionEventLogger logReactorSummary
INFO: Apache cTAKES Drug NER ............................ SUCCESS [15.328s]
Aug 28, 2013 5:32:37 PM org.apache.maven.cli.event.ExecutionEventLogger logReactorSummary
INFO: Apache cTAKES Resources side-effect ............... SUCCESS [13.568s]
Aug 28, 2013 5:32:37 PM org.apache.maven.cli.event.ExecutionEventLogger logReactorSummary
INFO: Apache cTAKES Side Effects ........................ SUCCESS [14.568s]
Aug 28, 2013 5:32:37 PM org.apache.maven.cli.event.ExecutionEventLogger logReactorSummary
INFO: Apache cTAKES Resources smoking-status ............ SUCCESS [9.930s]
Aug 28, 2013 5:32:37 PM org.apache.maven.cli.event.ExecutionEventLogger logReactorSummary
INFO: Apache cTAKES Smoking Status ...................... SUCCESS [13.048s]
Aug 28, 2013 5:32:37 PM org.apache.maven.cli.event.ExecutionEventLogger logReactorSummary
INFO: Apache cTAKES Resources pad-term-spotter-res ...... SUCCESS [7.803s]
Aug 28, 2013 5:32:37 PM org.apache.maven.cli.event.ExecutionEventLogger logReactorSummary
INFO: Apache cTAKES Pad Term Spotter .................... SUCCESS [19.482s]
Aug 28, 2013 5:32:37 PM org.apache.maven.cli.event.ExecutionEventLogger logReactorSummary
INFO: Apache cTAKES Resources assertion ................. SUCCESS [6.276s]
Aug 28, 2013 5:32:37 PM org.apache.maven.cli.event.ExecutionEventLogger logReactorSummary
INFO: Apache cTAKES Resources assertion-zoner ........... SUCCESS [5.028s]
Aug 28, 2013 5:32:37 PM org.apache.maven.cli.event.ExecutionEventLogger logReactorSummary
INFO: Apache cTAKES Assertion's zoner ................... SUCCESS [7.659s]
Aug 28, 2013 5:32:37 PM org.apache.maven.cli.event.ExecutionEventLogger logReactorSummary
INFO: Apache cTAKES Assertion ........................... FAILURE [20.014s]
Aug 28, 2013 5:32:37 PM org.apache.maven.cli.event.ExecutionEventLogger logReactorSummary
INFO: Apache cTAKES Resources temporal .................. SKIPPED
Aug 28, 2013 5:32:37 PM org.apache.maven.cli.event.ExecutionEventLogger logReactorSummary
INFO: Apache cTAKES Temporal Information Extraction ..... SKIPPED
Aug 28, 2013 5:32:37 PM org.apache.maven.cli.event.ExecutionEventLogger logReactorSummary
INFO: Apache cTAKES ctakes-clinical-pipeline ............ SKIPPED
Aug 28, 2013 5:32:37 PM org.apache.maven.cli.event.ExecutionEventLogger logReactorSummary
INFO: Apache cTAKES Distribution ........................ SKIPPED
Aug 28, 2013 5:32:37 PM org.apache.maven.cli.event.ExecutionEventLogger logReactorSummary
INFO: Apache cTAKES Regression-test ..................... SKIPPED
Aug 28, 2013 5:32:37 PM org.apache.maven.cli.event.ExecutionEventLogger logReactorSummary
INFO: Apache cTAKES template filler ..................... SKIPPED
Aug 28, 2013 5:32:37 PM org.apache.maven.cli.event.ExecutionEventLogger logReactorSummary
INFO: ctakes-examples ................................... SKIPPED
Aug 28, 2013 5:32:37 PM org.apache.maven.cli.event.ExecutionEventLogger logResult
INFO: ------------------------------------------------------------------------
Aug 28, 2013 5:32:37 PM org.apache.maven.cli.event.ExecutionEventLogger logResult
INFO: BUILD FAILURE
Aug 28, 2013 5:32:37 PM org.apache.maven.cli.event.ExecutionEventLogger logStats
INFO: ------------------------------------------------------------------------
Aug 28, 2013 5:32:37 PM org.apache.maven.cli.event.ExecutionEventLogger logStats
INFO: Total time: 6:44.464s
Aug 28, 2013 5:32:37 PM org.apache.maven.cli.event.ExecutionEventLogger logStats
INFO: Finished at: Wed Aug 28 17:32:37 UTC 2013
Aug 28, 2013 5:32:38 PM org.apache.maven.cli.event.ExecutionEventLogger logStats
INFO: Final Memory: 37M/135M
Aug 28, 2013 5:32:38 PM org.apache.maven.cli.event.ExecutionEventLogger sessionEnded
INFO: ------------------------------------------------------------------------
[JENKINS] Archiving disabled
[JENKINS] Archiving disabled
[JENKINS] Archiving disabled
[JENKINS] Archiving disabled
[JENKINS] Archiving disabled
[JENKINS] Archiving disabled
[JENKINS] Archiving disabled
[JENKINS] Archiving disabled
[JENKINS] Archiving disabled
[JENKINS] Archiving disabled
[JENKINS] Archiving disabled
[JENKINS] Archiving disabled
[JENKINS] Archiving disabled
[JENKINS] Archiving disabled
[JENKINS] Archiving disabled
[JENKINS] Archiving disabled
[JENKINS] Archiving disabled
[JENKINS] Archiving disabled
[JENKINS] Archiving disabled
[JENKINS] Archiving disabled
[JENKINS] Archiving disabled
[JENKINS] Archiving disabled
[JENKINS] Archiving disabled
[JENKINS] Archiving disabled
[JENKINS] Archiving disabled
[JENKINS] Archiving disabled
[JENKINS] Archiving disabled
[JENKINS] Archiving disabled
[JENKINS] Archiving disabled
[JENKINS] Archiving disabled
[JENKINS] Archiving disabled
[JENKINS] Archiving disabled
[JENKINS] Archiving disabled
[JENKINS] Archiving disabled
[JENKINS] Archiving disabled
[JENKINS] Archiving disabled
[JENKINS] Archiving disabled
[JENKINS] Archiving disabled
[JENKINS] Archiving disabled
[JENKINS] Archiving disabled
[JENKINS] Archiving disabled
[JENKINS] Archiving disabled
[JENKINS] Archiving disabled
[JENKINS] Archiving disabled
Waiting for Jenkins to finish collecting data
Sending e-mails to: notifications@ctakes.apache.org wu.stephen@mayo.edu
channel stopped

Mime
View raw message